ace-commits mailing list archives

Site index · List index
Message view « Date » · « Thread »
Top « Date » · « Thread »
From ma...@apache.org
Subject svn commit: r1357570 [13/34] - in /ace/sandbox/marrs: cnf/ cnf/ext/ cnf/lib/ cnf/releaserepo/ cnf/repo/ cnf/repo/.obrcache/ cnf/repo/.obrcache/http%3A%2F%2Fbundles.bndtools.org.s3.amazonaws.com%2Fcom.jcraft.jsch/ cnf/repo/.obrcache/http%3A%2F%2Fbundles...
Date Thu, 05 Jul 2012 12:10:06 GMT
Added: ace/sandbox/marrs/org.apache.ace.client.repository.helper.configuration/test-output/Failed
suite [Default suite]/Default test(failed).html
URL: http://svn.apache.org/viewvc/ace/sandbox/marrs/org.apache.ace.client.repository.helper.configuration/test-output/Failed%20suite%20%5BDefault%20suite%5D/Default%20test%28failed%29.html?rev=1357570&view=auto
==============================================================================
--- ace/sandbox/marrs/org.apache.ace.client.repository.helper.configuration/test-output/Failed
suite [Default suite]/Default test(failed).html (added)
+++ ace/sandbox/marrs/org.apache.ace.client.repository.helper.configuration/test-output/Failed
suite [Default suite]/Default test(failed).html Thu Jul  5 12:09:30 2012
@@ -0,0 +1,139 @@
+<html>
+<head>
+<title>TestNG:  Default test(failed)</title>
+<link href="../testng.css" rel="stylesheet" type="text/css" />
+<link href="../my-testng.css" rel="stylesheet" type="text/css" />
+
+<style type="text/css">
+.log { display: none;} 
+.stack-trace { display: none;} 
+</style>
+<script type="text/javascript">
+<!--
+function flip(e) {
+  current = e.style.display;
+  if (current == 'block') {
+    e.style.display = 'none';
+    return 0;
+  }
+  else {
+    e.style.display = 'block';
+    return 1;
+  }
+}
+
+function toggleBox(szDivId, elem, msg1, msg2)
+{
+  var res = -1;  if (document.getElementById) {
+    res = flip(document.getElementById(szDivId));
+  }
+  else if (document.all) {
+    // this is the way old msie versions work
+    res = flip(document.all[szDivId]);
+  }
+  if(elem) {
+    if(res == 0) elem.innerHTML = msg1; else elem.innerHTML = msg2;
+  }
+
+}
+
+function toggleAllBoxes() {
+  if (document.getElementsByTagName) {
+    d = document.getElementsByTagName('div');
+    for (i = 0; i < d.length; i++) {
+      if (d[i].className == 'log') {
+        flip(d[i]);
+      }
+    }
+  }
+}
+
+// -->
+</script>
+
+</head>
+<body>
+<h2 align='center'>Default test(failed)</h2><table border='1' align="center">
+<tr>
+<td>Tests passed/Failed/Skipped:</td><td>3/1/0</td>
+</tr><tr>
+<td>Started on:</td><td>Wed Jul 04 11:32:26 CEST 2012</td>
+</tr>
+<tr><td>Total time:</td><td>0 seconds (42 ms)</td>
+</tr><tr>
+<td>Included groups:</td><td></td>
+</tr><tr>
+<td>Excluded groups:</td><td></td>
+</tr>
+</table><p/>
+<small><i>(Hover the method name to see the test class name)</i></small><p/>
+<table width='100%' border='1' class='invocation-failed'>
+<tr><td colspan='4' align='center'><b>FAILED TESTS</b></td></tr>
+<tr><td><b>Test method</b></td>
+<td width="30%"><b>Exception</b></td>
+<td width="10%"><b>Time (seconds)</b></td>
+<td><b>Instance</b></td>
+</tr>
+<tr>
+<td title='org.apache.ace.client.repository.helper.configuration.impl.ConfigurationHelperImplTest.testCanHandleCommentBeforeRoot()'><b>testCanHandleCommentBeforeRoot</b><br>Test
class: org.apache.ace.client.repository.helper.configuration.impl.ConfigurationHelperImplTest</td>
+<td><div><pre>java.lang.AssertionError: expected object to not be null
+	at org.apache.ace.client.repository.helper.configuration.impl.ConfigurationHelperImplTest.testCanHandleCommentBeforeRoot(ConfigurationHelperImplTest.java:67)
+... Removed 27 stack frames</pre></div><a href='#' onClick='toggleBox("stack-trace939355114",
this, "Click to show all stack frames", "Click to hide stack frames")'>Click to show all
stack frames</a>
+<div class='stack-trace' id='stack-trace939355114'><pre>java.lang.AssertionError:
expected object to not be null
+	at org.testng.Assert.fail(Assert.java:89)
+	at org.testng.Assert.assertNotNull(Assert.java:399)
+	at org.testng.Assert.assertNotNull(Assert.java:384)
+	at org.apache.ace.client.repository.helper.configuration.impl.ConfigurationHelperImplTest.testCanHandleCommentBeforeRoot(ConfigurationHelperImplTest.java:67)
+	at sun.reflect.NativeMethodAccessorImpl.invoke0(Native Method)
+	at sun.reflect.NativeMethodAccessorImpl.invoke(NativeMethodAccessorImpl.java:39)
+	at sun.reflect.DelegatingMethodAccessorImpl.invoke(DelegatingMethodAccessorImpl.java:25)
+	at java.lang.reflect.Method.invoke(Method.java:597)
+	at org.testng.internal.MethodInvocationHelper.invokeMethod(MethodInvocationHelper.java:80)
+	at org.testng.internal.Invoker.invokeMethod(Invoker.java:702)
+	at org.testng.internal.Invoker.invokeTestMethod(Invoker.java:894)
+	at org.testng.internal.Invoker.invokeTestMethods(Invoker.java:1219)
+	at org.testng.internal.TestMethodWorker.invokeTestMethods(TestMethodWorker.java:127)
+	at org.testng.internal.TestMethodWorker.run(TestMethodWorker.java:111)
+	at org.testng.TestRunner.privateRun(TestRunner.java:767)
+	at org.testng.TestRunner.run(TestRunner.java:617)
+	at org.testng.SuiteRunner.runTest(SuiteRunner.java:334)
+	at org.testng.SuiteRunner.runSequentially(SuiteRunner.java:329)
+	at org.testng.SuiteRunner.privateRun(SuiteRunner.java:291)
+	at org.testng.SuiteRunner.run(SuiteRunner.java:240)
+	at org.testng.SuiteRunnerWorker.runSuite(SuiteRunnerWorker.java:53)
+	at org.testng.SuiteRunnerWorker.run(SuiteRunnerWorker.java:87)
+	at org.testng.TestNG.runSuitesSequentially(TestNG.java:1192)
+	at org.testng.TestNG.runSuitesLocally(TestNG.java:1117)
+	at org.testng.TestNG.run(TestNG.java:1025)
+	at org.testng.remote.RemoteTestNG.run(RemoteTestNG.java:109)
+	at org.testng.remote.RemoteTestNG.initAndRun(RemoteTestNG.java:202)
+	at org.testng.remote.RemoteTestNG.main(RemoteTestNG.java:173)
+</pre></div></td>
+<td>0</td>
+<td>org.apache.ace.client.repository.helper.configuration.impl.ConfigurationHelperImplTest@e49d67c</td></tr>
+</table><p>
+<table width='100%' border='1' class='invocation-passed'>
+<tr><td colspan='4' align='center'><b>PASSED TESTS</b></td></tr>
+<tr><td><b>Test method</b></td>
+<td width="30%"><b>Exception</b></td>
+<td width="10%"><b>Time (seconds)</b></td>
+<td><b>Instance</b></td>
+</tr>
+<tr>
+<td title='org.apache.ace.client.repository.helper.configuration.impl.ConfigurationHelperImplTest.testNamespace10Recognized()'><b>testNamespace10Recognized</b><br>Test
class: org.apache.ace.client.repository.helper.configuration.impl.ConfigurationHelperImplTest</td>
+<td></td>
+<td>0</td>
+<td>org.apache.ace.client.repository.helper.configuration.impl.ConfigurationHelperImplTest@e49d67c</td></tr>
+<tr>
+<td title='org.apache.ace.client.repository.helper.configuration.impl.ConfigurationHelperImplTest.testNamespace11Recognized()'><b>testNamespace11Recognized</b><br>Test
class: org.apache.ace.client.repository.helper.configuration.impl.ConfigurationHelperImplTest</td>
+<td></td>
+<td>0</td>
+<td>org.apache.ace.client.repository.helper.configuration.impl.ConfigurationHelperImplTest@e49d67c</td></tr>
+<tr>
+<td title='org.apache.ace.client.repository.helper.configuration.impl.ConfigurationHelperImplTest.testNamespace12Recognized()'><b>testNamespace12Recognized</b><br>Test
class: org.apache.ace.client.repository.helper.configuration.impl.ConfigurationHelperImplTest</td>
+<td></td>
+<td>0</td>
+<td>org.apache.ace.client.repository.helper.configuration.impl.ConfigurationHelperImplTest@e49d67c</td></tr>
+</table><p>
+</body>
+</html>
\ No newline at end of file

Added: ace/sandbox/marrs/org.apache.ace.client.repository.helper.configuration/test-output/Failed
suite [Default suite]/Default test(failed).xml
URL: http://svn.apache.org/viewvc/ace/sandbox/marrs/org.apache.ace.client.repository.helper.configuration/test-output/Failed%20suite%20%5BDefault%20suite%5D/Default%20test%28failed%29.xml?rev=1357570&view=auto
==============================================================================
--- ace/sandbox/marrs/org.apache.ace.client.repository.helper.configuration/test-output/Failed
suite [Default suite]/Default test(failed).xml (added)
+++ ace/sandbox/marrs/org.apache.ace.client.repository.helper.configuration/test-output/Failed
suite [Default suite]/Default test(failed).xml Thu Jul  5 12:09:30 2012
@@ -0,0 +1,14 @@
+<?xml version="1.0" encoding="UTF-8"?>
+<!-- Generated by org.testng.reporters.JUnitXMLReporter -->
+<testsuite hostname="Marcels-MacBook-Pro.local" name="Default test(failed)" tests="4"
failures="1" timestamp="4 Jul 2012 09:32:26 GMT" time="0.042" errors="0">
+  <testcase name="testNamespace10Recognized" time="0.018" classname="org.apache.ace.client.repository.helper.configuration.impl.ConfigurationHelperImplTest"/>
+  <testcase name="testNamespace12Recognized" time="0.0030" classname="org.apache.ace.client.repository.helper.configuration.impl.ConfigurationHelperImplTest"/>
+  <testcase name="testNamespace11Recognized" time="0.0030" classname="org.apache.ace.client.repository.helper.configuration.impl.ConfigurationHelperImplTest"/>
+  <testcase name="testCanHandleCommentBeforeRoot" time="0.0020" classname="org.apache.ace.client.repository.helper.configuration.impl.ConfigurationHelperImplTest">
+    <failure type="java.lang.AssertionError" message="expected object to not be null">
+      <![CDATA[java.lang.AssertionError: expected object to not be null
+	at org.apache.ace.client.repository.helper.configuration.impl.ConfigurationHelperImplTest.testCanHandleCommentBeforeRoot(ConfigurationHelperImplTest.java:67)
+... Removed 27 stack frames]]>
+    </failure>
+  </testcase> <!-- testCanHandleCommentBeforeRoot -->
+</testsuite> <!-- Default test(failed) -->

Added: ace/sandbox/marrs/org.apache.ace.client.repository.helper.configuration/test-output/Failed
suite [Default suite]/testng-failed.xml
URL: http://svn.apache.org/viewvc/ace/sandbox/marrs/org.apache.ace.client.repository.helper.configuration/test-output/Failed%20suite%20%5BDefault%20suite%5D/testng-failed.xml?rev=1357570&view=auto
==============================================================================
--- ace/sandbox/marrs/org.apache.ace.client.repository.helper.configuration/test-output/Failed
suite [Default suite]/testng-failed.xml (added)
+++ ace/sandbox/marrs/org.apache.ace.client.repository.helper.configuration/test-output/Failed
suite [Default suite]/testng-failed.xml Thu Jul  5 12:09:30 2012
@@ -0,0 +1,13 @@
+<?xml version="1.0" encoding="UTF-8"?>
+<!DOCTYPE suite SYSTEM "http://testng.org/testng-1.0.dtd">
+<suite name="Failed suite [Failed suite [Default suite]]">
+  <test name="Default test(failed)(failed)" preserve-order="true">
+    <classes>
+      <class name="org.apache.ace.client.repository.helper.configuration.impl.ConfigurationHelperImplTest">
+        <methods>
+          <include name="testCanHandleCommentBeforeRoot"/>
+        </methods>
+      </class> <!-- org.apache.ace.client.repository.helper.configuration.impl.ConfigurationHelperImplTest
-->
+    </classes>
+  </test> <!-- Default test(failed)(failed) -->
+</suite> <!-- Failed suite [Failed suite [Default suite]] -->

Added: ace/sandbox/marrs/org.apache.ace.client.repository.helper.configuration/test-output/bullet_point.png
URL: http://svn.apache.org/viewvc/ace/sandbox/marrs/org.apache.ace.client.repository.helper.configuration/test-output/bullet_point.png?rev=1357570&view=auto
==============================================================================
Binary file - no diff available.

Propchange: ace/sandbox/marrs/org.apache.ace.client.repository.helper.configuration/test-output/bullet_point.png
------------------------------------------------------------------------------
    svn:mime-type = application/octet-stream

Added: ace/sandbox/marrs/org.apache.ace.client.repository.helper.configuration/test-output/collapseall.gif
URL: http://svn.apache.org/viewvc/ace/sandbox/marrs/org.apache.ace.client.repository.helper.configuration/test-output/collapseall.gif?rev=1357570&view=auto
==============================================================================
Binary file - no diff available.

Propchange: ace/sandbox/marrs/org.apache.ace.client.repository.helper.configuration/test-output/collapseall.gif
------------------------------------------------------------------------------
    svn:mime-type = application/octet-stream

Added: ace/sandbox/marrs/org.apache.ace.client.repository.helper.configuration/test-output/emailable-report.html
URL: http://svn.apache.org/viewvc/ace/sandbox/marrs/org.apache.ace.client.repository.helper.configuration/test-output/emailable-report.html?rev=1357570&view=auto
==============================================================================
--- ace/sandbox/marrs/org.apache.ace.client.repository.helper.configuration/test-output/emailable-report.html
(added)
+++ ace/sandbox/marrs/org.apache.ace.client.repository.helper.configuration/test-output/emailable-report.html
Thu Jul  5 12:09:30 2012
@@ -0,0 +1,51 @@
+<!DOCTYPE html PUBLIC "-//W3C//DTD XHTML 1.1//EN http://www.w3.org/TR/xhtml11/DTD/xhtml11.dtd">
+<html xmlns="http://www.w3.org/1999/xhtml">
+<head>
+<title>TestNG:  Unit Test</title>
+<style type="text/css">
+table caption,table.info_table,table.param,table.passed,table.failed {margin-bottom:10px;border:1px
solid #000099;border-collapse:collapse;empty-cells:show;}
+table.info_table td,table.info_table th,table.param td,table.param th,table.passed td,table.passed
th,table.failed td,table.failed th {
+border:1px solid #000099;padding:.25em .5em .25em .5em
+}
+table.param th {vertical-align:bottom}
+td.numi,th.numi,td.numi_attn {
+text-align:right
+}
+tr.total td {font-weight:bold}
+table caption {
+text-align:center;font-weight:bold;
+}
+table.passed tr.stripe td,table tr.passedodd td {background-color: #00AA00;}
+table.passed td,table tr.passedeven td {background-color: #33FF33;}
+table.passed tr.stripe td,table tr.skippedodd td {background-color: #cccccc;}
+table.passed td,table tr.skippedodd td {background-color: #dddddd;}
+table.failed tr.stripe td,table tr.failedodd td,table.param td.numi_attn {background-color:
#FF3333;}
+table.failed td,table tr.failedeven td,table.param tr.stripe td.numi_attn {background-color:
#DD0000;}
+tr.stripe td,tr.stripe th {background-color: #E6EBF9;}
+p.totop {font-size:85%;text-align:center;border-bottom:2px black solid}
+div.shootout {padding:2em;border:3px #4854A8 solid}
+</style>
+</head>
+<body>
+<table cellspacing=0 cellpadding=0 class="param">
+<tr><th>Test</th><th class="numi">Methods<br/>Passed</th><th
class="numi">Scenarios<br/>Passed</th><th class="numi"># skipped</th><th
class="numi"># failed</th><th class="numi">Total<br/>Time</th><th
class="numi">Included<br/>Groups</th><th class="numi">Excluded<br/>Groups</th></tr>
+<tr><td style="text-align:left;padding-right:2em">Default test</td><td
class="numi">5</td><td class="numi">5</td><td class="numi">0</td><td
class="numi">0</td><td class="numi">0.0 seconds</td><td class="numi"></td><td
class="numi"></td></tr>
+</table>
+<a id="summary"></a>
+<table cellspacing=0 cellpadding=0 class="passed">
+<tr><th>Class</th><th>Method</th><th># of<br/>Scenarios</th><th>Start</th><th>Time<br/>(ms)</th></tr>
+<tr><th colspan="4">Default test &#8212; passed</th></tr>
+<tr class="passedodd"><td rowspan="5">org.apache.ace.client.repository.helper.configuration.impl.ConfigurationHelperImplTest<td><a
href="#m1"><b>testCanHandleCommentBeforeRoot</b> (unit) </a></td><td
class="numi">1</td><td>1341394666138</td><td class="numi">17</td></tr><tr
class="passedodd"><td><a href="#m2"><b>testNamespace10Recognized</b>
(unit) </a></td><td class="numi">1</td><td>1341394666156</td><td
class="numi">4</td></tr><tr class="passedodd"><td><a href="#m3"><b>testNamespace11Recognized</b>
(unit) </a></td><td class="numi">1</td><td>1341394666161</td><td
class="numi">3</td></tr><tr class="passedodd"><td><a href="#m4"><b>testNamespace12Recognized</b>
(unit) </a></td><td class="numi">1</td><td>1341394666165</td><td
class="numi">3</td></tr><tr class="passedodd"><td><a href="#m5"><b>testNamespace13NotRecognized</b>
(unit) </a></td><td class="numi">1</td><td>1341394666169</td><td
class="numi">3</td></tr>
+</table>
+<h1>Default test</h1>
+<a id="m1"></a><h2>org.apache.ace.client.repository.helper.configuration.impl.ConfigurationHelperImplTest:testNamespace10Recognized</h2>
+<p class="totop"><a href="#summary">back to summary</a></p>
+<a id="m2"></a><h2>org.apache.ace.client.repository.helper.configuration.impl.ConfigurationHelperImplTest:testNamespace11Recognized</h2>
+<p class="totop"><a href="#summary">back to summary</a></p>
+<a id="m3"></a><h2>org.apache.ace.client.repository.helper.configuration.impl.ConfigurationHelperImplTest:testNamespace12Recognized</h2>
+<p class="totop"><a href="#summary">back to summary</a></p>
+<a id="m4"></a><h2>org.apache.ace.client.repository.helper.configuration.impl.ConfigurationHelperImplTest:testCanHandleCommentBeforeRoot</h2>
+<p class="totop"><a href="#summary">back to summary</a></p>
+<a id="m5"></a><h2>org.apache.ace.client.repository.helper.configuration.impl.ConfigurationHelperImplTest:testNamespace13NotRecognized</h2>
+<p class="totop"><a href="#summary">back to summary</a></p>
+</body></html>

Added: ace/sandbox/marrs/org.apache.ace.client.repository.helper.configuration/test-output/failed.png
URL: http://svn.apache.org/viewvc/ace/sandbox/marrs/org.apache.ace.client.repository.helper.configuration/test-output/failed.png?rev=1357570&view=auto
==============================================================================
Binary file - no diff available.

Propchange: ace/sandbox/marrs/org.apache.ace.client.repository.helper.configuration/test-output/failed.png
------------------------------------------------------------------------------
    svn:mime-type = application/octet-stream

Added: ace/sandbox/marrs/org.apache.ace.client.repository.helper.configuration/test-output/index.html
URL: http://svn.apache.org/viewvc/ace/sandbox/marrs/org.apache.ace.client.repository.helper.configuration/test-output/index.html?rev=1357570&view=auto
==============================================================================
--- ace/sandbox/marrs/org.apache.ace.client.repository.helper.configuration/test-output/index.html
(added)
+++ ace/sandbox/marrs/org.apache.ace.client.repository.helper.configuration/test-output/index.html
Thu Jul  5 12:09:30 2012
@@ -0,0 +1,335 @@
+<!DOCTYPE html>
+
+<html>
+  <head>
+  <title>TestNG new reports</title>
+
+    <link type="text/css" href="testng-reports.css" rel="stylesheet" />  
+    <script type="text/javascript" src="jquery-1.7.1.min.js"></script>
+    <script type="text/javascript" src="testng-reports.js"></script>
+    <script type="text/javascript" src="https://www.google.com/jsapi"></script>
+    <script type='text/javascript'>
+      google.load('visualization', '1', {packages:['table']});
+      google.setOnLoadCallback(drawTable);
+      var suiteTableInitFunctions = new Array();
+      var suiteTableData = new Array();
+    </script>
+    <!--
+      <script type="text/javascript" src="jquery-ui/js/jquery-ui-1.8.16.custom.min.js"></script>
+     -->
+  </head>
+
+  <body>
+    <div class="top-banner-root">
+      <span class="top-banner-title-font">Test results</span>
+      <br/>
+      <span class="top-banner-font-1">1 suite</span>
+    </div> <!-- top-banner-root -->
+    <div class="navigator-root">
+      <div class="navigator-suite-header">
+        <span>All suites</span>
+        <a href="#" class="collapse-all-link" title="Collapse/expand all the suites">
+          <img class="collapse-all-icon" src="collapseall.gif">
+          </img> <!-- collapse-all-icon -->
+        </a> <!-- collapse-all-link -->
+      </div> <!-- navigator-suite-header -->
+      <div class="suite">
+        <div class="rounded-window">
+          <div class="suite-header light-rounded-window-top">
+            <a href="#" class="navigator-link" panel-name="suite-Default_suite">
+              <span class="suite-name border-passed">Default suite</span>
+            </a> <!-- navigator-link -->
+          </div> <!-- suite-header light-rounded-window-top -->
+          <div class="navigator-suite-content">
+            <div class="suite-section-title">
+              <span>Info</span>
+            </div> <!-- suite-section-title -->
+            <div class="suite-section-content">
+              <ul>
+                <li>
+                  <a href="#" class="navigator-link " panel-name="test-xml-Default_suite">
+                    <span>testng-customsuite.xml</span>
+                  </a> <!-- navigator-link  -->
+                </li>
+                <li>
+                  <a href="#" class="navigator-link " panel-name="testlist-Default_suite">
+                    <span class="test-stats">1 test</span>
+                  </a> <!-- navigator-link  -->
+                </li>
+                <li>
+                  <a href="#" class="navigator-link " panel-name="group-Default_suite">
+                    <span>1 group</span>
+                  </a> <!-- navigator-link  -->
+                </li>
+                <li>
+                  <a href="#" class="navigator-link " panel-name="times-Default_suite">
+                    <span>Times</span>
+                  </a> <!-- navigator-link  -->
+                </li>
+                <li>
+                  <a href="#" class="navigator-link " panel-name="reporter-Default_suite">
+                    <span>Reporter output</span>
+                  </a> <!-- navigator-link  -->
+                </li>
+                <li>
+                  <a href="#" class="navigator-link " panel-name="ignored-methods-Default_suite">
+                    <span>Ignored methods</span>
+                  </a> <!-- navigator-link  -->
+                </li>
+                <li>
+                  <a href="#" class="navigator-link " panel-name="chronological-Default_suite">
+                    <span>Chronological view</span>
+                  </a> <!-- navigator-link  -->
+                </li>
+              </ul>
+            </div> <!-- suite-section-content -->
+            <div class="result-section">
+              <div class="suite-section-title">
+                <span>Results</span>
+              </div> <!-- suite-section-title -->
+              <div class="suite-section-content">
+                <ul>
+                  <li>
+                    <span class="method-stats">5 methods,   5 passed</span>
+                  </li>
+                  <li>
+                    <span class="method-list-title passed">Passed methods</span>
+                    <span class="show-or-hide-methods passed">
+                      <a href="#" panel-name="suite-Default_suite" class="hide-methods
passed suite-Default_suite"> (hide)</a> <!-- hide-methods passed suite-Default_suite
-->
+                      <a href="#" panel-name="suite-Default_suite" class="show-methods
passed suite-Default_suite"> (show)</a> <!-- show-methods passed suite-Default_suite
-->
+                    </span>
+                    <div class="method-list-content passed suite-Default_suite">
+                      <span>
+                        <img width="3%" src="passed.png"/>
+                        <a href="#" class="method navigator-link" panel-name="suite-Default_suite"
title="org.apache.ace.client.repository.helper.configuration.impl.ConfigurationHelperImplTest"
hash-for-method="testCanHandleCommentBeforeRoot">testCanHandleCommentBeforeRoot</a>
<!-- method navigator-link -->
+                      </span>
+                      <br/>
+                      <span>
+                        <img width="3%" src="passed.png"/>
+                        <a href="#" class="method navigator-link" panel-name="suite-Default_suite"
title="org.apache.ace.client.repository.helper.configuration.impl.ConfigurationHelperImplTest"
hash-for-method="testNamespace10Recognized">testNamespace10Recognized</a> <!--
method navigator-link -->
+                      </span>
+                      <br/>
+                      <span>
+                        <img width="3%" src="passed.png"/>
+                        <a href="#" class="method navigator-link" panel-name="suite-Default_suite"
title="org.apache.ace.client.repository.helper.configuration.impl.ConfigurationHelperImplTest"
hash-for-method="testNamespace11Recognized">testNamespace11Recognized</a> <!--
method navigator-link -->
+                      </span>
+                      <br/>
+                      <span>
+                        <img width="3%" src="passed.png"/>
+                        <a href="#" class="method navigator-link" panel-name="suite-Default_suite"
title="org.apache.ace.client.repository.helper.configuration.impl.ConfigurationHelperImplTest"
hash-for-method="testNamespace12Recognized">testNamespace12Recognized</a> <!--
method navigator-link -->
+                      </span>
+                      <br/>
+                      <span>
+                        <img width="3%" src="passed.png"/>
+                        <a href="#" class="method navigator-link" panel-name="suite-Default_suite"
title="org.apache.ace.client.repository.helper.configuration.impl.ConfigurationHelperImplTest"
hash-for-method="testNamespace13NotRecognized">testNamespace13NotRecognized</a> <!--
method navigator-link -->
+                      </span>
+                      <br/>
+                    </div> <!-- method-list-content passed suite-Default_suite -->
+                  </li>
+                </ul>
+              </div> <!-- suite-section-content -->
+            </div> <!-- result-section -->
+          </div> <!-- navigator-suite-content -->
+        </div> <!-- rounded-window -->
+      </div> <!-- suite -->
+    </div> <!-- navigator-root -->
+    <div class="wrapper">
+      <div class="main-panel-root">
+        <div panel-name="suite-Default_suite" class="panel Default_suite">
+          <div class="suite-Default_suite-class-passed">
+            <div class="main-panel-header rounded-window-top">
+              <img src="passed.png"/>
+              <span class="class-name">org.apache.ace.client.repository.helper.configuration.impl.ConfigurationHelperImplTest</span>
+            </div> <!-- main-panel-header rounded-window-top -->
+            <div class="main-panel-content rounded-window-bottom">
+              <div class="method">
+                <div class="method-content">
+                  <a name="testCanHandleCommentBeforeRoot">
+                  </a> <!-- testCanHandleCommentBeforeRoot -->
+                  <span class="method-name">testCanHandleCommentBeforeRoot</span>
+                </div> <!-- method-content -->
+              </div> <!-- method -->
+              <div class="method">
+                <div class="method-content">
+                  <a name="testNamespace10Recognized">
+                  </a> <!-- testNamespace10Recognized -->
+                  <span class="method-name">testNamespace10Recognized</span>
+                </div> <!-- method-content -->
+              </div> <!-- method -->
+              <div class="method">
+                <div class="method-content">
+                  <a name="testNamespace11Recognized">
+                  </a> <!-- testNamespace11Recognized -->
+                  <span class="method-name">testNamespace11Recognized</span>
+                </div> <!-- method-content -->
+              </div> <!-- method -->
+              <div class="method">
+                <div class="method-content">
+                  <a name="testNamespace12Recognized">
+                  </a> <!-- testNamespace12Recognized -->
+                  <span class="method-name">testNamespace12Recognized</span>
+                </div> <!-- method-content -->
+              </div> <!-- method -->
+              <div class="method">
+                <div class="method-content">
+                  <a name="testNamespace13NotRecognized">
+                  </a> <!-- testNamespace13NotRecognized -->
+                  <span class="method-name">testNamespace13NotRecognized</span>
+                </div> <!-- method-content -->
+              </div> <!-- method -->
+            </div> <!-- main-panel-content rounded-window-bottom -->
+          </div> <!-- suite-Default_suite-class-passed -->
+        </div> <!-- panel Default_suite -->
+        <div panel-name="test-xml-Default_suite" class="panel">
+          <div class="main-panel-header rounded-window-top">
+            <span class="header-content">/private/var/folders/4k/58plh09n605ffjkhv0kpcx540000gn/T/testng-eclipse--119820991/testng-customsuite.xml</span>
+          </div> <!-- main-panel-header rounded-window-top -->
+          <div class="main-panel-content rounded-window-bottom">
+            <pre>
+&lt;?xml version=&quot;1.0&quot; encoding=&quot;UTF-8&quot;?&gt;
+&lt;!DOCTYPE suite SYSTEM &quot;http://testng.org/testng-1.0.dtd&quot;&gt;
+&lt;suite name=&quot;Default suite&quot;&gt;
+  &lt;test verbose=&quot;2&quot; name=&quot;Default test&quot; preserve-order=&quot;true&quot;&gt;
+    &lt;classes&gt;
+      &lt;class name=&quot;org.apache.ace.client.repository.helper.configuration.impl.ConfigurationHelperImplTest&quot;/&gt;
+    &lt;/classes&gt;
+  &lt;/test&gt; &lt;!-- Default test --&gt;
+&lt;/suite&gt; &lt;!-- Default suite --&gt;
+            </pre>
+          </div> <!-- main-panel-content rounded-window-bottom -->
+        </div> <!-- panel -->
+        <div panel-name="testlist-Default_suite" class="panel">
+          <div class="main-panel-header rounded-window-top">
+            <span class="header-content">Tests for Default suite</span>
+          </div> <!-- main-panel-header rounded-window-top -->
+          <div class="main-panel-content rounded-window-bottom">
+            <ul>
+              <li>
+                <span class="test-name">Default test (1 class)</span>
+              </li>
+            </ul>
+          </div> <!-- main-panel-content rounded-window-bottom -->
+        </div> <!-- panel -->
+        <div panel-name="group-Default_suite" class="panel">
+          <div class="main-panel-header rounded-window-top">
+            <span class="header-content">Groups for Default suite</span>
+          </div> <!-- main-panel-header rounded-window-top -->
+          <div class="main-panel-content rounded-window-bottom">
+            <div class="test-group">
+              <span class="test-group-name">unit</span>
+              <br/>
+              <div class="method-in-group">
+                <span class="method-in-group-name">testCanHandleCommentBeforeRoot</span>
+                <br/>
+              </div> <!-- method-in-group -->
+              <div class="method-in-group">
+                <span class="method-in-group-name">testNamespace10Recognized</span>
+                <br/>
+              </div> <!-- method-in-group -->
+              <div class="method-in-group">
+                <span class="method-in-group-name">testNamespace11Recognized</span>
+                <br/>
+              </div> <!-- method-in-group -->
+              <div class="method-in-group">
+                <span class="method-in-group-name">testNamespace12Recognized</span>
+                <br/>
+              </div> <!-- method-in-group -->
+              <div class="method-in-group">
+                <span class="method-in-group-name">testNamespace13NotRecognized</span>
+                <br/>
+              </div> <!-- method-in-group -->
+            </div> <!-- test-group -->
+          </div> <!-- main-panel-content rounded-window-bottom -->
+        </div> <!-- panel -->
+        <div panel-name="times-Default_suite" class="panel">
+          <div class="main-panel-header rounded-window-top">
+            <span class="header-content">Times for Default suite</span>
+          </div> <!-- main-panel-header rounded-window-top -->
+          <div class="main-panel-content rounded-window-bottom">
+            <div class="times-div">
+              <script type="text/javascript">
+suiteTableInitFunctions.push('tableData_Default_suite');
+function tableData_Default_suite() {
+var data = new google.visualization.DataTable();
+data.addColumn('number', 'Number');
+data.addColumn('string', 'Method');
+data.addColumn('string', 'Class');
+data.addColumn('number', 'Time (ms)');
+data.addRows(5);
+data.setCell(0, 0, 0)
+data.setCell(0, 1, 'testCanHandleCommentBeforeRoot')
+data.setCell(0, 2, 'org.apache.ace.client.repository.helper.configuration.impl.ConfigurationHelperImplTest')
+data.setCell(0, 3, 17);
+data.setCell(1, 0, 1)
+data.setCell(1, 1, 'testNamespace10Recognized')
+data.setCell(1, 2, 'org.apache.ace.client.repository.helper.configuration.impl.ConfigurationHelperImplTest')
+data.setCell(1, 3, 4);
+data.setCell(2, 0, 2)
+data.setCell(2, 1, 'testNamespace11Recognized')
+data.setCell(2, 2, 'org.apache.ace.client.repository.helper.configuration.impl.ConfigurationHelperImplTest')
+data.setCell(2, 3, 3);
+data.setCell(3, 0, 3)
+data.setCell(3, 1, 'testNamespace12Recognized')
+data.setCell(3, 2, 'org.apache.ace.client.repository.helper.configuration.impl.ConfigurationHelperImplTest')
+data.setCell(3, 3, 3);
+data.setCell(4, 0, 4)
+data.setCell(4, 1, 'testNamespace13NotRecognized')
+data.setCell(4, 2, 'org.apache.ace.client.repository.helper.configuration.impl.ConfigurationHelperImplTest')
+data.setCell(4, 3, 3);
+window.suiteTableData['Default_suite']= { tableData: data, tableDiv: 'times-div-Default_suite'}
+return data;
+}
+              </script>
+              <span class="suite-total-time">Total running time: 30 ms</span>
+              <div id="times-div-Default_suite">
+              </div> <!-- times-div-Default_suite -->
+            </div> <!-- times-div -->
+          </div> <!-- main-panel-content rounded-window-bottom -->
+        </div> <!-- panel -->
+        <div panel-name="reporter-Default_suite" class="panel">
+          <div class="main-panel-header rounded-window-top">
+            <span class="header-content">Reporter output for Default suite</span>
+          </div> <!-- main-panel-header rounded-window-top -->
+          <div class="main-panel-content rounded-window-bottom">
+          </div> <!-- main-panel-content rounded-window-bottom -->
+        </div> <!-- panel -->
+        <div panel-name="ignored-methods-Default_suite" class="panel">
+          <div class="main-panel-header rounded-window-top">
+            <span class="header-content">0 ignored methods</span>
+          </div> <!-- main-panel-header rounded-window-top -->
+          <div class="main-panel-content rounded-window-bottom">
+          </div> <!-- main-panel-content rounded-window-bottom -->
+        </div> <!-- panel -->
+        <div panel-name="chronological-Default_suite" class="panel">
+          <div class="main-panel-header rounded-window-top">
+            <span class="header-content">Methods in chronological order</span>
+          </div> <!-- main-panel-header rounded-window-top -->
+          <div class="main-panel-content rounded-window-bottom">
+            <div class="chronological-class">
+              <div class="chronological-class-name">org.apache.ace.client.repository.helper.configuration.impl.ConfigurationHelperImplTest</div>
<!-- chronological-class-name -->
+              <div class="test-method">
+                <span class="method-name">testCanHandleCommentBeforeRoot</span>
+                <span class="method-start">0 ms</span>
+              </div> <!-- test-method -->
+              <div class="test-method">
+                <span class="method-name">testNamespace10Recognized</span>
+                <span class="method-start">18 ms</span>
+              </div> <!-- test-method -->
+              <div class="test-method">
+                <span class="method-name">testNamespace11Recognized</span>
+                <span class="method-start">23 ms</span>
+              </div> <!-- test-method -->
+              <div class="test-method">
+                <span class="method-name">testNamespace12Recognized</span>
+                <span class="method-start">27 ms</span>
+              </div> <!-- test-method -->
+              <div class="test-method">
+                <span class="method-name">testNamespace13NotRecognized</span>
+                <span class="method-start">31 ms</span>
+              </div> <!-- test-method -->
+          </div> <!-- main-panel-content rounded-window-bottom -->
+        </div> <!-- panel -->
+      </div> <!-- main-panel-root -->
+    </div> <!-- wrapper -->
+  </body>
+</html>



Mime
View raw message