accumulo-user mailing list archives

Site index · List index
Message view « Date » · « Thread »
Top « Date » · « Thread »
From "Newman, Elise" <enew...@integrity-apps.com>
Subject RE: Accumulo and CDH4
Date Wed, 03 Apr 2013 15:36:16 GMT
Thanks Billie - issue solved.


From: Billie Rinaldi [mailto:billie@apache.org]
Sent: Tuesday, April 02, 2013 5:26 PM
To: user@accumulo.apache.org
Subject: Re: Accumulo and CDH4

Elise,

I've tried checking in a fix to the ShellTest for trunk.  Please check out a fresh copy or
update your copy and see if it solves the issue.

Billie

On Tue, Apr 2, 2013 at 12:56 PM, Billie Rinaldi <billie@apache.org<mailto:billie@apache.org>>
wrote:
This looks like one of the same issues we found in ACCUMULO-1118.  I lost track of what was
happening with the fixes / reverts / etc. for that ticket.  John?  Anyone?

Billie


On Tue, Apr 2, 2013 at 12:33 PM, Newman, Elise <enewman@integrity-apps.com<mailto:enewman@integrity-apps.com>>
wrote:
Sorry, thought I had included this.

-------------------------------------------------------------------------------
Test set: org.apache.accumulo.core.util.shell.ShellTest
-------------------------------------------------------------------------------

Tests run: 9, Failures: 0, Errors: 8, Skipped: 0, Time elapsed: 0.032 sec <<< FAILURE!
duPatternTest(org.apache.accumulo.core.util.shell.ShellTest)  Time elapsed: 0.017 sec  <<<
ERROR!
java.lang.NullPointerException
    at org.apache.accumulo.core.util.shell.Shell.getDefaultPrompt(Shell.java:527)
    at org.apache.accumulo.core.util.shell.Shell.execCommand(Shell.java:532)
    at org.apache.accumulo.core.util.shell.ShellTest.exec(ShellTest.java:61)
    at org.apache.accumulo.core.util.shell.ShellTest.exec(ShellTest.java:65)
    at org.apache.accumulo.core.util.shell.ShellTest.duPatternTest(ShellTest.java:191)

    at sun.reflect.NativeMethodAccessorImpl.invoke0(Native Method)
    at sun.reflect.NativeMethodAccessorImpl.invoke(NativeMethodAccessorImpl.java:39)
    at sun.reflect.DelegatingMethodAccessorImpl.invoke(DelegatingMethodAccessorImpl.java:25)
    at java.lang.reflect.Method.invoke(Method.java:597)
    at org.junit.runners.model.FrameworkMethod$1.runReflectiveCall(FrameworkMethod.java:47)
    at org.junit.internal.runners.model.ReflectiveCallable.run(ReflectiveCallable.java:12)
    at org.junit.runners.model.FrameworkMethod.invokeExplosively(FrameworkMethod.java:44)
    at org.junit.internal.runners.statements.InvokeMethod.evaluate(InvokeMethod.java:17)
    at org.junit.internal.runners.statements.RunBefores.evaluate(RunBefores.java:26)
    at org.junit.runners.ParentRunner.runLeaf(ParentRunner.java:271)
    at org.junit.runners.BlockJUnit4ClassRunner.runChild(BlockJUnit4ClassRunner.java:70)
    at org.junit.runners.BlockJUnit4ClassRunner.runChild(BlockJUnit4ClassRunner.java:50)
    at org.junit.runners.ParentRunner$3.run(ParentRunner.java:238)
    at org.junit.runners.ParentRunner$1.schedule(ParentRunner.java:63)
    at org.junit.runners.ParentRunner.runChildren(ParentRunner.java:236)
    at org.junit.runners.ParentRunner.access$000(ParentRunner.java:53)
    at org.junit.runners.ParentRunner$2.evaluate(ParentRunner.java:229)
    at org.junit.runners.ParentRunner.run(ParentRunner.java:309)
    at org.apache.maven.surefire.junit4.JUnit4Provider.execute(JUnit4Provider.java:236)
    at org.apache.maven.surefire.junit4.JUnit4Provider.executeTestSet(JUnit4Provider.java:134)
    at org.apache.maven.surefire.junit4.JUnit4Provider.invoke(JUnit4Provider.java:113)

    at sun.reflect.NativeMethodAccessorImpl.invoke0(Native Method)
    at sun.reflect.NativeMethodAccessorImpl.invoke(NativeMethodAccessorImpl.java:39)
    at sun.reflect.DelegatingMethodAccessorImpl.invoke(DelegatingMethodAccessorImpl.java:25)
    at java.lang.reflect.Method.invoke(Method.java:597)
    at org.apache.maven.surefire.util.ReflectionUtils.invokeMethodWithArray(ReflectionUtils.java:189)
    at org.apache.maven.surefire.booter.ProviderFactory$ProviderProxy.invoke(ProviderFactory.java:165)
    at org.apache.maven.surefire.booter.ProviderFactory.invokeProvider(ProviderFactory.java:85)
    at org.apache.maven.surefire.booter.ForkedBooter.runSuitesInProcess(ForkedBooter.java:103)
    at org.apache.maven.surefire.booter.ForkedBooter.main(ForkedBooter.java:74)
aboutTest(org.apache.accumulo.core.util.shell.ShellTest)  Time elapsed: 0 sec  <<<
ERROR!
java.lang.NullPointerException
    at org.apache.accumulo.core.util.shell.Shell.getDefaultPrompt(Shell.java:527)
    at org.apache.accumulo.core.util.shell.Shell.execCommand(Shell.java:532)
    at org.apache.accumulo.core.util.shell.ShellTest.exec(ShellTest.java:61)
    at org.apache.accumulo.core.util.shell.ShellTest.exec(ShellTest.java:77)
    at org.apache.accumulo.core.util.shell.ShellTest.exec(ShellTest.java:73)
    at org.apache.accumulo.core.util.shell.ShellTest.aboutTest(ShellTest.java:111)

    at sun.reflect.NativeMethodAccessorImpl.invoke0(Native Method)
    at sun.reflect.NativeMethodAccessorImpl.invoke(NativeMethodAccessorImpl.java:39)
    at sun.reflect.DelegatingMethodAccessorImpl.invoke(DelegatingMethodAccessorImpl.java:25)
    at java.lang.reflect.Method.invoke(Method.java:597)
    at org.junit.runners.model.FrameworkMethod$1.runReflectiveCall(FrameworkMethod.java:47)
    at org.junit.internal.runners.model.ReflectiveCallable.run(ReflectiveCallable.java:12)
    at org.junit.runners.model.FrameworkMethod.invokeExplosively(FrameworkMethod.java:44)
    at org.junit.internal.runners.statements.InvokeMethod.evaluate(InvokeMethod.java:17)
    at org.junit.internal.runners.statements.RunBefores.evaluate(RunBefores.java:26)
    at org.junit.runners.ParentRunner.runLeaf(ParentRunner.java:271)
    at org.junit.runners.BlockJUnit4ClassRunner.runChild(BlockJUnit4ClassRunner.java:70)
    at org.junit.runners.BlockJUnit4ClassRunner.runChild(BlockJUnit4ClassRunner.java:50)
    at org.junit.runners.ParentRunner$3.run(ParentRunner.java:238)
    at org.junit.runners.ParentRunner$1.schedule(ParentRunner.java:63)
    at org.junit.runners.ParentRunner.runChildren(ParentRunner.java:236)
    at org.junit.runners.ParentRunner.access$000(ParentRunner.java:53)
    at org.junit.runners.ParentRunner$2.evaluate(ParentRunner.java:229)
    at org.junit.runners.ParentRunner.run(ParentRunner.java:309)
    at org.apache.maven.surefire.junit4.JUnit4Provider.execute(JUnit4Provider.java:236)
    at org.apache.maven.surefire.junit4.JUnit4Provider.executeTestSet(JUnit4Provider.java:134)
    at org.apache.maven.surefire.junit4.JUnit4Provider.invoke(JUnit4Provider.java:113)

    at sun.reflect.NativeMethodAccessorImpl.invoke0(Native Method)
    at sun.reflect.NativeMethodAccessorImpl.invoke(NativeMethodAccessorImpl.java:39)
    at sun.reflect.DelegatingMethodAccessorImpl.invoke(DelegatingMethodAccessorImpl.java:25)
    at java.lang.reflect.Method.invoke(Method.java:597)
    at org.apache.maven.surefire.util.ReflectionUtils.invokeMethodWithArray(ReflectionUtils.java:189)
    at org.apache.maven.surefire.booter.ProviderFactory$ProviderProxy.invoke(ProviderFactory.java:165)
    at org.apache.maven.surefire.booter.ProviderFactory.invokeProvider(ProviderFactory.java:85)
    at org.apache.maven.surefire.booter.ForkedBooter.runSuitesInProcess(ForkedBooter.java:103)
    at org.apache.maven.surefire.booter.ForkedBooter.main(ForkedBooter.java:74)
duTest(org.apache.accumulo.core.util.shell.ShellTest)  Time elapsed: 0.001 sec  <<<
ERROR!
java.lang.NullPointerException
    at org.apache.accumulo.core.util.shell.Shell.getDefaultPrompt(Shell.java:527)
    at org.apache.accumulo.core.util.shell.Shell.execCommand(Shell.java:532)
    at org.apache.accumulo.core.util.shell.ShellTest.exec(ShellTest.java:61)
    at org.apache.accumulo.core.util.shell.ShellTest.exec(ShellTest.java:65)
    at org.apache.accumulo.core.util.shell.ShellTest.duTest(ShellTest.java:183)

    at sun.reflect.NativeMethodAccessorImpl.invoke0(Native Method)
    at sun.reflect.NativeMethodAccessorImpl.invoke(NativeMethodAccessorImpl.java:39)
    at sun.reflect.DelegatingMethodAccessorImpl.invoke(DelegatingMethodAccessorImpl.java:25)
    at java.lang.reflect.Method.invoke(Method.java:597)
    at org.junit.runners.model.FrameworkMethod$1.runReflectiveCall(FrameworkMethod.java:47)
    at org.junit.internal.runners.model.ReflectiveCallable.run(ReflectiveCallable.java:12)
    at org.junit.runners.model.FrameworkMethod.invokeExplosively(FrameworkMethod.java:44)
    at org.junit.internal.runners.statements.InvokeMethod.evaluate(InvokeMethod.java:17)
    at org.junit.internal.runners.statements.RunBefores.evaluate(RunBefores.java:26)
    at org.junit.runners.ParentRunner.runLeaf(ParentRunner.java:271)
    at org.junit.runners.BlockJUnit4ClassRunner.runChild(BlockJUnit4ClassRunner.java:70)
    at org.junit.runners.BlockJUnit4ClassRunner.runChild(BlockJUnit4ClassRunner.java:50)
    at org.junit.runners.ParentRunner$3.run(ParentRunner.java:238)
    at org.junit.runners.ParentRunner$1.schedule(ParentRunner.java:63)
    at org.junit.runners.ParentRunner.runChildren(ParentRunner.java:236)
    at org.junit.runners.ParentRunner.access$000(ParentRunner.java:53)
    at org.junit.runners.ParentRunner$2.evaluate(ParentRunner.java:229)
    at org.junit.runners.ParentRunner.run(ParentRunner.java:309)
    at org.apache.maven.surefire.junit4.JUnit4Provider.execute(JUnit4Provider.java:236)
    at org.apache.maven.surefire.junit4.JUnit4Provider.executeTestSet(JUnit4Provider.java:134)
    at org.apache.maven.surefire.junit4.JUnit4Provider.invoke(JUnit4Provider.java:113)

    at sun.reflect.NativeMethodAccessorImpl.invoke0(Native Method)
    at sun.reflect.NativeMethodAccessorImpl.invoke(NativeMethodAccessorImpl.java:39)
    at sun.reflect.DelegatingMethodAccessorImpl.invoke(DelegatingMethodAccessorImpl.java:25)
    at java.lang.reflect.Method.invoke(Method.java:597)
    at org.apache.maven.surefire.util.ReflectionUtils.invokeMethodWithArray(ReflectionUtils.java:189)
    at org.apache.maven.surefire.booter.ProviderFactory$ProviderProxy.invoke(ProviderFactory.java:165)
    at org.apache.maven.surefire.booter.ProviderFactory.invokeProvider(ProviderFactory.java:85)
    at org.apache.maven.surefire.booter.ForkedBooter.runSuitesInProcess(ForkedBooter.java:103)
    at org.apache.maven.surefire.booter.ForkedBooter.main(ForkedBooter.java:74)
insertDeleteScanTest(org.apache.accumulo.core.util.shell.ShellTest)  Time elapsed: 0.001 sec
 <<< ERROR!
java.lang.NullPointerException
    at org.apache.accumulo.core.util.shell.Shell.getDefaultPrompt(Shell.java:527)
    at org.apache.accumulo.core.util.shell.Shell.execCommand(Shell.java:532)
    at org.apache.accumulo.core.util.shell.ShellTest.exec(ShellTest.java:61)
    at org.apache.accumulo.core.util.shell.ShellTest.exec(ShellTest.java:77)
    at org.apache.accumulo.core.util.shell.ShellTest.exec(ShellTest.java:73)
    at org.apache.accumulo.core.util.shell.ShellTest.insertDeleteScanTest(ShellTest.java:129)

    at sun.reflect.NativeMethodAccessorImpl.invoke0(Native Method)
    at sun.reflect.NativeMethodAccessorImpl.invoke(NativeMethodAccessorImpl.java:39)
    at sun.reflect.DelegatingMethodAccessorImpl.invoke(DelegatingMethodAccessorImpl.java:25)
    at java.lang.reflect.Method.invoke(Method.java:597)
    at org.junit.runners.model.FrameworkMethod$1.runReflectiveCall(FrameworkMethod.java:47)
    at org.junit.internal.runners.model.ReflectiveCallable.run(ReflectiveCallable.java:12)
    at org.junit.runners.model.FrameworkMethod.invokeExplosively(FrameworkMethod.java:44)
    at org.junit.internal.runners.statements.InvokeMethod.evaluate(InvokeMethod.java:17)
    at org.junit.internal.runners.statements.RunBefores.evaluate(RunBefores.java:26)
    at org.junit.runners.ParentRunner.runLeaf(ParentRunner.java:271)
    at org.junit.runners.BlockJUnit4ClassRunner.runChild(BlockJUnit4ClassRunner.java:70)
    at org.junit.runners.BlockJUnit4ClassRunner.runChild(BlockJUnit4ClassRunner.java:50)
    at org.junit.runners.ParentRunner$3.run(ParentRunner.java:238)
    at org.junit.runners.ParentRunner$1.schedule(ParentRunner.java:63)
    at org.junit.runners.ParentRunner.runChildren(ParentRunner.java:236)
    at org.junit.runners.ParentRunner.access$000(ParentRunner.java:53)
    at org.junit.runners.ParentRunner$2.evaluate(ParentRunner.java:229)
    at org.junit.runners.ParentRunner.run(ParentRunner.java:309)
    at org.apache.maven.surefire.junit4.JUnit4Provider.execute(JUnit4Provider.java:236)
    at org.apache.maven.surefire.junit4.JUnit4Provider.executeTestSet(JUnit4Provider.java:134)
    at org.apache.maven.surefire.junit4.JUnit4Provider.invoke(JUnit4Provider.java:113)

    at sun.reflect.NativeMethodAccessorImpl.invoke0(Native Method)
    at sun.reflect.NativeMethodAccessorImpl.invoke(NativeMethodAccessorImpl.java:39)
    at sun.reflect.DelegatingMethodAccessorImpl.invoke(DelegatingMethodAccessorImpl.java:25)
    at java.lang.reflect.Method.invoke(Method.java:597)
    at org.apache.maven.surefire.util.ReflectionUtils.invokeMethodWithArray(ReflectionUtils.java:189)
    at org.apache.maven.surefire.booter.ProviderFactory$ProviderProxy.invoke(ProviderFactory.java:165)
    at org.apache.maven.surefire.booter.ProviderFactory.invokeProvider(ProviderFactory.java:85)
    at org.apache.maven.surefire.booter.ForkedBooter.runSuitesInProcess(ForkedBooter.java:103)
    at org.apache.maven.surefire.booter.ForkedBooter.main(ForkedBooter.java:74)
addGetSplitsTest(org.apache.accumulo.core.util.shell.ShellTest)  Time elapsed: 0.002 sec 
<<< ERROR!
java.lang.NullPointerException
    at org.apache.accumulo.core.util.shell.Shell.getDefaultPrompt(Shell.java:527)
    at org.apache.accumulo.core.util.shell.Shell.execCommand(Shell.java:532)
    at org.apache.accumulo.core.util.shell.ShellTest.exec(ShellTest.java:61)
    at org.apache.accumulo.core.util.shell.ShellTest.exec(ShellTest.java:77)
    at org.apache.accumulo.core.util.shell.ShellTest.exec(ShellTest.java:73)
    at org.apache.accumulo.core.util.shell.ShellTest.addGetSplitsTest(ShellTest.java:119)

    at sun.reflect.NativeMethodAccessorImpl.invoke0(Native Method)
    at sun.reflect.NativeMethodAccessorImpl.invoke(NativeMethodAccessorImpl.java:39)
    at sun.reflect.DelegatingMethodAccessorImpl.invoke(DelegatingMethodAccessorImpl.java:25)
    at java.lang.reflect.Method.invoke(Method.java:597)
    at org.junit.runners.model.FrameworkMethod$1.runReflectiveCall(FrameworkMethod.java:47)
    at org.junit.internal.runners.model.ReflectiveCallable.run(ReflectiveCallable.java:12)
    at org.junit.runners.model.FrameworkMethod.invokeExplosively(FrameworkMethod.java:44)
    at org.junit.internal.runners.statements.InvokeMethod.evaluate(InvokeMethod.java:17)
    at org.junit.internal.runners.statements.RunBefores.evaluate(RunBefores.java:26)
    at org.junit.runners.ParentRunner.runLeaf(ParentRunner.java:271)
    at org.junit.runners.BlockJUnit4ClassRunner.runChild(BlockJUnit4ClassRunner.java:70)
    at org.junit.runners.BlockJUnit4ClassRunner.runChild(BlockJUnit4ClassRunner.java:50)
    at org.junit.runners.ParentRunner$3.run(ParentRunner.java:238)
    at org.junit.runners.ParentRunner$1.schedule(ParentRunner.java:63)
    at org.junit.runners.ParentRunner.runChildren(ParentRunner.java:236)
    at org.junit.runners.ParentRunner.access$000(ParentRunner.java:53)
    at org.junit.runners.ParentRunner$2.evaluate(ParentRunner.java:229)
    at org.junit.runners.ParentRunner.run(ParentRunner.java:309)
    at org.apache.maven.surefire.junit4.JUnit4Provider.execute(JUnit4Provider.java:236)
    at org.apache.maven.surefire.junit4.JUnit4Provider.executeTestSet(JUnit4Provider.java:134)
    at org.apache.maven.surefire.junit4.JUnit4Provider.invoke(JUnit4Provider.java:113)

    at sun.reflect.NativeMethodAccessorImpl.invoke0(Native Method)
    at sun.reflect.NativeMethodAccessorImpl.invoke(NativeMethodAccessorImpl.java:39)
    at sun.reflect.DelegatingMethodAccessorImpl.invoke(DelegatingMethodAccessorImpl.java:25)
    at java.lang.reflect.Method.invoke(Method.java:597)
    at org.apache.maven.surefire.util.ReflectionUtils.invokeMethodWithArray(ReflectionUtils.java:189)
    at org.apache.maven.surefire.booter.ProviderFactory$ProviderProxy.invoke(ProviderFactory.java:165)
    at org.apache.maven.surefire.booter.ProviderFactory.invokeProvider(ProviderFactory.java:85)
    at org.apache.maven.surefire.booter.ForkedBooter.runSuitesInProcess(ForkedBooter.java:103)
    at org.apache.maven.surefire.booter.ForkedBooter.main(ForkedBooter.java:74)
duContextTest(org.apache.accumulo.core.util.shell.ShellTest)  Time elapsed: 0.001 sec  <<<
ERROR!
java.lang.NullPointerException
    at org.apache.accumulo.core.util.shell.Shell.getDefaultPrompt(Shell.java:527)
    at org.apache.accumulo.core.util.shell.Shell.execCommand(Shell.java:532)
    at org.apache.accumulo.core.util.shell.ShellTest.exec(ShellTest.java:61)
    at org.apache.accumulo.core.util.shell.ShellTest.exec(ShellTest.java:65)
    at org.apache.accumulo.core.util.shell.ShellTest.duContextTest(ShellTest.java:175)

    at sun.reflect.NativeMethodAccessorImpl.invoke0(Native Method)
    at sun.reflect.NativeMethodAccessorImpl.invoke(NativeMethodAccessorImpl.java:39)
    at sun.reflect.DelegatingMethodAccessorImpl.invoke(DelegatingMethodAccessorImpl.java:25)
    at java.lang.reflect.Method.invoke(Method.java:597)
    at org.junit.runners.model.FrameworkMethod$1.runReflectiveCall(FrameworkMethod.java:47)
    at org.junit.internal.runners.model.ReflectiveCallable.run(ReflectiveCallable.java:12)
    at org.junit.runners.model.FrameworkMethod.invokeExplosively(FrameworkMethod.java:44)
    at org.junit.internal.runners.statements.InvokeMethod.evaluate(InvokeMethod.java:17)
    at org.junit.internal.runners.statements.RunBefores.evaluate(RunBefores.java:26)
    at org.junit.runners.ParentRunner.runLeaf(ParentRunner.java:271)
    at org.junit.runners.BlockJUnit4ClassRunner.runChild(BlockJUnit4ClassRunner.java:70)
    at org.junit.runners.BlockJUnit4ClassRunner.runChild(BlockJUnit4ClassRunner.java:50)
    at org.junit.runners.ParentRunner$3.run(ParentRunner.java:238)
    at org.junit.runners.ParentRunner$1.schedule(ParentRunner.java:63)
    at org.junit.runners.ParentRunner.runChildren(ParentRunner.java:236)
    at org.junit.runners.ParentRunner.access$000(ParentRunner.java:53)
    at org.junit.runners.ParentRunner$2.evaluate(ParentRunner.java:229)
    at org.junit.runners.ParentRunner.run(ParentRunner.java:309)
    at org.apache.maven.surefire.junit4.JUnit4Provider.execute(JUnit4Provider.java:236)
    at org.apache.maven.surefire.junit4.JUnit4Provider.executeTestSet(JUnit4Provider.java:134)
    at org.apache.maven.surefire.junit4.JUnit4Provider.invoke(JUnit4Provider.java:113)

    at sun.reflect.NativeMethodAccessorImpl.invoke0(Native Method)
    at sun.reflect.NativeMethodAccessorImpl.invoke(NativeMethodAccessorImpl.java:39)
    at sun.reflect.DelegatingMethodAccessorImpl.invoke(DelegatingMethodAccessorImpl.java:25)
    at java.lang.reflect.Method.invoke(Method.java:597)
    at org.apache.maven.surefire.util.ReflectionUtils.invokeMethodWithArray(ReflectionUtils.java:189)
    at org.apache.maven.surefire.booter.ProviderFactory$ProviderProxy.invoke(ProviderFactory.java:165)
    at org.apache.maven.surefire.booter.ProviderFactory.invokeProvider(ProviderFactory.java:85)
    at org.apache.maven.surefire.booter.ForkedBooter.runSuitesInProcess(ForkedBooter.java:103)
    at org.apache.maven.surefire.booter.ForkedBooter.main(ForkedBooter.java:74)
scanDateStringFormatterTest(org.apache.accumulo.core.util.shell.ShellTest)  Time elapsed:
0.001 sec  <<< ERROR!
java.lang.NullPointerException
    at org.apache.accumulo.core.util.shell.Shell.getDefaultPrompt(Shell.java:527)
    at org.apache.accumulo.core.util.shell.Shell.execCommand(Shell.java:532)
    at org.apache.accumulo.core.util.shell.ShellTest.exec(ShellTest.java:61)
    at org.apache.accumulo.core.util.shell.ShellTest.exec(ShellTest.java:65)
    at org.apache.accumulo.core.util.shell.ShellTest.scanDateStringFormatterTest(ShellTest.java:201)

    at sun.reflect.NativeMethodAccessorImpl.invoke0(Native Method)
    at sun.reflect.NativeMethodAccessorImpl.invoke(NativeMethodAccessorImpl.java:39)
    at sun.reflect.DelegatingMethodAccessorImpl.invoke(DelegatingMethodAccessorImpl.java:25)
    at java.lang.reflect.Method.invoke(Method.java:597)
    at org.junit.runners.model.FrameworkMethod$1.runReflectiveCall(FrameworkMethod.java:47)
    at org.junit.internal.runners.model.ReflectiveCallable.run(ReflectiveCallable.java:12)
    at org.junit.runners.model.FrameworkMethod.invokeExplosively(FrameworkMethod.java:44)
    at org.junit.internal.runners.statements.InvokeMethod.evaluate(InvokeMethod.java:17)
    at org.junit.internal.runners.statements.RunBefores.evaluate(RunBefores.java:26)
    at org.junit.runners.ParentRunner.runLeaf(ParentRunner.java:271)
    at org.junit.runners.BlockJUnit4ClassRunner.runChild(BlockJUnit4ClassRunner.java:70)
    at org.junit.runners.BlockJUnit4ClassRunner.runChild(BlockJUnit4ClassRunner.java:50)
    at org.junit.runners.ParentRunner$3.run(ParentRunner.java:238)
    at org.junit.runners.ParentRunner$1.schedule(ParentRunner.java:63)
    at org.junit.runners.ParentRunner.runChildren(ParentRunner.java:236)
    at org.junit.runners.ParentRunner.access$000(ParentRunner.java:53)
    at org.junit.runners.ParentRunner$2.evaluate(ParentRunner.java:229)
    at org.junit.runners.ParentRunner.run(ParentRunner.java:309)
    at org.apache.maven.surefire.junit4.JUnit4Provider.execute(JUnit4Provider.java:236)
    at org.apache.maven.surefire.junit4.JUnit4Provider.executeTestSet(JUnit4Provider.java:134)
    at org.apache.maven.surefire.junit4.JUnit4Provider.invoke(JUnit4Provider.java:113)

    at sun.reflect.NativeMethodAccessorImpl.invoke0(Native Method)
    at sun.reflect.NativeMethodAccessorImpl.invoke(NativeMethodAccessorImpl.java:39)
    at sun.reflect.DelegatingMethodAccessorImpl.invoke(DelegatingMethodAccessorImpl.java:25)
    at java.lang.reflect.Method.invoke(Method.java:597)
    at org.apache.maven.surefire.util.ReflectionUtils.invokeMethodWithArray(ReflectionUtils.java:189)
    at org.apache.maven.surefire.booter.ProviderFactory$ProviderProxy.invoke(ProviderFactory.java:165)
    at org.apache.maven.surefire.booter.ProviderFactory.invokeProvider(ProviderFactory.java:85)
    at org.apache.maven.surefire.booter.ForkedBooter.runSuitesInProcess(ForkedBooter.java:103)
    at org.apache.maven.surefire.booter.ForkedBooter.main(ForkedBooter.java:74)
authsTest(org.apache.accumulo.core.util.shell.ShellTest)  Time elapsed: 0.001 sec  <<<
ERROR!
java.lang.NullPointerException
    at org.apache.accumulo.core.util.shell.Shell.getDefaultPrompt(Shell.java:527)
    at org.apache.accumulo.core.util.shell.Shell.execCommand(Shell.java:532)
    at org.apache.accumulo.core.util.shell.ShellTest.exec(ShellTest.java:61)
    at org.apache.accumulo.core.util.shell.ShellTest.exec(ShellTest.java:77)
    at org.apache.accumulo.core.util.shell.ShellTest.exec(ShellTest.java:73)
    at org.apache.accumulo.core.util.shell.ShellTest.authsTest(ShellTest.java:154)

    at sun.reflect.NativeMethodAccessorImpl.invoke0(Native Method)
    at sun.reflect.NativeMethodAccessorImpl.invoke(NativeMethodAccessorImpl.java:39)
    at sun.reflect.DelegatingMethodAccessorImpl.invoke(DelegatingMethodAccessorImpl.java:25)
    at java.lang.reflect.Method.invoke(Method.java:597)
    at org.junit.runners.model.FrameworkMethod$1.runReflectiveCall(FrameworkMethod.java:47)
    at org.junit.internal.runners.model.ReflectiveCallable.run(ReflectiveCallable.java:12)
    at org.junit.runners.model.FrameworkMethod.invokeExplosively(FrameworkMethod.java:44)
    at org.junit.internal.runners.statements.InvokeMethod.evaluate(InvokeMethod.java:17)
    at org.junit.internal.runners.statements.RunBefores.evaluate(RunBefores.java:26)
    at org.junit.runners.ParentRunner.runLeaf(ParentRunner.java:271)
    at org.junit.runners.BlockJUnit4ClassRunner.runChild(BlockJUnit4ClassRunner.java:70)
    at org.junit.runners.BlockJUnit4ClassRunner.runChild(BlockJUnit4ClassRunner.java:50)
    at org.junit.runners.ParentRunner$3.run(ParentRunner.java:238)
    at org.junit.runners.ParentRunner$1.schedule(ParentRunner.java:63)
    at org.junit.runners.ParentRunner.runChildren(ParentRunner.java:236)
    at org.junit.runners.ParentRunner.access$000(ParentRunner.java:53)
    at org.junit.runners.ParentRunner$2.evaluate(ParentRunner.java:229)
    at org.junit.runners.ParentRunner.run(ParentRunner.java:309)
    at org.apache.maven.surefire.junit4.JUnit4Provider.execute(JUnit4Provider.java:236)
    at org.apache.maven.surefire.junit4.JUnit4Provider.executeTestSet(JUnit4Provider.java:134)
    at org.apache.maven.surefire.junit4.JUnit4Provider.invoke(JUnit4Provider.java:113)

    at sun.reflect.NativeMethodAccessorImpl.invoke0(Native Method)
    at sun.reflect.NativeMethodAccessorImpl.invoke(NativeMethodAccessorImpl.java:39)
    at sun.reflect.DelegatingMethodAccessorImpl.invoke(DelegatingMethodAccessorImpl.java:25)
    at java.lang.reflect.Method.invoke(Method.java:597)
    at org.apache.maven.surefire.util.ReflectionUtils.invokeMethodWithArray(ReflectionUtils.java:189)
    at org.apache.maven.surefire.booter.ProviderFactory$ProviderProxy.invoke(ProviderFactory.java:165)
    at org.apache.maven.surefire.booter.ProviderFactory.invokeProvider(ProviderFactory.java:85)
    at org.apache.maven.surefire.booter.ForkedBooter.runSuitesInProcess(ForkedBooter.java:103)
    at org.apache.maven.surefire.booter.ForkedBooter.main(ForkedBooter.java:74)

Thanks for the quick response,
Elise

From: Eric Newton [mailto:eric.newton@gmail.com<mailto:eric.newton@gmail.com>]
Sent: Tuesday, April 02, 2013 11:56 AM
To: user@accumulo.apache.org<mailto:user@accumulo.apache.org>
Subject: Re: Accumulo and CDH4

You will have to look at the files in core/target/surefire-reports.

What does it say in core/target/surefire-reports/org.apache.accumulo.core.util.shell.ShellTest.txt?

-Eric


On Tue, Apr 2, 2013 at 2:08 PM, Newman, Elise <enewman@integrity-apps.com<mailto:enewman@integrity-apps.com>>
wrote:
I'm trying to install Accumulo on a cluster running CDH4. I have checked out trunk and followed
the instructions here:
http://mail-archives.apache.org/mod_mbox/accumulo-user/201301.mbox/%3CCAF1jEfCp+kjqhVyH-Hb_HaNd=vHNhWL61WzeQSCSVLPHkS9n5A@mail.gmail.com%3E
Here's what I get when I attempt to build:

mvn clean package -Dhadoop.profile=2.0 -Dhadoop.version=2.0.0-cdh4.2.0 -Dzookeeper.version=3.4.5
-e
...
[many lines omitted]
...
[INFO] ------------------------------------------------------------------------
[INFO] Reactor Summary:
[INFO]
[INFO] Apache Accumulo ................................... SUCCESS [5.310s]
[INFO] Trace ............................................. SUCCESS [6.021s]
[INFO] Start ............................................. SUCCESS [32.580s]
[INFO] Fate .............................................. SUCCESS [2.713s]
[INFO] Core .............................................. FAILURE [51.833s]
[INFO] Server ............................................ SKIPPED
[INFO] Examples .......................................... SKIPPED
[INFO] Simple Examples ................................... SKIPPED
[INFO] Testing ........................................... SKIPPED
[INFO] Proxy ............................................. SKIPPED
[INFO] Assemble .......................................... SKIPPED
[INFO] ------------------------------------------------------------------------
[INFO] BUILD FAILURE
[INFO] ------------------------------------------------------------------------
[INFO] Total time: 1:39.558s
[INFO] Finished at: Mon Apr 01 15:46:13 PDT 2013
[INFO] Final Memory: 75M/434M
[INFO] ------------------------------------------------------------------------
[ERROR] Failed to execute goal org.apache.maven.plugins:maven-surefire-plugin:2.12:test (default-test)
on project accumulo-core: There are test failures.
[ERROR]
[ERROR] Please refer to /home/d/apps/accumulo-1.6.0-bleeding-edge/trunk/core/target/surefire-reports
for the individual test results.
[ERROR] -> [Help 1]
org.apache.maven.lifecycle.LifecycleExecutionException: Failed to execute goal org.apache.maven.plugins:maven-surefire-plugin:2.12:test
(default-test) on project accumulo-core: There are test failures.

Please refer to /home/d/apps/accumulo-1.6.0-bleeding-edge/trunk/core/target/surefire-reports
for the individual test results.
    at org.apache.maven.lifecycle.internal.MojoExecutor.execute(MojoExecutor.java:213)
    at org.apache.maven.lifecycle.internal.MojoExecutor.execute(MojoExecutor.java:153)
    at org.apache.maven.lifecycle.internal.MojoExecutor.execute(MojoExecutor.java:145)
    at org.apache.maven.lifecycle.internal.LifecycleModuleBuilder.buildProject(LifecycleModuleBuilder.java:84)
    at org.apache.maven.lifecycle.internal.LifecycleModuleBuilder.buildProject(LifecycleModuleBuilder.java:59)
    at org.apache.maven.lifecycle.internal.LifecycleStarter.singleThreadedBuild(LifecycleStarter.java:183)
    at org.apache.maven.lifecycle.internal.LifecycleStarter.execute(LifecycleStarter.java:161)
    at org.apache.maven.DefaultMaven.doExecute(DefaultMaven.java:320)
    at org.apache.maven.DefaultMaven.execute(DefaultMaven.java:156)
    at org.apache.maven.cli.MavenCli.execute(MavenCli.java:537)
    at org.apache.maven.cli.MavenCli.doMain(MavenCli.java:196)
    at org.apache.maven.cli.MavenCli.main(MavenCli.java:141)
    at sun.reflect.NativeMethodAccessorImpl.invoke0(Native Method)
    at sun.reflect.NativeMethodAccessorImpl.invoke(NativeMethodAccessorImpl.java:39)
    at sun.reflect.DelegatingMethodAccessorImpl.invoke(DelegatingMethodAccessorImpl.java:25)
    at java.lang.reflect.Method.invoke(Method.java:597)
    at org.codehaus.plexus.classworlds.launcher.Launcher.launchEnhanced(Launcher.java:290)
    at org.codehaus.plexus.classworlds.launcher.Launcher.launch(Launcher.java:230)
    at org.codehaus.plexus.classworlds.launcher.Launcher.mainWithExitCode(Launcher.java:409)
    at org.codehaus.plexus.classworlds.launcher.Launcher.main(Launcher.java:352)
Caused by: org.apache.maven.plugin.MojoFailureException: There are test failures.

Please refer to /home/d/apps/accumulo-1.6.0-bleeding-edge/trunk/core/target/surefire-reports
for the individual test results.
    at org.apache.maven.plugin.surefire.SurefireHelper.reportExecution(SurefireHelper.java:83)
    at org.apache.maven.plugin.surefire.SurefirePlugin.writeSummary(SurefirePlugin.java:673)
    at org.apache.maven.plugin.surefire.SurefirePlugin.handleSummary(SurefirePlugin.java:647)
    at org.apache.maven.plugin.surefire.AbstractSurefireMojo.executeAfterPreconditionsChecked(AbstractSurefireMojo.java:137)
    at org.apache.maven.plugin.surefire.AbstractSurefireMojo.execute(AbstractSurefireMojo.java:98)
    at org.apache.maven.plugin.DefaultBuildPluginManager.executeMojo(DefaultBuildPluginManager.java:101)
    at org.apache.maven.lifecycle.internal.MojoExecutor.execute(MojoExecutor.java:209)
    ... 19 more
[ERROR]
[ERROR] Re-run Maven using the -X switch to enable full debug logging.
[ERROR]
[ERROR] For more information about the errors and possible solutions, please read the following
articles:
[ERROR] [Help 1] http://cwiki.apache.org/confluence/display/MAVEN/MojoFailureException
[ERROR]
[ERROR] After correcting the problems, you can resume the build with the command
[ERROR]   mvn <goals> -rf :accumulo-core
the failure (in the "many lines omitted" section):
Running org.apache.accumulo.core.util.shell.ShellTest
Tests run: 9, Failures: 0, Errors: 8, Skipped: 0, Time elapsed: 0.032 sec <<< FAILURE!
Anyone know what could be causing this?






Mime
View raw message