accumulo-notifications mailing list archives

Site index · List index
Message view « Date » · « Thread »
Top « Date » · « Thread »
From "Michael Miller (JIRA)" <j...@apache.org>
Subject [jira] [Commented] (ACCUMULO-4602) Assorted flakey ITs that appear to be timeout sensitive
Date Wed, 19 Jul 2017 21:15:00 GMT

    [ https://issues.apache.org/jira/browse/ACCUMULO-4602?page=com.atlassian.jira.plugin.system.issuetabpanels:comment-tabpanel&focusedCommentId=16093795#comment-16093795
] 

Michael Miller commented on ACCUMULO-4602:
------------------------------------------

I know [~ctubbsii] had similar frustrations with AssignmentThreadsIT and after speaking with
[~kturner] yesterday, he seemed to share feelings of distaste for it.  I will remove AssignmentThreadsIT
since it seems like there won't be much love lost.  I can keep the ticket open for now, as
it seems to be a nice place holder until we can squash the other ones.

> Assorted flakey ITs that appear to be timeout sensitive
> -------------------------------------------------------
>
>                 Key: ACCUMULO-4602
>                 URL: https://issues.apache.org/jira/browse/ACCUMULO-4602
>             Project: Accumulo
>          Issue Type: Bug
>          Components: test
>    Affects Versions: 1.7.3
>            Reporter: Josh Elser
>            Priority: Minor
>             Fix For: 1.7.4, 1.8.2, 2.0.0
>
>          Time Spent: 1h
>  Remaining Estimate: 0h
>
> {noformat}
> Tests run: 1, Failures: 1, Errors: 0, Skipped: 0, Time elapsed: 48.387 sec <<<
FAILURE! - in org.apache.accumulo.test.AssignmentThreadsIT
> testConcurrentAssignmentPerformance(org.apache.accumulo.test.AssignmentThreadsIT)  Time
elapsed: 48.266 sec  <<< FAILURE!
> java.lang.AssertionError
> 	at org.apache.accumulo.test.AssignmentThreadsIT.testConcurrentAssignmentPerformance(AssignmentThreadsIT.java:91)
> Tests run: 1, Failures: 0, Errors: 1, Skipped: 0, Time elapsed: 60.177 sec <<<
FAILURE! - in org.apache.accumulo.test.BadDeleteMarkersCreatedIT
> test(org.apache.accumulo.test.BadDeleteMarkersCreatedIT)  Time elapsed: 60.011 sec  <<<
ERROR!
> org.junit.runners.model.TestTimedOutException: test timed out after 60 seconds
> {noformat}
> Both of these appear to just be sensitive to timings, and, as such, should not be tests.



--
This message was sent by Atlassian JIRA
(v6.4.14#64029)

Mime
View raw message