accumulo-notifications mailing list archives

Site index · List index
Message view « Date » · « Thread »
Top « Date » · « Thread »
From "Sean Busbey (JIRA)" <j...@apache.org>
Subject [jira] [Commented] (ACCUMULO-4422) Logging should be initialized prior to attempting kerberos login
Date Thu, 25 Aug 2016 19:53:20 GMT

    [ https://issues.apache.org/jira/browse/ACCUMULO-4422?page=com.atlassian.jira.plugin.system.issuetabpanels:comment-tabpanel&focusedCommentId=15437523#comment-15437523
] 

Sean Busbey commented on ACCUMULO-4422:
---------------------------------------

the 1.8 branch is consistently failing the replication-with-kerberos test

{code}
-------------------------------------------------------
 T E S T S
-------------------------------------------------------
Running org.apache.accumulo.test.functional.KerberosIT
Tests run: 11, Failures: 0, Errors: 0, Skipped: 0, Time elapsed: 157.376 sec - in org.apache.accumulo.test.functional.KerberosIT
Running org.apache.accumulo.test.functional.KerberosProxyIT
Tests run: 3, Failures: 0, Errors: 0, Skipped: 0, Time elapsed: 48.864 sec - in org.apache.accumulo.test.functional.KerberosProxyIT
Running org.apache.accumulo.test.functional.KerberosRenewalIT
Tests run: 1, Failures: 0, Errors: 0, Skipped: 0, Time elapsed: 493.509 sec - in org.apache.accumulo.test.functional.KerberosRenewalIT
Running org.apache.accumulo.test.replication.KerberosReplicationIT
Tests run: 2, Failures: 0, Errors: 2, Skipped: 0, Time elapsed: 720.337 sec <<< FAILURE!
- in org.apache.accumulo.test.replication.KerberosReplicationIT
dataReplicatedToCorrectTable(org.apache.accumulo.test.replication.KerberosReplicationIT) 
Time elapsed: 720.016 sec  <<< ERROR!
org.junit.runners.model.TestTimedOutException: test timed out after 720 seconds
        at org.apache.accumulo.test.replication.KerberosReplicationIT.dataReplicatedToCorrectTable(KerberosReplicationIT.java:155)

dataReplicatedToCorrectTable(org.apache.accumulo.test.replication.KerberosReplicationIT) 
Time elapsed: 720.017 sec  <<< ERROR!
java.lang.Exception: Appears to be stuck in thread Thread-11


Results :

Tests in error:
org.apache.accumulo.test.replication.KerberosReplicationIT.dataReplicatedToCorrectTable(org.apache.accumulo.test.replication.KerberosReplicationIT)
  Run 1: KerberosReplicationIT.dataReplicatedToCorrectTable:155 » TestTimedOut test tim...
  Run 2: KerberosReplicationIT.dataReplicatedToCorrectTable »  Appears to be stuck in t...


Tests run: 16, Failures: 0, Errors: 1, Skipped: 0
{code}

hopefully time to dig in tomorrow. :/

> Logging should be initialized prior to attempting kerberos login
> ----------------------------------------------------------------
>
>                 Key: ACCUMULO-4422
>                 URL: https://issues.apache.org/jira/browse/ACCUMULO-4422
>             Project: Accumulo
>          Issue Type: Bug
>          Components: gc, master, trace, tserver
>    Affects Versions: 1.6.5, 1.7.1, 1.7.2
>            Reporter: Sean Busbey
>            Assignee: Sean Busbey
>            Priority: Critical
>             Fix For: 1.6.6, 1.7.3, 1.8.0
>
>         Attachments: ACCUMULO-4422.1.6.v1.patch
>
>          Time Spent: 20m
>  Remaining Estimate: 0h
>
> Right now we attempt to do server logins prior to initializing the logging system, which
means we don't see any of our helpful debugging messages when things go wrong.



--
This message was sent by Atlassian JIRA
(v6.3.4#6332)

Mime
View raw message