accumulo-notifications mailing list archives

Site index · List index
Message view « Date » · « Thread »
Top « Date » · « Thread »
From "Eric Newton (JIRA)" <j...@apache.org>
Subject [jira] [Commented] (ACCUMULO-3434) testTableOperations(org.apache.accumulo.proxy.SimpleTest) fails on PPC64 big endian (works on little endian)
Date Thu, 18 Dec 2014 16:26:13 GMT

    [ https://issues.apache.org/jira/browse/ACCUMULO-3434?page=com.atlassian.jira.plugin.system.issuetabpanels:comment-tabpanel&focusedCommentId=14251869#comment-14251869
] 

Eric Newton commented on ACCUMULO-3434:
---------------------------------------

Can you tell me what version of accumulo you were running when you got this stack trace? 
Line SimpleTest.java, line 1112 does not contain a corresponding assertion in 1.5.2.


> testTableOperations(org.apache.accumulo.proxy.SimpleTest) fails on PPC64 big endian (works
on little endian)
> ------------------------------------------------------------------------------------------------------------
>
>                 Key: ACCUMULO-3434
>                 URL: https://issues.apache.org/jira/browse/ACCUMULO-3434
>             Project: Accumulo
>          Issue Type: Bug
>          Components: proxy
>    Affects Versions: 1.5.1, 1.5.2
>         Environment: RHEL 7 PPC64
> 3.10.0-123.6.3.el7.ppc64 #1 SMP Wed Jul 16 15:11:39 EDT 2014 ppc64 ppc64 ppc64 GNU/Linux
>            Reporter: Corentin Baron
>
> {noformat}
> Running org.apache.accumulo.proxy.SimpleTest
> Tests run: 11, Failures: 1, Errors: 0, Skipped: 0, Time elapsed: 31.796 sec <<<
FAILURE!
> testTableOperations(org.apache.accumulo.proxy.SimpleTest)  Time elapsed: 12.305 sec 
<<< FAILURE!
> java.lang.AssertionError: expected:<1> but was:<0>
> 	at org.junit.Assert.fail(Assert.java:88)
> 	at org.junit.Assert.failNotEquals(Assert.java:743)
> 	at org.junit.Assert.assertEquals(Assert.java:118)
> 	at org.junit.Assert.assertEquals(Assert.java:555)
> 	at org.junit.Assert.assertEquals(Assert.java:542)
> 	at org.apache.accumulo.proxy.SimpleTest.testTableOperations(SimpleTest.java:1112)
> 	at sun.reflect.NativeMethodAccessorImpl.invoke0(Native Method)
> 	at sun.reflect.NativeMethodAccessorImpl.invoke(NativeMethodAccessorImpl.java:95)
> 	at sun.reflect.DelegatingMethodAccessorImpl.invoke(DelegatingMethodAccessorImpl.java:56)
> 	at java.lang.reflect.Method.invoke(Method.java:620)
> 	at org.junit.runners.model.FrameworkMethod$1.runReflectiveCall(FrameworkMethod.java:47)
> 	at org.junit.internal.runners.model.ReflectiveCallable.run(ReflectiveCallable.java:12)
> 	at org.junit.runners.model.FrameworkMethod.invokeExplosively(FrameworkMethod.java:44)
> 	at org.junit.internal.runners.statements.InvokeMethod.evaluate(InvokeMethod.java:17)
> 	at org.junit.runners.ParentRunner.runLeaf(ParentRunner.java:271)
> 	at org.junit.runners.BlockJUnit4ClassRunner.runChild(BlockJUnit4ClassRunner.java:70)
> 	at org.junit.runners.BlockJUnit4ClassRunner.runChild(BlockJUnit4ClassRunner.java:50)
> 	at org.junit.runners.ParentRunner$3.run(ParentRunner.java:238)
> 	at org.junit.runners.ParentRunner$1.schedule(ParentRunner.java:63)
> 	at org.junit.runners.ParentRunner.runChildren(ParentRunner.java:236)
> 	at org.junit.runners.ParentRunner.access$000(ParentRunner.java:53)
> 	at org.junit.runners.ParentRunner$2.evaluate(ParentRunner.java:229)
> 	at org.junit.internal.runners.statements.RunBefores.evaluate(RunBefores.java:26)
> 	at org.junit.internal.runners.statements.RunAfters.evaluate(RunAfters.java:27)
> 	at org.junit.runners.ParentRunner.run(ParentRunner.java:309)
> 	at org.apache.maven.surefire.junit4.JUnit4Provider.execute(JUnit4Provider.java:252)
> 	at org.apache.maven.surefire.junit4.JUnit4Provider.executeTestSet(JUnit4Provider.java:141)
> 	at org.apache.maven.surefire.junit4.JUnit4Provider.invoke(JUnit4Provider.java:112)
> 	at sun.reflect.NativeMethodAccessorImpl.invoke0(Native Method)
> 	at sun.reflect.NativeMethodAccessorImpl.invoke(NativeMethodAccessorImpl.java:95)
> 	at sun.reflect.DelegatingMethodAccessorImpl.invoke(DelegatingMethodAccessorImpl.java:56)
> 	at java.lang.reflect.Method.invoke(Method.java:620)
> 	at org.apache.maven.surefire.util.ReflectionUtils.invokeMethodWithArray(ReflectionUtils.java:189)
> 	at org.apache.maven.surefire.booter.ProviderFactory$ProviderProxy.invoke(ProviderFactory.java:165)
> 	at org.apache.maven.surefire.booter.ProviderFactory.invokeProvider(ProviderFactory.java:85)
> 	at org.apache.maven.surefire.booter.ForkedBooter.runSuitesInProcess(ForkedBooter.java:115)
> 	at org.apache.maven.surefire.booter.ForkedBooter.main(ForkedBooter.java:75)
> {noformat}



--
This message was sent by Atlassian JIRA
(v6.3.4#6332)

Mime
View raw message