accumulo-notifications mailing list archives

Site index · List index
Message view « Date » · « Thread »
Top « Date » · « Thread »
From "Josh Elser (JIRA)" <j...@apache.org>
Subject [jira] [Created] (ACCUMULO-3115) DurabilityIT failure
Date Fri, 12 Sep 2014 02:11:33 GMT
Josh Elser created ACCUMULO-3115:
------------------------------------

             Summary: DurabilityIT failure
                 Key: ACCUMULO-3115
                 URL: https://issues.apache.org/jira/browse/ACCUMULO-3115
             Project: Accumulo
          Issue Type: Improvement
          Components: test
            Reporter: Josh Elser
            Priority: Trivial
             Fix For: 1.6.1, 1.7.0


{noformat}
Tests run: 7, Failures: 1, Errors: 0, Skipped: 0, Time elapsed: 197.893 sec <<< FAILURE!
- in org.apache.accumulo.test.functional.DurabilityIT
testWriteSpeed(org.apache.accumulo.test.functional.DurabilityIT)  Time elapsed: 13.648 sec
 <<< FAILURE!
java.lang.AssertionError: null
	at org.junit.Assert.fail(Assert.java:86)
	at org.junit.Assert.assertTrue(Assert.java:41)
	at org.junit.Assert.assertTrue(Assert.java:52)
	at org.apache.accumulo.test.functional.DurabilityIT.testWriteSpeed(DurabilityIT.java:90)
{noformat}



--
This message was sent by Atlassian JIRA
(v6.3.4#6332)

Mime
View raw message