accumulo-notifications mailing list archives

Site index · List index
Message view « Date » · « Thread »
Top « Date » · « Thread »
From "Josh Elser (JIRA)" <j...@apache.org>
Subject [jira] [Resolved] (ACCUMULO-2541) ScannerIT.testScannerReadaheadConfiguration
Date Fri, 28 Mar 2014 00:23:16 GMT

     [ https://issues.apache.org/jira/browse/ACCUMULO-2541?page=com.atlassian.jira.plugin.system.issuetabpanels:all-tabpanel
]

Josh Elser resolved ACCUMULO-2541.
----------------------------------

    Resolution: Fixed

> ScannerIT.testScannerReadaheadConfiguration
> -------------------------------------------
>
>                 Key: ACCUMULO-2541
>                 URL: https://issues.apache.org/jira/browse/ACCUMULO-2541
>             Project: Accumulo
>          Issue Type: Sub-task
>          Components: test
>         Environment: nightly tests 1.6.0-SNAPSHOT
>            Reporter: Eric Newton
>            Assignee: Josh Elser
>             Fix For: 1.6.0
>
>
> {noformat}
> Tests run: 1, Failures: 1, Errors: 0, Skipped: 0, Time elapsed: 15.894 sec <<<
FAILURE!
> testScannerReadaheadConfiguration(org.apache.accumulo.test.functional.ScannerIT)  Time
elapsed: 6.759 sec  <<< FAILURE!
> java.lang.AssertionError: Expected less time to be taken with immediate readahead (135)
than without immediate readahead (86)
> 	at org.junit.Assert.fail(Assert.java:88)
> 	at org.junit.Assert.assertTrue(Assert.java:41)
> 	at org.apache.accumulo.test.functional.ScannerIT.testScannerReadaheadConfiguration(ScannerIT.java:108)
> 	at sun.reflect.NativeMethodAccessorImpl.invoke0(Native Method)
> 	at sun.reflect.NativeMethodAccessorImpl.invoke(NativeMethodAccessorImpl.java:57)
> 	at sun.reflect.DelegatingMethodAccessorImpl.invoke(DelegatingMethodAccessorImpl.java:43)
> 	at java.lang.reflect.Method.invoke(Method.java:622)
> 	at org.junit.runners.model.FrameworkMethod$1.runReflectiveCall(FrameworkMethod.java:47)
> 	at org.junit.internal.runners.model.ReflectiveCallable.run(ReflectiveCallable.java:12)
> 	at org.junit.runners.model.FrameworkMethod.invokeExplosively(FrameworkMethod.java:44)
> 	at org.junit.internal.runners.statements.InvokeMethod.evaluate(InvokeMethod.java:17)
> 	at org.junit.internal.runners.statements.FailOnTimeout$StatementThread.run(FailOnTimeout.java:74)
> {noformat}



--
This message was sent by Atlassian JIRA
(v6.2#6252)

Mime
View raw message