accumulo-notifications mailing list archives

Site index · List index
Message view « Date » · « Thread »
Top « Date » · « Thread »
From "Eric Newton (JIRA)" <>
Subject [jira] [Created] (ACCUMULO-2541) ScannerIT.testScannerReadaheadConfiguration
Date Mon, 24 Mar 2014 19:30:43 GMT
Eric Newton created ACCUMULO-2541:

             Summary: ScannerIT.testScannerReadaheadConfiguration
                 Key: ACCUMULO-2541
             Project: Accumulo
          Issue Type: Sub-task
          Components: test
         Environment: nightly tests 1.6.0-SNAPSHOT
            Reporter: Eric Newton
            Assignee: Eric Newton

Tests run: 1, Failures: 1, Errors: 0, Skipped: 0, Time elapsed: 15.894 sec <<< FAILURE!
testScannerReadaheadConfiguration(org.apache.accumulo.test.functional.ScannerIT)  Time elapsed:
6.759 sec  <<< FAILURE!
java.lang.AssertionError: Expected less time to be taken with immediate readahead (135) than
without immediate readahead (86)
	at org.junit.Assert.assertTrue(
	at org.apache.accumulo.test.functional.ScannerIT.testScannerReadaheadConfiguration(
	at sun.reflect.NativeMethodAccessorImpl.invoke0(Native Method)
	at sun.reflect.NativeMethodAccessorImpl.invoke(
	at sun.reflect.DelegatingMethodAccessorImpl.invoke(
	at java.lang.reflect.Method.invoke(
	at org.junit.runners.model.FrameworkMethod$1.runReflectiveCall(
	at org.junit.runners.model.FrameworkMethod.invokeExplosively(
	at org.junit.internal.runners.statements.InvokeMethod.evaluate(
	at org.junit.internal.runners.statements.FailOnTimeout$

This message was sent by Atlassian JIRA

View raw message