accumulo-notifications mailing list archives

Site index · List index
Message view « Date » · « Thread »
Top « Date » · « Thread »
From "Josh Elser (JIRA)" <j...@apache.org>
Subject [jira] [Updated] (ACCUMULO-1908) Spurious ShellServerTest failures
Date Wed, 08 Jan 2014 16:07:51 GMT

     [ https://issues.apache.org/jira/browse/ACCUMULO-1908?page=com.atlassian.jira.plugin.system.issuetabpanels:all-tabpanel
]

Josh Elser updated ACCUMULO-1908:
---------------------------------

    Fix Version/s: 1.6.1

> Spurious ShellServerTest failures
> ---------------------------------
>
>                 Key: ACCUMULO-1908
>                 URL: https://issues.apache.org/jira/browse/ACCUMULO-1908
>             Project: Accumulo
>          Issue Type: Bug
>          Components: test
>    Affects Versions: 1.5.0
>         Environment: openjdk 1.7.0_40
>            Reporter: Josh Elser
>            Assignee: Josh Elser
>            Priority: Minor
>             Fix For: 1.5.1, 1.6.1
>
>
> {noformat}
> Tests run: 33, Failures: 21, Errors: 0, Skipped: 0, Time elapsed: 46.949 sec <<<
FAILURE!
> constraint(org.apache.accumulo.test.ShellServerTest)  Time elapsed: 0.691 sec  <<<
FAILURE!
> java.lang.AssertionError: VisibilityConstraint=1 present in root@miniInstance c> constraint
-l -t c
> org.apache.accumulo.core.security.VisibilityConstraint=1
>  was not false expected:<false> but was:<true>
> 	at org.junit.Assert.fail(Assert.java:88)
> 	at org.junit.Assert.failNotEquals(Assert.java:743)
> 	at org.junit.Assert.assertEquals(Assert.java:118)
> 	at org.apache.accumulo.test.ShellServerTest.assertGoodExit(ShellServerTest.java:122)
> 	at org.apache.accumulo.test.ShellServerTest.exec(ShellServerTest.java:111)
> 	at org.apache.accumulo.test.ShellServerTest.constraint(ShellServerTest.java:460)
> 	at sun.reflect.NativeMethodAccessorImpl.invoke0(Native Method)
> 	at sun.reflect.NativeMethodAccessorImpl.invoke(NativeMethodAccessorImpl.java:57)
> 	at sun.reflect.DelegatingMethodAccessorImpl.invoke(DelegatingMethodAccessorImpl.java:43)
> 	at java.lang.reflect.Method.invoke(Method.java:606)
> 	at org.junit.runners.model.FrameworkMethod$1.runReflectiveCall(FrameworkMethod.java:47)
> 	at org.junit.internal.runners.model.ReflectiveCallable.run(ReflectiveCallable.java:12)
> 	at org.junit.runners.model.FrameworkMethod.invokeExplosively(FrameworkMethod.java:44)
> 	at org.junit.internal.runners.statements.InvokeMethod.evaluate(InvokeMethod.java:17)
> 	at org.junit.internal.runners.statements.FailOnTimeout$StatementThread.run(FailOnTimeout.java:74)
> du(org.apache.accumulo.test.ShellServerTest)  Time elapsed: 1.102 sec  <<< FAILURE!
> java.lang.AssertionError
> 	at org.junit.Assert.fail(Assert.java:86)
> 	at org.junit.Assert.assertTrue(Assert.java:41)
> 	at org.junit.Assert.assertTrue(Assert.java:52)
> 	at org.apache.accumulo.test.ShellServerTest.du(ShellServerTest.java:256)
> 	at sun.reflect.NativeMethodAccessorImpl.invoke0(Native Method)
> 	at sun.reflect.NativeMethodAccessorImpl.invoke(NativeMethodAccessorImpl.java:57)
> 	at sun.reflect.DelegatingMethodAccessorImpl.invoke(DelegatingMethodAccessorImpl.java:43)
> 	at java.lang.reflect.Method.invoke(Method.java:606)
> 	at org.junit.runners.model.FrameworkMethod$1.runReflectiveCall(FrameworkMethod.java:47)
> 	at org.junit.internal.runners.model.ReflectiveCallable.run(ReflectiveCallable.java:12)
> 	at org.junit.runners.model.FrameworkMethod.invokeExplosively(FrameworkMethod.java:44)
> 	at org.junit.internal.runners.statements.InvokeMethod.evaluate(InvokeMethod.java:17)
> 	at org.junit.internal.runners.statements.FailOnTimeout$StatementThread.run(FailOnTimeout.java:74)
> grep(org.apache.accumulo.test.ShellServerTest)  Time elapsed: 0.002 sec  <<<
FAILURE!
> java.lang.AssertionError: expected:<0> but was:<1>
> 	at org.junit.Assert.fail(Assert.java:88)
> 	at org.junit.Assert.failNotEquals(Assert.java:743)
> 	at org.junit.Assert.assertEquals(Assert.java:118)
> 	at org.junit.Assert.assertEquals(Assert.java:555)
> 	at org.junit.Assert.assertEquals(Assert.java:542)
> 	at org.apache.accumulo.test.ShellServerTest.assertGoodExit(ShellServerTest.java:119)
> 	at org.apache.accumulo.test.ShellServerTest.exec(ShellServerTest.java:98)
> 	at org.apache.accumulo.test.ShellServerTest.grep(ShellServerTest.java:516)
> 	at sun.reflect.NativeMethodAccessorImpl.invoke0(Native Method)
> 	at sun.reflect.NativeMethodAccessorImpl.invoke(NativeMethodAccessorImpl.java:57)
> 	at sun.reflect.DelegatingMethodAccessorImpl.invoke(DelegatingMethodAccessorImpl.java:43)
> 	at java.lang.reflect.Method.invoke(Method.java:606)
> 	at org.junit.runners.model.FrameworkMethod$1.runReflectiveCall(FrameworkMethod.java:47)
> 	at org.junit.internal.runners.model.ReflectiveCallable.run(ReflectiveCallable.java:12)
> 	at org.junit.runners.model.FrameworkMethod.invokeExplosively(FrameworkMethod.java:44)
> 	at org.junit.internal.runners.statements.InvokeMethod.evaluate(InvokeMethod.java:17)
> 	at org.junit.internal.runners.statements.FailOnTimeout$StatementThread.run(FailOnTimeout.java:74)
> help(org.apache.accumulo.test.ShellServerTest)  Time elapsed: 0.02 sec  <<<
FAILURE!
> java.lang.AssertionError: expected:<0> but was:<1>
> 	at org.junit.Assert.fail(Assert.java:88)
> 	at org.junit.Assert.failNotEquals(Assert.java:743)
> 	at org.junit.Assert.assertEquals(Assert.java:118)
> 	at org.junit.Assert.assertEquals(Assert.java:555)
> 	at org.junit.Assert.assertEquals(Assert.java:542)
> 	at org.apache.accumulo.test.ShellServerTest.assertGoodExit(ShellServerTest.java:119)
> 	at org.apache.accumulo.test.ShellServerTest.exec(ShellServerTest.java:111)
> 	at org.apache.accumulo.test.ShellServerTest.help(ShellServerTest.java:525)
> 	at sun.reflect.NativeMethodAccessorImpl.invoke0(Native Method)
> 	at sun.reflect.NativeMethodAccessorImpl.invoke(NativeMethodAccessorImpl.java:57)
> 	at sun.reflect.DelegatingMethodAccessorImpl.invoke(DelegatingMethodAccessorImpl.java:43)
> 	at java.lang.reflect.Method.invoke(Method.java:606)
> 	at org.junit.runners.model.FrameworkMethod$1.runReflectiveCall(FrameworkMethod.java:47)
> 	at org.junit.internal.runners.model.ReflectiveCallable.run(ReflectiveCallable.java:12)
> 	at org.junit.runners.model.FrameworkMethod.invokeExplosively(FrameworkMethod.java:44)
> 	at org.junit.internal.runners.statements.InvokeMethod.evaluate(InvokeMethod.java:17)
> 	at org.junit.internal.runners.statements.FailOnTimeout$StatementThread.run(FailOnTimeout.java:74)
> info(org.apache.accumulo.test.ShellServerTest)  Time elapsed: 0.001 sec  <<<
FAILURE!
> java.lang.AssertionError: expected:<0> but was:<1>
> 	at org.junit.Assert.fail(Assert.java:88)
> 	at org.junit.Assert.failNotEquals(Assert.java:743)
> 	at org.junit.Assert.assertEquals(Assert.java:118)
> 	at org.junit.Assert.assertEquals(Assert.java:555)
> 	at org.junit.Assert.assertEquals(Assert.java:542)
> 	at org.apache.accumulo.test.ShellServerTest.assertGoodExit(ShellServerTest.java:119)
> 	at org.apache.accumulo.test.ShellServerTest.exec(ShellServerTest.java:111)
> 	at org.apache.accumulo.test.ShellServerTest.info(ShellServerTest.java:581)
> 	at sun.reflect.NativeMethodAccessorImpl.invoke0(Native Method)
> 	at sun.reflect.NativeMethodAccessorImpl.invoke(NativeMethodAccessorImpl.java:57)
> 	at sun.reflect.DelegatingMethodAccessorImpl.invoke(DelegatingMethodAccessorImpl.java:43)
> 	at java.lang.reflect.Method.invoke(Method.java:606)
> 	at org.junit.runners.model.FrameworkMethod$1.runReflectiveCall(FrameworkMethod.java:47)
> 	at org.junit.internal.runners.model.ReflectiveCallable.run(ReflectiveCallable.java:12)
> 	at org.junit.runners.model.FrameworkMethod.invokeExplosively(FrameworkMethod.java:44)
> 	at org.junit.internal.runners.statements.InvokeMethod.evaluate(InvokeMethod.java:17)
> 	at org.junit.internal.runners.statements.FailOnTimeout$StatementThread.run(FailOnTimeout.java:74)
> iter(org.apache.accumulo.test.ShellServerTest)  Time elapsed: 0.064 sec  <<<
FAILURE!
> java.lang.AssertionError: expected:<0> but was:<2>
> 	at org.junit.Assert.fail(Assert.java:88)
> 	at org.junit.Assert.failNotEquals(Assert.java:743)
> 	at org.junit.Assert.assertEquals(Assert.java:118)
> 	at org.junit.Assert.assertEquals(Assert.java:555)
> 	at org.junit.Assert.assertEquals(Assert.java:542)
> 	at org.apache.accumulo.test.ShellServerTest.assertGoodExit(ShellServerTest.java:119)
> 	at org.apache.accumulo.test.ShellServerTest.exec(ShellServerTest.java:98)
> 	at org.apache.accumulo.test.ShellServerTest.iter(ShellServerTest.java:313)
> 	at sun.reflect.NativeMethodAccessorImpl.invoke0(Native Method)
> 	at sun.reflect.NativeMethodAccessorImpl.invoke(NativeMethodAccessorImpl.java:57)
> 	at sun.reflect.DelegatingMethodAccessorImpl.invoke(DelegatingMethodAccessorImpl.java:43)
> 	at java.lang.reflect.Method.invoke(Method.java:606)
> 	at org.junit.runners.model.FrameworkMethod$1.runReflectiveCall(FrameworkMethod.java:47)
> 	at org.junit.internal.runners.model.ReflectiveCallable.run(ReflectiveCallable.java:12)
> 	at org.junit.runners.model.FrameworkMethod.invokeExplosively(FrameworkMethod.java:44)
> 	at org.junit.internal.runners.statements.InvokeMethod.evaluate(InvokeMethod.java:17)
> 	at org.junit.internal.runners.statements.FailOnTimeout$StatementThread.run(FailOnTimeout.java:74)
> ping(org.apache.accumulo.test.ShellServerTest)  Time elapsed: 0.066 sec  <<<
FAILURE!
> java.lang.AssertionError: expected:<0> but was:<2>
> 	at org.junit.Assert.fail(Assert.java:88)
> 	at org.junit.Assert.failNotEquals(Assert.java:743)
> 	at org.junit.Assert.assertEquals(Assert.java:118)
> 	at org.junit.Assert.assertEquals(Assert.java:555)
> 	at org.junit.Assert.assertEquals(Assert.java:542)
> 	at org.apache.accumulo.test.ShellServerTest.assertGoodExit(ShellServerTest.java:119)
> 	at org.apache.accumulo.test.ShellServerTest.exec(ShellServerTest.java:111)
> 	at org.apache.accumulo.test.ShellServerTest.ping(ShellServerTest.java:646)
> 	at sun.reflect.NativeMethodAccessorImpl.invoke0(Native Method)
> 	at sun.reflect.NativeMethodAccessorImpl.invoke(NativeMethodAccessorImpl.java:57)
> 	at sun.reflect.DelegatingMethodAccessorImpl.invoke(DelegatingMethodAccessorImpl.java:43)
> 	at java.lang.reflect.Method.invoke(Method.java:606)
> 	at org.junit.runners.model.FrameworkMethod$1.runReflectiveCall(FrameworkMethod.java:47)
> 	at org.junit.internal.runners.model.ReflectiveCallable.run(ReflectiveCallable.java:12)
> 	at org.junit.runners.model.FrameworkMethod.invokeExplosively(FrameworkMethod.java:44)
> 	at org.junit.internal.runners.statements.InvokeMethod.evaluate(InvokeMethod.java:17)
> 	at org.junit.internal.runners.statements.FailOnTimeout$StatementThread.run(FailOnTimeout.java:74)
> user(org.apache.accumulo.test.ShellServerTest)  Time elapsed: 0.137 sec  <<<
FAILURE!
> java.lang.AssertionError: expected:<0> but was:<2>
> 	at org.junit.Assert.fail(Assert.java:88)
> 	at org.junit.Assert.failNotEquals(Assert.java:743)
> 	at org.junit.Assert.assertEquals(Assert.java:118)
> 	at org.junit.Assert.assertEquals(Assert.java:555)
> 	at org.junit.Assert.assertEquals(Assert.java:542)
> 	at org.apache.accumulo.test.ShellServerTest.assertGoodExit(ShellServerTest.java:119)
> 	at org.apache.accumulo.test.ShellServerTest.exec(ShellServerTest.java:98)
> 	at org.apache.accumulo.test.ShellServerTest.user(ShellServerTest.java:275)
> 	at sun.reflect.NativeMethodAccessorImpl.invoke0(Native Method)
> 	at sun.reflect.NativeMethodAccessorImpl.invoke(NativeMethodAccessorImpl.java:57)
> 	at sun.reflect.DelegatingMethodAccessorImpl.invoke(DelegatingMethodAccessorImpl.java:43)
> 	at java.lang.reflect.Method.invoke(Method.java:606)
> 	at org.junit.runners.model.FrameworkMethod$1.runReflectiveCall(FrameworkMethod.java:47)
> 	at org.junit.internal.runners.model.ReflectiveCallable.run(ReflectiveCallable.java:12)
> 	at org.junit.runners.model.FrameworkMethod.invokeExplosively(FrameworkMethod.java:44)
> 	at org.junit.internal.runners.statements.InvokeMethod.evaluate(InvokeMethod.java:17)
> 	at org.junit.internal.runners.statements.FailOnTimeout$StatementThread.run(FailOnTimeout.java:74)
> debug(org.apache.accumulo.test.ShellServerTest)  Time elapsed: 0.005 sec  <<<
FAILURE!
> java.lang.AssertionError: expected:<0> but was:<2>
> 	at org.junit.Assert.fail(Assert.java:88)
> 	at org.junit.Assert.failNotEquals(Assert.java:743)
> 	at org.junit.Assert.assertEquals(Assert.java:118)
> 	at org.junit.Assert.assertEquals(Assert.java:555)
> 	at org.junit.Assert.assertEquals(Assert.java:542)
> 	at org.apache.accumulo.test.ShellServerTest.assertGoodExit(ShellServerTest.java:119)
> 	at org.apache.accumulo.test.ShellServerTest.exec(ShellServerTest.java:111)
> 	at org.apache.accumulo.test.ShellServerTest.debug(ShellServerTest.java:262)
> 	at sun.reflect.NativeMethodAccessorImpl.invoke0(Native Method)
> 	at sun.reflect.NativeMethodAccessorImpl.invoke(NativeMethodAccessorImpl.java:57)
> 	at sun.reflect.DelegatingMethodAccessorImpl.invoke(DelegatingMethodAccessorImpl.java:43)
> 	at java.lang.reflect.Method.invoke(Method.java:606)
> 	at org.junit.runners.model.FrameworkMethod$1.runReflectiveCall(FrameworkMethod.java:47)
> 	at org.junit.internal.runners.model.ReflectiveCallable.run(ReflectiveCallable.java:12)
> 	at org.junit.runners.model.FrameworkMethod.invokeExplosively(FrameworkMethod.java:44)
> 	at org.junit.internal.runners.statements.InvokeMethod.evaluate(InvokeMethod.java:17)
> 	at org.junit.internal.runners.statements.FailOnTimeout$StatementThread.run(FailOnTimeout.java:74)
> egrep(org.apache.accumulo.test.ShellServerTest)  Time elapsed: 0.092 sec  <<<
FAILURE!
> java.lang.AssertionError: expected:<0> but was:<3>
> 	at org.junit.Assert.fail(Assert.java:88)
> 	at org.junit.Assert.failNotEquals(Assert.java:743)
> 	at org.junit.Assert.assertEquals(Assert.java:118)
> 	at org.junit.Assert.assertEquals(Assert.java:555)
> 	at org.junit.Assert.assertEquals(Assert.java:542)
> 	at org.apache.accumulo.test.ShellServerTest.assertGoodExit(ShellServerTest.java:119)
> 	at org.apache.accumulo.test.ShellServerTest.exec(ShellServerTest.java:98)
> 	at org.apache.accumulo.test.ShellServerTest.egrep(ShellServerTest.java:241)
> 	at sun.reflect.NativeMethodAccessorImpl.invoke0(Native Method)
> 	at sun.reflect.NativeMethodAccessorImpl.invoke(NativeMethodAccessorImpl.java:57)
> 	at sun.reflect.DelegatingMethodAccessorImpl.invoke(DelegatingMethodAccessorImpl.java:43)
> 	at java.lang.reflect.Method.invoke(Method.java:606)
> 	at org.junit.runners.model.FrameworkMethod$1.runReflectiveCall(FrameworkMethod.java:47)
> 	at org.junit.internal.runners.model.ReflectiveCallable.run(ReflectiveCallable.java:12)
> 	at org.junit.runners.model.FrameworkMethod.invokeExplosively(FrameworkMethod.java:44)
> 	at org.junit.internal.runners.statements.InvokeMethod.evaluate(InvokeMethod.java:17)
> 	at org.junit.internal.runners.statements.FailOnTimeout$StatementThread.run(FailOnTimeout.java:74)
> merge(org.apache.accumulo.test.ShellServerTest)  Time elapsed: 0.428 sec  <<<
FAILURE!
> java.lang.AssertionError: expected:<0> but was:<4>
> 	at org.junit.Assert.fail(Assert.java:88)
> 	at org.junit.Assert.failNotEquals(Assert.java:743)
> 	at org.junit.Assert.assertEquals(Assert.java:118)
> 	at org.junit.Assert.assertEquals(Assert.java:555)
> 	at org.junit.Assert.assertEquals(Assert.java:542)
> 	at org.apache.accumulo.test.ShellServerTest.assertGoodExit(ShellServerTest.java:119)
> 	at org.apache.accumulo.test.ShellServerTest.exec(ShellServerTest.java:111)
> 	at org.apache.accumulo.test.ShellServerTest.merge(ShellServerTest.java:632)
> 	at sun.reflect.NativeMethodAccessorImpl.invoke0(Native Method)
> 	at sun.reflect.NativeMethodAccessorImpl.invoke(NativeMethodAccessorImpl.java:57)
> 	at sun.reflect.DelegatingMethodAccessorImpl.invoke(DelegatingMethodAccessorImpl.java:43)
> 	at java.lang.reflect.Method.invoke(Method.java:606)
> 	at org.junit.runners.model.FrameworkMethod$1.runReflectiveCall(FrameworkMethod.java:47)
> 	at org.junit.internal.runners.model.ReflectiveCallable.run(ReflectiveCallable.java:12)
> 	at org.junit.runners.model.FrameworkMethod.invokeExplosively(FrameworkMethod.java:44)
> 	at org.junit.internal.runners.statements.InvokeMethod.evaluate(InvokeMethod.java:17)
> 	at org.junit.internal.runners.statements.FailOnTimeout$StatementThread.run(FailOnTimeout.java:74)
> sleep(org.apache.accumulo.test.ShellServerTest)  Time elapsed: 0.202 sec  <<<
FAILURE!
> java.lang.AssertionError: expected:<0> but was:<4>
> 	at org.junit.Assert.fail(Assert.java:88)
> 	at org.junit.Assert.failNotEquals(Assert.java:743)
> 	at org.junit.Assert.assertEquals(Assert.java:118)
> 	at org.junit.Assert.assertEquals(Assert.java:555)
> 	at org.junit.Assert.assertEquals(Assert.java:542)
> 	at org.apache.accumulo.test.ShellServerTest.assertGoodExit(ShellServerTest.java:119)
> 	at org.apache.accumulo.test.ShellServerTest.exec(ShellServerTest.java:98)
> 	at org.apache.accumulo.test.ShellServerTest.sleep(ShellServerTest.java:364)
> 	at sun.reflect.NativeMethodAccessorImpl.invoke0(Native Method)
> 	at sun.reflect.NativeMethodAccessorImpl.invoke(NativeMethodAccessorImpl.java:57)
> 	at sun.reflect.DelegatingMethodAccessorImpl.invoke(DelegatingMethodAccessorImpl.java:43)
> 	at java.lang.reflect.Method.invoke(Method.java:606)
> 	at org.junit.runners.model.FrameworkMethod$1.runReflectiveCall(FrameworkMethod.java:47)
> 	at org.junit.internal.runners.model.ReflectiveCallable.run(ReflectiveCallable.java:12)
> 	at org.junit.runners.model.FrameworkMethod.invokeExplosively(FrameworkMethod.java:44)
> 	at org.junit.internal.runners.statements.InvokeMethod.evaluate(InvokeMethod.java:17)
> 	at org.junit.internal.runners.statements.FailOnTimeout$StatementThread.run(FailOnTimeout.java:74)
> trace(org.apache.accumulo.test.ShellServerTest)  Time elapsed: 0.007 sec  <<<
FAILURE!
> java.lang.AssertionError: expected:<0> but was:<4>
> 	at org.junit.Assert.fail(Assert.java:88)
> 	at org.junit.Assert.failNotEquals(Assert.java:743)
> 	at org.junit.Assert.assertEquals(Assert.java:118)
> 	at org.junit.Assert.assertEquals(Assert.java:555)
> 	at org.junit.Assert.assertEquals(Assert.java:542)
> 	at org.apache.accumulo.test.ShellServerTest.assertGoodExit(ShellServerTest.java:119)
> 	at org.apache.accumulo.test.ShellServerTest.exec(ShellServerTest.java:98)
> 	at org.apache.accumulo.test.ShellServerTest.trace(ShellServerTest.java:754)
> 	at sun.reflect.NativeMethodAccessorImpl.invoke0(Native Method)
> 	at sun.reflect.NativeMethodAccessorImpl.invoke(NativeMethodAccessorImpl.java:57)
> 	at sun.reflect.DelegatingMethodAccessorImpl.invoke(DelegatingMethodAccessorImpl.java:43)
> 	at java.lang.reflect.Method.invoke(Method.java:606)
> 	at org.junit.runners.model.FrameworkMethod$1.runReflectiveCall(FrameworkMethod.java:47)
> 	at org.junit.internal.runners.model.ReflectiveCallable.run(ReflectiveCallable.java:12)
> 	at org.junit.runners.model.FrameworkMethod.invokeExplosively(FrameworkMethod.java:44)
> 	at org.junit.internal.runners.statements.InvokeMethod.evaluate(InvokeMethod.java:17)
> 	at org.junit.internal.runners.statements.FailOnTimeout$StatementThread.run(FailOnTimeout.java:74)
> testPertableClasspath(org.apache.accumulo.test.ShellServerTest)  Time elapsed: 0.043
sec  <<< FAILURE!
> java.lang.AssertionError: expected:<0> but was:<4>
> 	at org.junit.Assert.fail(Assert.java:88)
> 	at org.junit.Assert.failNotEquals(Assert.java:743)
> 	at org.junit.Assert.assertEquals(Assert.java:118)
> 	at org.junit.Assert.assertEquals(Assert.java:555)
> 	at org.junit.Assert.assertEquals(Assert.java:542)
> 	at org.apache.accumulo.test.ShellServerTest.assertGoodExit(ShellServerTest.java:119)
> 	at org.apache.accumulo.test.ShellServerTest.exec(ShellServerTest.java:98)
> 	at org.apache.accumulo.test.ShellServerTest.testPertableClasspath(ShellServerTest.java:720)
> 	at sun.reflect.NativeMethodAccessorImpl.invoke0(Native Method)
> 	at sun.reflect.NativeMethodAccessorImpl.invoke(NativeMethodAccessorImpl.java:57)
> 	at sun.reflect.DelegatingMethodAccessorImpl.invoke(DelegatingMethodAccessorImpl.java:43)
> 	at java.lang.reflect.Method.invoke(Method.java:606)
> 	at org.junit.runners.model.FrameworkMethod$1.runReflectiveCall(FrameworkMethod.java:47)
> 	at org.junit.internal.runners.model.ReflectiveCallable.run(ReflectiveCallable.java:12)
> 	at org.junit.runners.model.FrameworkMethod.invokeExplosively(FrameworkMethod.java:44)
> 	at org.junit.internal.runners.statements.InvokeMethod.evaluate(InvokeMethod.java:17)
> 	at org.junit.internal.runners.statements.FailOnTimeout$StatementThread.run(FailOnTimeout.java:74)
> setscaniterDeletescaniter(org.apache.accumulo.test.ShellServerTest)  Time elapsed: 0.1
sec  <<< FAILURE!
> java.lang.AssertionError: expected:<0> but was:<5>
> 	at org.junit.Assert.fail(Assert.java:88)
> 	at org.junit.Assert.failNotEquals(Assert.java:743)
> 	at org.junit.Assert.assertEquals(Assert.java:118)
> 	at org.junit.Assert.assertEquals(Assert.java:555)
> 	at org.junit.Assert.assertEquals(Assert.java:542)
> 	at org.apache.accumulo.test.ShellServerTest.assertGoodExit(ShellServerTest.java:119)
> 	at org.apache.accumulo.test.ShellServerTest.exec(ShellServerTest.java:98)
> 	at org.apache.accumulo.test.ShellServerTest.setscaniterDeletescaniter(ShellServerTest.java:217)
> 	at sun.reflect.NativeMethodAccessorImpl.invoke0(Native Method)
> 	at sun.reflect.NativeMethodAccessorImpl.invoke(NativeMethodAccessorImpl.java:57)
> 	at sun.reflect.DelegatingMethodAccessorImpl.invoke(DelegatingMethodAccessorImpl.java:43)
> 	at java.lang.reflect.Method.invoke(Method.java:606)
> 	at org.junit.runners.model.FrameworkMethod$1.runReflectiveCall(FrameworkMethod.java:47)
> 	at org.junit.internal.runners.model.ReflectiveCallable.run(ReflectiveCallable.java:12)
> 	at org.junit.runners.model.FrameworkMethod.invokeExplosively(FrameworkMethod.java:44)
> 	at org.junit.internal.runners.statements.InvokeMethod.evaluate(InvokeMethod.java:17)
> 	at org.junit.internal.runners.statements.FailOnTimeout$StatementThread.run(FailOnTimeout.java:74)
> clearCls(org.apache.accumulo.test.ShellServerTest)  Time elapsed: 0.002 sec  <<<
FAILURE!
> java.lang.AssertionError: expected:<0> but was:<5>
> 	at org.junit.Assert.fail(Assert.java:88)
> 	at org.junit.Assert.failNotEquals(Assert.java:743)
> 	at org.junit.Assert.assertEquals(Assert.java:118)
> 	at org.junit.Assert.assertEquals(Assert.java:555)
> 	at org.junit.Assert.assertEquals(Assert.java:542)
> 	at org.apache.accumulo.test.ShellServerTest.assertGoodExit(ShellServerTest.java:119)
> 	at org.apache.accumulo.test.ShellServerTest.exec(ShellServerTest.java:111)
> 	at org.apache.accumulo.test.ShellServerTest.exec(ShellServerTest.java:105)
> 	at org.apache.accumulo.test.ShellServerTest.clearCls(ShellServerTest.java:404)
> 	at sun.reflect.NativeMethodAccessorImpl.invoke0(Native Method)
> 	at sun.reflect.NativeMethodAccessorImpl.invoke(NativeMethodAccessorImpl.java:57)
> 	at sun.reflect.DelegatingMethodAccessorImpl.invoke(DelegatingMethodAccessorImpl.java:43)
> 	at java.lang.reflect.Method.invoke(Method.java:606)
> 	at org.junit.runners.model.FrameworkMethod$1.runReflectiveCall(FrameworkMethod.java:47)
> 	at org.junit.internal.runners.model.ReflectiveCallable.run(ReflectiveCallable.java:12)
> 	at org.junit.runners.model.FrameworkMethod.invokeExplosively(FrameworkMethod.java:44)
> 	at org.junit.internal.runners.statements.InvokeMethod.evaluate(InvokeMethod.java:17)
> 	at org.junit.internal.runners.statements.FailOnTimeout$StatementThread.run(FailOnTimeout.java:74)
> deletemany(org.apache.accumulo.test.ShellServerTest)  Time elapsed: 0.825 sec  <<<
FAILURE!
> java.lang.AssertionError: expected:<10> but was:<1>
> 	at org.junit.Assert.fail(Assert.java:88)
> 	at org.junit.Assert.failNotEquals(Assert.java:743)
> 	at org.junit.Assert.assertEquals(Assert.java:118)
> 	at org.junit.Assert.assertEquals(Assert.java:555)
> 	at org.junit.Assert.assertEquals(Assert.java:542)
> 	at org.apache.accumulo.test.ShellServerTest.deletemany(ShellServerTest.java:469)
> 	at sun.reflect.NativeMethodAccessorImpl.invoke0(Native Method)
> 	at sun.reflect.NativeMethodAccessorImpl.invoke(NativeMethodAccessorImpl.java:57)
> 	at sun.reflect.DelegatingMethodAccessorImpl.invoke(DelegatingMethodAccessorImpl.java:43)
> 	at java.lang.reflect.Method.invoke(Method.java:606)
> 	at org.junit.runners.model.FrameworkMethod$1.runReflectiveCall(FrameworkMethod.java:47)
> 	at org.junit.internal.runners.model.ReflectiveCallable.run(ReflectiveCallable.java:12)
> 	at org.junit.runners.model.FrameworkMethod.invokeExplosively(FrameworkMethod.java:44)
> 	at org.junit.internal.runners.statements.InvokeMethod.evaluate(InvokeMethod.java:17)
> 	at org.junit.internal.runners.statements.FailOnTimeout$StatementThread.run(FailOnTimeout.java:74)
> deleterows(org.apache.accumulo.test.ShellServerTest)  Time elapsed: 2.338 sec  <<<
FAILURE!
> java.lang.AssertionError
> 	at org.junit.Assert.fail(Assert.java:86)
> 	at org.junit.Assert.assertTrue(Assert.java:41)
> 	at org.junit.Assert.assertTrue(Assert.java:52)
> 	at org.apache.accumulo.test.ShellServerTest.deleterows(ShellServerTest.java:499)
> 	at sun.reflect.NativeMethodAccessorImpl.invoke0(Native Method)
> 	at sun.reflect.NativeMethodAccessorImpl.invoke(NativeMethodAccessorImpl.java:57)
> 	at sun.reflect.DelegatingMethodAccessorImpl.invoke(DelegatingMethodAccessorImpl.java:43)
> 	at java.lang.reflect.Method.invoke(Method.java:606)
> 	at org.junit.runners.model.FrameworkMethod$1.runReflectiveCall(FrameworkMethod.java:47)
> 	at org.junit.internal.runners.model.ReflectiveCallable.run(ReflectiveCallable.java:12)
> 	at org.junit.runners.model.FrameworkMethod.invokeExplosively(FrameworkMethod.java:44)
> 	at org.junit.internal.runners.statements.InvokeMethod.evaluate(InvokeMethod.java:17)
> 	at org.junit.internal.runners.statements.FailOnTimeout$StatementThread.run(FailOnTimeout.java:74)
> execfile(org.apache.accumulo.test.ShellServerTest)  Time elapsed: 0.022 sec  <<<
FAILURE!
> java.lang.AssertionError: expected:<0> but was:<8>
> 	at org.junit.Assert.fail(Assert.java:88)
> 	at org.junit.Assert.failNotEquals(Assert.java:743)
> 	at org.junit.Assert.assertEquals(Assert.java:118)
> 	at org.junit.Assert.assertEquals(Assert.java:555)
> 	at org.junit.Assert.assertEquals(Assert.java:542)
> 	at org.apache.accumulo.test.ShellServerTest.assertGoodExit(ShellServerTest.java:119)
> 	at org.apache.accumulo.test.ShellServerTest.exec(ShellServerTest.java:111)
> 	at org.apache.accumulo.test.ShellServerTest.execfile(ShellServerTest.java:232)
> 	at sun.reflect.NativeMethodAccessorImpl.invoke0(Native Method)
> 	at sun.reflect.NativeMethodAccessorImpl.invoke(NativeMethodAccessorImpl.java:57)
> 	at sun.reflect.DelegatingMethodAccessorImpl.invoke(DelegatingMethodAccessorImpl.java:43)
> 	at java.lang.reflect.Method.invoke(Method.java:606)
> 	at org.junit.runners.model.FrameworkMethod$1.runReflectiveCall(FrameworkMethod.java:47)
> 	at org.junit.internal.runners.model.ReflectiveCallable.run(ReflectiveCallable.java:12)
> 	at org.junit.runners.model.FrameworkMethod.invokeExplosively(FrameworkMethod.java:44)
> 	at org.junit.internal.runners.statements.InvokeMethod.evaluate(InvokeMethod.java:17)
> 	at org.junit.internal.runners.statements.FailOnTimeout$StatementThread.run(FailOnTimeout.java:74)
> clonetable(org.apache.accumulo.test.ShellServerTest)  Time elapsed: 0.433 sec  <<<
FAILURE!
> java.lang.AssertionError: expected:<0> but was:<8>
> 	at org.junit.Assert.fail(Assert.java:88)
> 	at org.junit.Assert.failNotEquals(Assert.java:743)
> 	at org.junit.Assert.assertEquals(Assert.java:118)
> 	at org.junit.Assert.assertEquals(Assert.java:555)
> 	at org.junit.Assert.assertEquals(Assert.java:542)
> 	at org.apache.accumulo.test.ShellServerTest.assertGoodExit(ShellServerTest.java:119)
> 	at org.apache.accumulo.test.ShellServerTest.exec(ShellServerTest.java:98)
> 	at org.apache.accumulo.test.ShellServerTest.clonetable(ShellServerTest.java:412)
> 	at sun.reflect.NativeMethodAccessorImpl.invoke0(Native Method)
> 	at sun.reflect.NativeMethodAccessorImpl.invoke(NativeMethodAccessorImpl.java:57)
> 	at sun.reflect.DelegatingMethodAccessorImpl.invoke(DelegatingMethodAccessorImpl.java:43)
> 	at java.lang.reflect.Method.invoke(Method.java:606)
> 	at org.junit.runners.model.FrameworkMethod$1.runReflectiveCall(FrameworkMethod.java:47)
> 	at org.junit.internal.runners.model.ReflectiveCallable.run(ReflectiveCallable.java:12)
> 	at org.junit.runners.model.FrameworkMethod.invokeExplosively(FrameworkMethod.java:44)
> 	at org.junit.internal.runners.statements.InvokeMethod.evaluate(InvokeMethod.java:17)
> 	at org.junit.internal.runners.statements.FailOnTimeout$StatementThread.run(FailOnTimeout.java:74)
> notable(org.apache.accumulo.test.ShellServerTest)  Time elapsed: 0.459 sec  <<<
FAILURE!
> java.lang.AssertionError: expected:<0> but was:<8>
> 	at org.junit.Assert.fail(Assert.java:88)
> 	at org.junit.Assert.failNotEquals(Assert.java:743)
> 	at org.junit.Assert.assertEquals(Assert.java:118)
> 	at org.junit.Assert.assertEquals(Assert.java:555)
> 	at org.junit.Assert.assertEquals(Assert.java:542)
> 	at org.apache.accumulo.test.ShellServerTest.assertGoodExit(ShellServerTest.java:119)
> 	at org.apache.accumulo.test.ShellServerTest.exec(ShellServerTest.java:98)
> 	at org.apache.accumulo.test.ShellServerTest.notable(ShellServerTest.java:351)
> 	at sun.reflect.NativeMethodAccessorImpl.invoke0(Native Method)
> 	at sun.reflect.NativeMethodAccessorImpl.invoke(NativeMethodAccessorImpl.java:57)
> 	at sun.reflect.DelegatingMethodAccessorImpl.invoke(DelegatingMethodAccessorImpl.java:43)
> 	at java.lang.reflect.Method.invoke(Method.java:606)
> 	at org.junit.runners.model.FrameworkMethod$1.runReflectiveCall(FrameworkMethod.java:47)
> 	at org.junit.internal.runners.model.ReflectiveCallable.run(ReflectiveCallable.java:12)
> 	at org.junit.runners.model.FrameworkMethod.invokeExplosively(FrameworkMethod.java:44)
> 	at org.junit.internal.runners.statements.InvokeMethod.evaluate(InvokeMethod.java:17)
> 	at org.junit.internal.runners.statements.FailOnTimeout$StatementThread.run(FailOnTimeout.java:74)
> {noformat}
> All of them appear to have the same STDOUT, but differing non-zero exit codes.
> {noformat}
> Standard Output
> 2013-11-18 19:05:35,940 [vfs.AccumuloVFSClassLoader] WARN : ignoring classpath entry
file:///lib/ext/[^.].*.jar
> Exception in thread "Thread-79" java.lang.NoClassDefFoundError: org/apache/commons/httpclient/HttpMethod
> 	at org.apache.hadoop.mapred.LocalJobRunner$Job.run(LocalJobRunner.java:437)
> Caused by: java.lang.ClassNotFoundException: org.apache.commons.httpclient.HttpMethod
> 	at java.net.URLClassLoader$1.run(URLClassLoader.java:366)
> 	at java.net.URLClassLoader$1.run(URLClassLoader.java:355)
> 	at java.security.AccessController.doPrivileged(Native Method)
> 	at java.net.URLClassLoader.findClass(URLClassLoader.java:354)
> 	at java.lang.ClassLoader.loadClass(ClassLoader.java:425)
> 	at sun.misc.Launcher$AppClassLoader.loadClass(Launcher.java:308)
> 	at java.lang.ClassLoader.loadClass(ClassLoader.java:358)
> 	... 1 more
> With failures, global counters are inaccurate; consider running with -i
> Copy failed: java.io.IOException: Job failed!
> 	at org.apache.hadoop.mapred.JobClient.runJob(JobClient.java:1357)
> 	at org.apache.hadoop.tools.DistCp.copy(DistCp.java:667)
> 	at org.apache.hadoop.tools.DistCp.run(DistCp.java:881)
> 	at org.apache.accumulo.test.ShellServerTest.exporttableImporttable(ShellServerTest.java:179)
> 	at sun.reflect.NativeMethodAccessorImpl.invoke0(Native Method)
> 	at sun.reflect.NativeMethodAccessorImpl.invoke(NativeMethodAccessorImpl.java:57)
> 	at sun.reflect.DelegatingMethodAccessorImpl.invoke(DelegatingMethodAccessorImpl.java:43)
> 	at java.lang.reflect.Method.invoke(Method.java:606)
> 	at org.junit.runners.model.FrameworkMethod$1.runReflectiveCall(FrameworkMethod.java:47)
> 	at org.junit.internal.runners.model.ReflectiveCallable.run(ReflectiveCallable.java:12)
> 	at org.junit.runners.model.FrameworkMethod.invokeExplosively(FrameworkMethod.java:44)
> 	at org.junit.internal.runners.statements.InvokeMethod.evaluate(InvokeMethod.java:17)
> 	at org.junit.internal.runners.statements.FailOnTimeout$StatementThread.run(FailOnTimeout.java:74)
> 2013-11-18 19:05:47,327 [client.ZooKeeperInstance] WARN : ZooKeeperInstance being cleaned
up without being closed. Please remember to call close() before dereferencing to clean up
threads.
> {noformat}



--
This message was sent by Atlassian JIRA
(v6.1.5#6160)

Mime
View raw message