accumulo-notifications mailing list archives

Site index · List index
Message view « Date » · « Thread »
Top « Date » · « Thread »
From "Billie Rinaldi (JIRA)" <j...@apache.org>
Subject [jira] [Resolved] (ACCUMULO-1875) Could not find artifact org.apache.accumulo:accumulo-native:tar.gz:1.7.0-SNAPSHOT
Date Wed, 13 Nov 2013 18:05:22 GMT

     [ https://issues.apache.org/jira/browse/ACCUMULO-1875?page=com.atlassian.jira.plugin.system.issuetabpanels:all-tabpanel
]

Billie Rinaldi resolved ACCUMULO-1875.
--------------------------------------

    Resolution: Invalid
      Assignee: Billie Rinaldi

There is an issue in the VM setup script.  The error disappears when I make it apt-get install
maven instead of maven3 and remove the line {{ln -s /usr/share/maven3/bin/mvn /usr/bin/mvn}}.

> Could not find artifact org.apache.accumulo:accumulo-native:tar.gz:1.7.0-SNAPSHOT
> ---------------------------------------------------------------------------------
>
>                 Key: ACCUMULO-1875
>                 URL: https://issues.apache.org/jira/browse/ACCUMULO-1875
>             Project: Accumulo
>          Issue Type: Bug
>          Components: build
>         Environment: Ubuntu 12.04 instance inside VirtualBox.
>            Reporter: David Medinets
>            Assignee: Billie Rinaldi
>
> Using Accumulo master, Hadoop 1.2.1 and Zookeeper 3.4.3 I created new virtual machines.
The Accumulo compilation failed with this error:
> INFO] Extra Server Utilities ............................ SUCCESS [1.090s]
> [INFO] Assemblies ........................................ FAILURE [0.637s]
> [INFO] Documentation ..................................... SKIPPED
> [INFO] ------------------------------------------------------------------------
> [INFO] BUILD FAILURE
> [INFO] ------------------------------------------------------------------------
> [INFO] Total time: 1:50.539s
> [INFO] Finished at: Sun Nov 10 15:55:58 UTC 2013
> [INFO] Final Memory: 60M/435M
> [INFO] ------------------------------------------------------------------------
> [ERROR] Failed to execute goal on project accumulo: Could not resolve dependencies for
project org.apache.accumulo:accumulo:pom:1.7.0-SNAPSHOT: Could not find artifact org.apache.accumulo:accumulo-native:tar.gz:1.7.0-SNAPSHOT
in apache.snapshots (http://repository.apache.org/snapshots) -> [Help 1]
> This error should be repeatable using https://github.com/medined/Accumulo_Snapshot_By_Vagrant/commits/HADOOP_1_2_1.



--
This message was sent by Atlassian JIRA
(v6.1#6144)

Mime
View raw message