accumulo-notifications mailing list archives

Site index · List index
Message view « Date » · « Thread »
Top « Date » · « Thread »
From Apache Jenkins Server <jenk...@builds.apache.org>
Subject Build failed in Jenkins: Accumulo-Trunk-Hadoop-2.0 #364
Date Sun, 01 Sep 2013 04:44:10 GMT
See <https://builds.apache.org/job/Accumulo-Trunk-Hadoop-2.0/364/>

------------------------------------------
[...truncated 289 lines...]
Sep 1, 2013 4:41:57 AM org.apache.maven.cli.event.ExecutionEventLogger mojoStarted
INFO: 
Sep 1, 2013 4:41:57 AM org.apache.maven.cli.event.ExecutionEventLogger mojoStarted
INFO: --- maven-failsafe-plugin:2.12.4:verify (run-integration-tests) @ accumulo-fate ---
[INFO] Failsafe report directory: <https://builds.apache.org/job/Accumulo-Trunk-Hadoop-2.0/ws/fate/target/failsafe-reports>
[JENKINS] Recording test resultsSep 1, 2013 4:41:57 AM org.apache.maven.cli.event.ExecutionEventLogger
mojoStarted
INFO: 
Sep 1, 2013 4:41:57 AM org.apache.maven.cli.event.ExecutionEventLogger mojoStarted
INFO: --- apache-rat-plugin:0.9:check (default) @ accumulo-fate ---
[INFO] 51 implicit excludes (use -debug for more details).
[INFO] No excludes explicitly specified.
[INFO] 28 resources included (use -debug for more details)

[INFO] Rat check: Summary of files. Unapproved: 0 unknown: 0 generated: 0 approved: 28 licence.
Sep 1, 2013 4:42:07 AM org.apache.maven.cli.event.ExecutionEventLogger projectStarted
INFO:                                                                         
Sep 1, 2013 4:42:07 AM org.apache.maven.cli.event.ExecutionEventLogger projectStarted
INFO: ------------------------------------------------------------------------
Sep 1, 2013 4:42:07 AM org.apache.maven.cli.event.ExecutionEventLogger projectStarted
INFO: Building Start 1.6.0-SNAPSHOT
Sep 1, 2013 4:42:07 AM org.apache.maven.cli.event.ExecutionEventLogger projectStarted
INFO: ------------------------------------------------------------------------
Sep 1, 2013 4:42:10 AM org.apache.maven.cli.event.ExecutionEventLogger mojoStarted
INFO: 
Sep 1, 2013 4:42:10 AM org.apache.maven.cli.event.ExecutionEventLogger mojoStarted
INFO: --- maven-clean-plugin:2.5:clean (default-clean) @ accumulo-start ---
[INFO] Deleting <https://builds.apache.org/job/Accumulo-Trunk-Hadoop-2.0/ws/start/target>
[INFO] Deleting <https://builds.apache.org/job/Accumulo-Trunk-Hadoop-2.0/ws/start> (includes
= [**/*.pyc, **/*.so], excludes = [])
Sep 1, 2013 4:42:10 AM org.apache.maven.cli.event.ExecutionEventLogger mojoStarted
INFO: 
Sep 1, 2013 4:42:10 AM org.apache.maven.cli.event.ExecutionEventLogger mojoStarted
INFO: --- maven-sortpom-plugin:2.1.0:verify (verify-sorted-pom) @ accumulo-start ---
[INFO] Verifying file <https://builds.apache.org/job/Accumulo-Trunk-Hadoop-2.0/ws/start/pom.xml>
Sep 1, 2013 4:42:10 AM org.apache.maven.cli.event.ExecutionEventLogger mojoStarted
INFO: 
Sep 1, 2013 4:42:10 AM org.apache.maven.cli.event.ExecutionEventLogger mojoStarted
INFO: --- maven-enforcer-plugin:1.0.1:enforce (enforce-mvn) @ accumulo-start ---
Sep 1, 2013 4:42:11 AM org.apache.maven.cli.event.ExecutionEventLogger mojoStarted
INFO: 
Sep 1, 2013 4:42:11 AM org.apache.maven.cli.event.ExecutionEventLogger mojoStarted
INFO: --- maven-remote-resources-plugin:1.4:process (default) @ accumulo-start ---
Sep 1, 2013 4:42:12 AM org.apache.maven.cli.event.ExecutionEventLogger mojoStarted
INFO: 
Sep 1, 2013 4:42:12 AM org.apache.maven.cli.event.ExecutionEventLogger mojoStarted
INFO: --- maven-resources-plugin:2.6:resources (default-resources) @ accumulo-start ---
[INFO] Using 'UTF-8' encoding to copy filtered resources.
[INFO] skip non existing resourceDirectory <https://builds.apache.org/job/Accumulo-Trunk-Hadoop-2.0/ws/start/src/main/resources>
[INFO] Copying 3 resources
Sep 1, 2013 4:42:13 AM org.apache.maven.cli.event.ExecutionEventLogger mojoStarted
INFO: 
Sep 1, 2013 4:42:13 AM org.apache.maven.cli.event.ExecutionEventLogger mojoStarted
INFO: --- maven-compiler-plugin:2.5.1:compile (default-compile) @ accumulo-start ---
[INFO] Compiling 19 source files to <https://builds.apache.org/job/Accumulo-Trunk-Hadoop-2.0/ws/start/target/classes>
Sep 1, 2013 4:42:13 AM org.apache.maven.cli.event.ExecutionEventLogger mojoStarted
INFO: 
Sep 1, 2013 4:42:13 AM org.apache.maven.cli.event.ExecutionEventLogger mojoStarted
INFO: --- maven-resources-plugin:2.6:testResources (default-testResources) @ accumulo-start
---
[INFO] Using 'UTF-8' encoding to copy filtered resources.
[INFO] Copying 6 resources
[INFO] Copying 3 resources
Sep 1, 2013 4:42:13 AM org.apache.maven.cli.event.ExecutionEventLogger mojoStarted
INFO: 
Sep 1, 2013 4:42:13 AM org.apache.maven.cli.event.ExecutionEventLogger mojoStarted
INFO: --- maven-compiler-plugin:2.5.1:testCompile (default-testCompile) @ accumulo-start ---
[INFO] Compiling 7 source files to <https://builds.apache.org/job/Accumulo-Trunk-Hadoop-2.0/ws/start/target/test-classes>
Sep 1, 2013 4:42:14 AM org.apache.maven.cli.event.ExecutionEventLogger mojoStarted
INFO: 
Sep 1, 2013 4:42:14 AM org.apache.maven.cli.event.ExecutionEventLogger mojoStarted
INFO: --- maven-surefire-plugin:2.12.4:test (default-test) @ accumulo-start ---
[INFO] Surefire report directory: <https://builds.apache.org/job/Accumulo-Trunk-Hadoop-2.0/ws/start/target/surefire-reports>

-------------------------------------------------------
 T E S T S
-------------------------------------------------------

-------------------------------------------------------
 T E S T S
-------------------------------------------------------
Running org.apache.accumulo.start.classloader.vfs.ContextManagerTest
Tests run: 2, Failures: 0, Errors: 0, Skipped: 0, Time elapsed: 0.282 sec
Running org.apache.accumulo.start.classloader.vfs.providers.ReadOnlyHdfsFileProviderTest
Tests run: 15, Failures: 0, Errors: 0, Skipped: 0, Time elapsed: 5.949 sec
Running org.apache.accumulo.start.classloader.vfs.providers.VfsClassLoaderTest
Tests run: 2, Failures: 0, Errors: 0, Skipped: 0, Time elapsed: 10.9 sec
Running org.apache.accumulo.start.classloader.vfs.AccumuloReloadingVFSClassLoaderTest
Tests run: 3, Failures: 0, Errors: 0, Skipped: 0, Time elapsed: 5.271 sec
Running org.apache.accumulo.start.classloader.vfs.AccumuloVFSClassLoaderTest
Tests run: 2, Failures: 0, Errors: 0, Skipped: 0, Time elapsed: 1.495 sec

Results :

Tests run: 24, Failures: 0, Errors: 0, Skipped: 0

[JENKINS] Recording test results
Sep 1, 2013 4:42:41 AM org.apache.maven.cli.event.ExecutionEventLogger mojoStarted
INFO: 
Sep 1, 2013 4:42:41 AM org.apache.maven.cli.event.ExecutionEventLogger mojoStarted
INFO: --- maven-jar-plugin:2.4:jar (default-jar) @ accumulo-start ---
[INFO] Building jar: <https://builds.apache.org/job/Accumulo-Trunk-Hadoop-2.0/ws/start/target/accumulo-start-1.6.0-SNAPSHOT.jar>
Sep 1, 2013 4:42:41 AM org.apache.maven.cli.event.ExecutionEventLogger mojoStarted
INFO: 
Sep 1, 2013 4:42:41 AM org.apache.maven.cli.event.ExecutionEventLogger mojoStarted
INFO: --- maven-site-plugin:3.2:attach-descriptor (attach-descriptor) @ accumulo-start ---
Sep 1, 2013 4:42:41 AM org.apache.maven.cli.event.ExecutionEventLogger mojoStarted
INFO: 
Sep 1, 2013 4:42:41 AM org.apache.maven.cli.event.ExecutionEventLogger mojoStarted
INFO: --- maven-failsafe-plugin:2.12.4:integration-test (run-integration-tests) @ accumulo-start
---
[JENKINS] Recording test results
Sep 1, 2013 4:42:41 AM org.apache.maven.cli.event.ExecutionEventLogger mojoStarted
INFO: 
Sep 1, 2013 4:42:41 AM org.apache.maven.cli.event.ExecutionEventLogger mojoStarted
INFO: --- maven-failsafe-plugin:2.12.4:verify (run-integration-tests) @ accumulo-start ---
[INFO] Failsafe report directory: <https://builds.apache.org/job/Accumulo-Trunk-Hadoop-2.0/ws/start/target/failsafe-reports>
Sep 1, 2013 4:42:41 AM org.apache.maven.cli.event.ExecutionEventLogger mojoStarted
INFO: 
[JENKINS] Recording test resultsSep 1, 2013 4:42:41 AM org.apache.maven.cli.event.ExecutionEventLogger
mojoStarted
INFO: --- apache-rat-plugin:0.9:check (default) @ accumulo-start ---
[INFO] 51 implicit excludes (use -debug for more details).
[INFO] No excludes explicitly specified.
[INFO] 36 resources included (use -debug for more details)

[INFO] Rat check: Summary of files. Unapproved: 0 unknown: 0 generated: 0 approved: 31 licence.
Sep 1, 2013 4:42:50 AM org.apache.maven.cli.event.ExecutionEventLogger projectStarted
INFO:                                                                         
Sep 1, 2013 4:42:50 AM org.apache.maven.cli.event.ExecutionEventLogger projectStarted
INFO: ------------------------------------------------------------------------
Sep 1, 2013 4:42:50 AM org.apache.maven.cli.event.ExecutionEventLogger projectStarted
INFO: Building Core 1.6.0-SNAPSHOT
Sep 1, 2013 4:42:50 AM org.apache.maven.cli.event.ExecutionEventLogger projectStarted
INFO: ------------------------------------------------------------------------
Sep 1, 2013 4:42:50 AM org.apache.maven.cli.event.ExecutionEventLogger mojoStarted
INFO: 
Sep 1, 2013 4:42:50 AM org.apache.maven.cli.event.ExecutionEventLogger mojoStarted
INFO: --- maven-clean-plugin:2.5:clean (default-clean) @ accumulo-core ---
[INFO] Deleting <https://builds.apache.org/job/Accumulo-Trunk-Hadoop-2.0/ws/core/target>
[INFO] Deleting <https://builds.apache.org/job/Accumulo-Trunk-Hadoop-2.0/ws/core> (includes
= [**/*.pyc, **/*.so], excludes = [])
Sep 1, 2013 4:42:51 AM org.apache.maven.cli.event.ExecutionEventLogger mojoStarted
INFO: 
Sep 1, 2013 4:42:51 AM org.apache.maven.cli.event.ExecutionEventLogger mojoStarted
INFO: --- maven-sortpom-plugin:2.1.0:verify (verify-sorted-pom) @ accumulo-core ---
[INFO] Verifying file <https://builds.apache.org/job/Accumulo-Trunk-Hadoop-2.0/ws/core/pom.xml>
Sep 1, 2013 4:42:51 AM org.apache.maven.cli.event.ExecutionEventLogger mojoStarted
INFO: 
Sep 1, 2013 4:42:51 AM org.apache.maven.cli.event.ExecutionEventLogger mojoStarted
INFO: --- maven-enforcer-plugin:1.0.1:enforce (enforce-mvn) @ accumulo-core ---
Sep 1, 2013 4:42:51 AM org.apache.maven.cli.event.ExecutionEventLogger mojoStarted
INFO: 
Sep 1, 2013 4:42:51 AM org.apache.maven.cli.event.ExecutionEventLogger mojoStarted
INFO: --- maven-resources-plugin:2.6:copy-resources (prepare-filtered-java-source) @ accumulo-core
---
[INFO] Using 'UTF-8' encoding to copy filtered resources.
[INFO] Copying 1 resource
Sep 1, 2013 4:42:51 AM org.apache.maven.cli.event.ExecutionEventLogger mojoStarted
INFO: 
Sep 1, 2013 4:42:51 AM org.apache.maven.cli.event.ExecutionEventLogger mojoStarted
INFO: --- build-helper-maven-plugin:1.8:add-source (add-filtered-java-source) @ accumulo-core
---
[INFO] Source directory: <https://builds.apache.org/job/Accumulo-Trunk-Hadoop-2.0/ws/core/target/filtered-java-src>
added.
Sep 1, 2013 4:42:51 AM org.apache.maven.cli.event.ExecutionEventLogger mojoStarted
INFO: 
Sep 1, 2013 4:42:51 AM org.apache.maven.cli.event.ExecutionEventLogger mojoStarted
INFO: --- maven-remote-resources-plugin:1.4:process (default) @ accumulo-core ---
Sep 1, 2013 4:42:51 AM org.apache.maven.cli.event.ExecutionEventLogger mojoStarted
INFO: 
Sep 1, 2013 4:42:51 AM org.apache.maven.cli.event.ExecutionEventLogger mojoStarted
INFO: --- maven-resources-plugin:2.6:resources (default-resources) @ accumulo-core ---
[INFO] Using 'UTF-8' encoding to copy filtered resources.
[INFO] Copying 1 resource
[INFO] Copying 3 resources
Sep 1, 2013 4:42:51 AM org.apache.maven.cli.event.ExecutionEventLogger mojoStarted
INFO: 
Sep 1, 2013 4:42:51 AM org.apache.maven.cli.event.ExecutionEventLogger mojoStarted
INFO: --- maven-compiler-plugin:2.5.1:compile (default-compile) @ accumulo-core ---
[INFO] Compiling 535 source files to <https://builds.apache.org/job/Accumulo-Trunk-Hadoop-2.0/ws/core/target/classes>
[INFO] -------------------------------------------------------------
[ERROR] COMPILATION ERROR : 
[INFO] -------------------------------------------------------------
[ERROR] <https://builds.apache.org/job/Accumulo-Trunk-Hadoop-2.0/ws/core/src/main/java/org/apache/accumulo/core/util/shell/ShellOptionsJC.java>:[60,18]
cannot find symbol
symbol  : constructor ParameterException(java.lang.String,java.io.FileNotFoundException)
location: class com.beust.jcommander.ParameterException
[INFO] 1 error
[INFO] -------------------------------------------------------------
Sep 1, 2013 4:42:59 AM org.apache.maven.cli.event.ExecutionEventLogger logReactorSummary
INFO: ------------------------------------------------------------------------
Sep 1, 2013 4:42:59 AM org.apache.maven.cli.event.ExecutionEventLogger logReactorSummary
INFO: Reactor Summary:
Sep 1, 2013 4:42:59 AM org.apache.maven.cli.event.ExecutionEventLogger logReactorSummary
INFO: 
Sep 1, 2013 4:42:59 AM org.apache.maven.cli.event.ExecutionEventLogger logReactorSummary
INFO: Apache Accumulo Project ........................... SUCCESS [37.510s]
Sep 1, 2013 4:42:59 AM org.apache.maven.cli.event.ExecutionEventLogger logReactorSummary
INFO: Trace ............................................. SUCCESS [13.709s]
Sep 1, 2013 4:42:59 AM org.apache.maven.cli.event.ExecutionEventLogger logReactorSummary
INFO: Fate .............................................. SUCCESS [10.165s]
Sep 1, 2013 4:42:59 AM org.apache.maven.cli.event.ExecutionEventLogger logReactorSummary
INFO: Start ............................................. SUCCESS [44.103s]
Sep 1, 2013 4:42:59 AM org.apache.maven.cli.event.ExecutionEventLogger logReactorSummary
INFO: Core .............................................. FAILURE [16.859s]
Sep 1, 2013 4:42:59 AM org.apache.maven.cli.event.ExecutionEventLogger logReactorSummary
INFO: Server ............................................ SKIPPED
Sep 1, 2013 4:42:59 AM org.apache.maven.cli.event.ExecutionEventLogger logReactorSummary
INFO: Examples .......................................... SKIPPED
Sep 1, 2013 4:42:59 AM org.apache.maven.cli.event.ExecutionEventLogger logReactorSummary
INFO: Simple Examples ................................... SKIPPED
Sep 1, 2013 4:42:59 AM org.apache.maven.cli.event.ExecutionEventLogger logReactorSummary
INFO: MiniCluster ....................................... SKIPPED
Sep 1, 2013 4:42:59 AM org.apache.maven.cli.event.ExecutionEventLogger logReactorSummary
INFO: Accumulo Maven Plugin ............................. SKIPPED
Sep 1, 2013 4:42:59 AM org.apache.maven.cli.event.ExecutionEventLogger logReactorSummary
INFO: Testing ........................................... SKIPPED
Sep 1, 2013 4:42:59 AM org.apache.maven.cli.event.ExecutionEventLogger logReactorSummary
INFO: Proxy ............................................. SKIPPED
Sep 1, 2013 4:42:59 AM org.apache.maven.cli.event.ExecutionEventLogger logReactorSummary
INFO: Assemblies ........................................ SKIPPED
Sep 1, 2013 4:42:59 AM org.apache.maven.cli.event.ExecutionEventLogger logReactorSummary
INFO: Documentation ..................................... SKIPPED
Sep 1, 2013 4:42:59 AM org.apache.maven.cli.event.ExecutionEventLogger logResult
INFO: ------------------------------------------------------------------------
Sep 1, 2013 4:42:59 AM org.apache.maven.cli.event.ExecutionEventLogger logResult
INFO: BUILD FAILURE
Sep 1, 2013 4:42:59 AM org.apache.maven.cli.event.ExecutionEventLogger logStats
INFO: ------------------------------------------------------------------------
Sep 1, 2013 4:42:59 AM org.apache.maven.cli.event.ExecutionEventLogger logStats
INFO: Total time: 2:06.067s
Sep 1, 2013 4:42:59 AM org.apache.maven.cli.event.ExecutionEventLogger logStats
INFO: Finished at: Sun Sep 01 04:42:59 UTC 2013
Sep 1, 2013 4:42:59 AM org.apache.maven.cli.event.ExecutionEventLogger logStats
INFO: Final Memory: 34M/212M
Sep 1, 2013 4:42:59 AM org.apache.maven.cli.event.ExecutionEventLogger sessionEnded
INFO: ------------------------------------------------------------------------
[JENKINS] Archiving <https://builds.apache.org/job/Accumulo-Trunk-Hadoop-2.0/ws/pom.xml>
to /home/hudson/hudson/jobs/Accumulo-Trunk-Hadoop-2.0/modules/org.apache.accumulo$accumulo-project/builds/2013-09-01_04-40-45/archive/org.apache.accumulo/accumulo-project/1.6.0-SNAPSHOT/accumulo-project-1.6.0-SNAPSHOT.pom
[JENKINS] Archiving <https://builds.apache.org/job/Accumulo-Trunk-Hadoop-2.0/ws/target/accumulo-project-1.6.0-SNAPSHOT-site.xml>
to /home/hudson/hudson/jobs/Accumulo-Trunk-Hadoop-2.0/modules/org.apache.accumulo$accumulo-project/builds/2013-09-01_04-40-45/archive/org.apache.accumulo/accumulo-project/1.6.0-SNAPSHOT/accumulo-project-1.6.0-SNAPSHOT-site.xml
[JENKINS] Archiving <https://builds.apache.org/job/Accumulo-Trunk-Hadoop-2.0/ws/server/pom.xml>
to /home/hudson/hudson/jobs/Accumulo-Trunk-Hadoop-2.0/modules/org.apache.accumulo$accumulo-server/builds/2013-09-01_04-40-45/archive/org.apache.accumulo/accumulo-server/1.6.0-SNAPSHOT/accumulo-server-1.6.0-SNAPSHOT.pom
[JENKINS] Archiving <https://builds.apache.org/job/Accumulo-Trunk-Hadoop-2.0/ws/minicluster/pom.xml>
to /home/hudson/hudson/jobs/Accumulo-Trunk-Hadoop-2.0/modules/org.apache.accumulo$accumulo-minicluster/builds/2013-09-01_04-40-45/archive/org.apache.accumulo/accumulo-minicluster/1.6.0-SNAPSHOT/accumulo-minicluster-1.6.0-SNAPSHOT.pom
[JENKINS] Archiving <https://builds.apache.org/job/Accumulo-Trunk-Hadoop-2.0/ws/maven-plugin/pom.xml>
to /home/hudson/hudson/jobs/Accumulo-Trunk-Hadoop-2.0/modules/org.apache.accumulo$accumulo-maven-plugin/builds/2013-09-01_04-40-45/archive/org.apache.accumulo/accumulo-maven-plugin/1.6.0-SNAPSHOT/accumulo-maven-plugin-1.6.0-SNAPSHOT.pom
[JENKINS] Archiving <https://builds.apache.org/job/Accumulo-Trunk-Hadoop-2.0/ws/examples/simple/pom.xml>
to /home/hudson/hudson/jobs/Accumulo-Trunk-Hadoop-2.0/modules/org.apache.accumulo$accumulo-examples-simple/builds/2013-09-01_04-40-45/archive/org.apache.accumulo/accumulo-examples-simple/1.6.0-SNAPSHOT/accumulo-examples-simple-1.6.0-SNAPSHOT.pom
[JENKINS] Archiving <https://builds.apache.org/job/Accumulo-Trunk-Hadoop-2.0/ws/proxy/pom.xml>
to /home/hudson/hudson/jobs/Accumulo-Trunk-Hadoop-2.0/modules/org.apache.accumulo$accumulo-proxy/builds/2013-09-01_04-40-45/archive/org.apache.accumulo/accumulo-proxy/1.6.0-SNAPSHOT/accumulo-proxy-1.6.0-SNAPSHOT.pom
[JENKINS] Archiving <https://builds.apache.org/job/Accumulo-Trunk-Hadoop-2.0/ws/examples/pom.xml>
to /home/hudson/hudson/jobs/Accumulo-Trunk-Hadoop-2.0/modules/org.apache.accumulo$accumulo-examples/builds/2013-09-01_04-40-45/archive/org.apache.accumulo/accumulo-examples/1.6.0-SNAPSHOT/accumulo-examples-1.6.0-SNAPSHOT.pom
[JENKINS] Archiving <https://builds.apache.org/job/Accumulo-Trunk-Hadoop-2.0/ws/assemble/pom.xml>
to /home/hudson/hudson/jobs/Accumulo-Trunk-Hadoop-2.0/modules/org.apache.accumulo$accumulo/builds/2013-09-01_04-40-45/archive/org.apache.accumulo/accumulo/1.6.0-SNAPSHOT/accumulo-1.6.0-SNAPSHOT.pom
[JENKINS] Archiving <https://builds.apache.org/job/Accumulo-Trunk-Hadoop-2.0/ws/test/pom.xml>
to /home/hudson/hudson/jobs/Accumulo-Trunk-Hadoop-2.0/modules/org.apache.accumulo$accumulo-test/builds/2013-09-01_04-40-45/archive/org.apache.accumulo/accumulo-test/1.6.0-SNAPSHOT/accumulo-test-1.6.0-SNAPSHOT.pom
[JENKINS] Archiving <https://builds.apache.org/job/Accumulo-Trunk-Hadoop-2.0/ws/start/pom.xml>
to /home/hudson/hudson/jobs/Accumulo-Trunk-Hadoop-2.0/modules/org.apache.accumulo$accumulo-start/builds/2013-09-01_04-40-45/archive/org.apache.accumulo/accumulo-start/1.6.0-SNAPSHOT/accumulo-start-1.6.0-SNAPSHOT.pom
[JENKINS] Archiving <https://builds.apache.org/job/Accumulo-Trunk-Hadoop-2.0/ws/start/target/accumulo-start-1.6.0-SNAPSHOT.jar>
to /home/hudson/hudson/jobs/Accumulo-Trunk-Hadoop-2.0/modules/org.apache.accumulo$accumulo-start/builds/2013-09-01_04-40-45/archive/org.apache.accumulo/accumulo-start/1.6.0-SNAPSHOT/accumulo-start-1.6.0-SNAPSHOT.jar
[JENKINS] Archiving <https://builds.apache.org/job/Accumulo-Trunk-Hadoop-2.0/ws/fate/pom.xml>
to /home/hudson/hudson/jobs/Accumulo-Trunk-Hadoop-2.0/modules/org.apache.accumulo$accumulo-fate/builds/2013-09-01_04-40-45/archive/org.apache.accumulo/accumulo-fate/1.6.0-SNAPSHOT/accumulo-fate-1.6.0-SNAPSHOT.pom
[JENKINS] Archiving <https://builds.apache.org/job/Accumulo-Trunk-Hadoop-2.0/ws/fate/target/accumulo-fate-1.6.0-SNAPSHOT.jar>
to /home/hudson/hudson/jobs/Accumulo-Trunk-Hadoop-2.0/modules/org.apache.accumulo$accumulo-fate/builds/2013-09-01_04-40-45/archive/org.apache.accumulo/accumulo-fate/1.6.0-SNAPSHOT/accumulo-fate-1.6.0-SNAPSHOT.jar
[JENKINS] Archiving <https://builds.apache.org/job/Accumulo-Trunk-Hadoop-2.0/ws/core/pom.xml>
to /home/hudson/hudson/jobs/Accumulo-Trunk-Hadoop-2.0/modules/org.apache.accumulo$accumulo-core/builds/2013-09-01_04-40-45/archive/org.apache.accumulo/accumulo-core/1.6.0-SNAPSHOT/accumulo-core-1.6.0-SNAPSHOT.pom
[JENKINS] Archiving <https://builds.apache.org/job/Accumulo-Trunk-Hadoop-2.0/ws/trace/pom.xml>
to /home/hudson/hudson/jobs/Accumulo-Trunk-Hadoop-2.0/modules/org.apache.accumulo$accumulo-trace/builds/2013-09-01_04-40-45/archive/org.apache.accumulo/accumulo-trace/1.6.0-SNAPSHOT/accumulo-trace-1.6.0-SNAPSHOT.pom
[JENKINS] Archiving <https://builds.apache.org/job/Accumulo-Trunk-Hadoop-2.0/ws/trace/target/accumulo-trace-1.6.0-SNAPSHOT.jar>
to /home/hudson/hudson/jobs/Accumulo-Trunk-Hadoop-2.0/modules/org.apache.accumulo$accumulo-trace/builds/2013-09-01_04-40-45/archive/org.apache.accumulo/accumulo-trace/1.6.0-SNAPSHOT/accumulo-trace-1.6.0-SNAPSHOT.jar
[JENKINS] Archiving <https://builds.apache.org/job/Accumulo-Trunk-Hadoop-2.0/ws/docs/pom.xml>
to /home/hudson/hudson/jobs/Accumulo-Trunk-Hadoop-2.0/modules/org.apache.accumulo$accumulo-docs/builds/2013-09-01_04-40-45/archive/org.apache.accumulo/accumulo-docs/1.6.0-SNAPSHOT/accumulo-docs-1.6.0-SNAPSHOT.pom
Waiting for Jenkins to finish collecting data
Sending e-mails to: notifications@accumulo.apache.org
channel stopped

Mime
View raw message