accumulo-notifications mailing list archives

Site index · List index
Message view « Date » · « Thread »
Top « Date » · « Thread »
From Apache Jenkins Server <jenk...@builds.apache.org>
Subject Build failed in Jenkins: Accumulo-Trunk #997
Date Sat, 31 Aug 2013 21:41:20 GMT
See <https://builds.apache.org/job/Accumulo-Trunk/997/changes>

Changes:

[mdrob] ACCUMULO-1412 Adding PasswordConverter

------------------------------------------
[...truncated 289 lines...]
Aug 31, 2013 9:38:43 PM org.apache.maven.cli.event.ExecutionEventLogger mojoStarted
INFO: 
[JENKINS] Recording test resultsAug 31, 2013 9:38:43 PM org.apache.maven.cli.event.ExecutionEventLogger
mojoStarted
INFO: --- maven-failsafe-plugin:2.12.4:verify (run-integration-tests) @ accumulo-fate ---

[INFO] Failsafe report directory: <https://builds.apache.org/job/Accumulo-Trunk/ws/fate/target/failsafe-reports>
Aug 31, 2013 9:38:43 PM org.apache.maven.cli.event.ExecutionEventLogger mojoStarted
INFO: 
Aug 31, 2013 9:38:43 PM org.apache.maven.cli.event.ExecutionEventLogger mojoStarted
INFO: --- apache-rat-plugin:0.9:check (default) @ accumulo-fate ---
[INFO] 51 implicit excludes (use -debug for more details).
[INFO] No excludes explicitly specified.
[INFO] 28 resources included (use -debug for more details)
[INFO] Rat check: Summary of files. Unapproved: 0 unknown: 0 generated: 0 approved: 28 licence.
Aug 31, 2013 9:38:56 PM org.apache.maven.cli.event.ExecutionEventLogger projectStarted
INFO:                                                                         
Aug 31, 2013 9:38:56 PM org.apache.maven.cli.event.ExecutionEventLogger projectStarted
INFO: ------------------------------------------------------------------------
Aug 31, 2013 9:38:56 PM org.apache.maven.cli.event.ExecutionEventLogger projectStarted
INFO: Building Start 1.6.0-SNAPSHOT
Aug 31, 2013 9:38:56 PM org.apache.maven.cli.event.ExecutionEventLogger projectStarted
INFO: ------------------------------------------------------------------------
Aug 31, 2013 9:38:56 PM org.apache.maven.cli.event.ExecutionEventLogger mojoStarted
INFO: 
Aug 31, 2013 9:38:56 PM org.apache.maven.cli.event.ExecutionEventLogger mojoStarted
INFO: --- maven-clean-plugin:2.5:clean (default-clean) @ accumulo-start ---
[INFO] Deleting <https://builds.apache.org/job/Accumulo-Trunk/ws/start/target>
[INFO] Deleting <https://builds.apache.org/job/Accumulo-Trunk/ws/start> (includes =
[**/*.pyc, **/*.so], excludes = [])
Aug 31, 2013 9:38:56 PM org.apache.maven.cli.event.ExecutionEventLogger mojoStarted
INFO: 
Aug 31, 2013 9:38:56 PM org.apache.maven.cli.event.ExecutionEventLogger mojoStarted
INFO: --- maven-sortpom-plugin:2.1.0:verify (verify-sorted-pom) @ accumulo-start ---
[INFO] Verifying file <https://builds.apache.org/job/Accumulo-Trunk/ws/start/pom.xml>
Aug 31, 2013 9:38:57 PM org.apache.maven.cli.event.ExecutionEventLogger mojoStarted
INFO: 
Aug 31, 2013 9:38:57 PM org.apache.maven.cli.event.ExecutionEventLogger mojoStarted
INFO: --- maven-enforcer-plugin:1.0.1:enforce (enforce-mvn) @ accumulo-start ---
Aug 31, 2013 9:38:57 PM org.apache.maven.cli.event.ExecutionEventLogger mojoStarted
INFO: 
Aug 31, 2013 9:38:57 PM org.apache.maven.cli.event.ExecutionEventLogger mojoStarted
INFO: --- maven-remote-resources-plugin:1.4:process (default) @ accumulo-start ---
Aug 31, 2013 9:38:57 PM org.apache.maven.cli.event.ExecutionEventLogger mojoStarted
INFO: 
Aug 31, 2013 9:38:57 PM org.apache.maven.cli.event.ExecutionEventLogger mojoStarted
INFO: --- maven-resources-plugin:2.6:resources (default-resources) @ accumulo-start ---
[INFO] Using 'UTF-8' encoding to copy filtered resources.
[INFO] skip non existing resourceDirectory <https://builds.apache.org/job/Accumulo-Trunk/ws/start/src/main/resources>
[INFO] Copying 3 resources
Aug 31, 2013 9:38:57 PM org.apache.maven.cli.event.ExecutionEventLogger mojoStarted
INFO: 
Aug 31, 2013 9:38:57 PM org.apache.maven.cli.event.ExecutionEventLogger mojoStarted
INFO: --- maven-compiler-plugin:2.5.1:compile (default-compile) @ accumulo-start ---
[INFO] Compiling 19 source files to <https://builds.apache.org/job/Accumulo-Trunk/ws/start/target/classes>
Aug 31, 2013 9:38:57 PM org.apache.maven.cli.event.ExecutionEventLogger mojoStarted
INFO: 
Aug 31, 2013 9:38:57 PM org.apache.maven.cli.event.ExecutionEventLogger mojoStarted
INFO: --- maven-resources-plugin:2.6:testResources (default-testResources) @ accumulo-start
---
[INFO] Using 'UTF-8' encoding to copy filtered resources.
[INFO] Copying 6 resources
[INFO] Copying 3 resources
Aug 31, 2013 9:38:58 PM org.apache.maven.cli.event.ExecutionEventLogger mojoStarted
INFO: 
Aug 31, 2013 9:38:58 PM org.apache.maven.cli.event.ExecutionEventLogger mojoStarted
INFO: --- maven-compiler-plugin:2.5.1:testCompile (default-testCompile) @ accumulo-start ---
[INFO] Compiling 7 source files to <https://builds.apache.org/job/Accumulo-Trunk/ws/start/target/test-classes>
Aug 31, 2013 9:38:58 PM org.apache.maven.cli.event.ExecutionEventLogger mojoStarted
INFO: 
Aug 31, 2013 9:38:58 PM org.apache.maven.cli.event.ExecutionEventLogger mojoStarted
INFO: --- maven-surefire-plugin:2.12.4:test (default-test) @ accumulo-start ---
[INFO] Surefire report directory: <https://builds.apache.org/job/Accumulo-Trunk/ws/start/target/surefire-reports>

-------------------------------------------------------
 T E S T S
-------------------------------------------------------

-------------------------------------------------------
 T E S T S
-------------------------------------------------------
Running org.apache.accumulo.start.classloader.vfs.ContextManagerTest
Tests run: 2, Failures: 0, Errors: 0, Skipped: 0, Time elapsed: 0.214 sec
Running org.apache.accumulo.start.classloader.vfs.AccumuloReloadingVFSClassLoaderTest
Tests run: 3, Failures: 0, Errors: 0, Skipped: 0, Time elapsed: 5.334 sec
Running org.apache.accumulo.start.classloader.vfs.providers.VfsClassLoaderTest
Tests run: 2, Failures: 0, Errors: 0, Skipped: 0, Time elapsed: 8.934 sec
Running org.apache.accumulo.start.classloader.vfs.providers.ReadOnlyHdfsFileProviderTest
Tests run: 15, Failures: 0, Errors: 0, Skipped: 0, Time elapsed: 2.25 sec
Running org.apache.accumulo.start.classloader.vfs.AccumuloVFSClassLoaderTest
Tests run: 2, Failures: 0, Errors: 0, Skipped: 0, Time elapsed: 1.295 sec

Results :

Tests run: 24, Failures: 0, Errors: 0, Skipped: 0

[JENKINS] Recording test results
Aug 31, 2013 9:39:18 PM org.apache.maven.cli.event.ExecutionEventLogger mojoStarted
INFO: 
Aug 31, 2013 9:39:18 PM org.apache.maven.cli.event.ExecutionEventLogger mojoStarted
INFO: --- maven-jar-plugin:2.4:jar (default-jar) @ accumulo-start ---
[INFO] Building jar: <https://builds.apache.org/job/Accumulo-Trunk/ws/start/target/accumulo-start-1.6.0-SNAPSHOT.jar>
Aug 31, 2013 9:39:18 PM org.apache.maven.cli.event.ExecutionEventLogger mojoStarted
INFO: 
Aug 31, 2013 9:39:18 PM org.apache.maven.cli.event.ExecutionEventLogger mojoStarted
INFO: --- maven-site-plugin:3.2:attach-descriptor (attach-descriptor) @ accumulo-start ---
Aug 31, 2013 9:39:18 PM org.apache.maven.cli.event.ExecutionEventLogger mojoStarted
INFO: 
Aug 31, 2013 9:39:18 PM org.apache.maven.cli.event.ExecutionEventLogger mojoStarted
INFO: --- maven-failsafe-plugin:2.12.4:integration-test (run-integration-tests) @ accumulo-start
---
[JENKINS] Recording test results
Aug 31, 2013 9:39:18 PM org.apache.maven.cli.event.ExecutionEventLogger mojoStarted
INFO: 
Aug 31, 2013 9:39:18 PM org.apache.maven.cli.event.ExecutionEventLogger mojoStarted
INFO: --- maven-failsafe-plugin:2.12.4:verify (run-integration-tests) @ accumulo-start ---
[INFO] Failsafe report directory: <https://builds.apache.org/job/Accumulo-Trunk/ws/start/target/failsafe-reports>
[JENKINS] Recording test resultsAug 31, 2013 9:39:18 PM org.apache.maven.cli.event.ExecutionEventLogger
mojoStarted
INFO: 
Aug 31, 2013 9:39:18 PM org.apache.maven.cli.event.ExecutionEventLogger mojoStarted
INFO: --- apache-rat-plugin:0.9:check (default) @ accumulo-start ---
[INFO] 51 implicit excludes (use -debug for more details).
[INFO] No excludes explicitly specified.

[INFO] 36 resources included (use -debug for more details)
[INFO] Rat check: Summary of files. Unapproved: 0 unknown: 0 generated: 0 approved: 31 licence.
Aug 31, 2013 9:39:27 PM org.apache.maven.cli.event.ExecutionEventLogger projectStarted
INFO:                                                                         
Aug 31, 2013 9:39:27 PM org.apache.maven.cli.event.ExecutionEventLogger projectStarted
INFO: ------------------------------------------------------------------------
Aug 31, 2013 9:39:27 PM org.apache.maven.cli.event.ExecutionEventLogger projectStarted
INFO: Building Core 1.6.0-SNAPSHOT
Aug 31, 2013 9:39:27 PM org.apache.maven.cli.event.ExecutionEventLogger projectStarted
INFO: ------------------------------------------------------------------------
Aug 31, 2013 9:39:27 PM org.apache.maven.cli.event.ExecutionEventLogger mojoStarted
INFO: 
Aug 31, 2013 9:39:27 PM org.apache.maven.cli.event.ExecutionEventLogger mojoStarted
INFO: --- maven-clean-plugin:2.5:clean (default-clean) @ accumulo-core ---
[INFO] Deleting <https://builds.apache.org/job/Accumulo-Trunk/ws/core/target>
[INFO] Deleting <https://builds.apache.org/job/Accumulo-Trunk/ws/core> (includes = [**/*.pyc,
**/*.so], excludes = [])
Aug 31, 2013 9:39:28 PM org.apache.maven.cli.event.ExecutionEventLogger mojoStarted
INFO: 
Aug 31, 2013 9:39:28 PM org.apache.maven.cli.event.ExecutionEventLogger mojoStarted
INFO: --- maven-sortpom-plugin:2.1.0:verify (verify-sorted-pom) @ accumulo-core ---
[INFO] Verifying file <https://builds.apache.org/job/Accumulo-Trunk/ws/core/pom.xml>
Aug 31, 2013 9:39:28 PM org.apache.maven.cli.event.ExecutionEventLogger mojoStarted
INFO: 
Aug 31, 2013 9:39:28 PM org.apache.maven.cli.event.ExecutionEventLogger mojoStarted
INFO: --- maven-enforcer-plugin:1.0.1:enforce (enforce-mvn) @ accumulo-core ---
Aug 31, 2013 9:39:28 PM org.apache.maven.cli.event.ExecutionEventLogger mojoStarted
INFO: 
Aug 31, 2013 9:39:28 PM org.apache.maven.cli.event.ExecutionEventLogger mojoStarted
INFO: --- maven-resources-plugin:2.6:copy-resources (prepare-filtered-java-source) @ accumulo-core
---
[INFO] Using 'UTF-8' encoding to copy filtered resources.
[INFO] Copying 1 resource
Aug 31, 2013 9:39:28 PM org.apache.maven.cli.event.ExecutionEventLogger mojoStarted
INFO: 
Aug 31, 2013 9:39:28 PM org.apache.maven.cli.event.ExecutionEventLogger mojoStarted
INFO: --- build-helper-maven-plugin:1.8:add-source (add-filtered-java-source) @ accumulo-core
---
[INFO] Source directory: <https://builds.apache.org/job/Accumulo-Trunk/ws/core/target/filtered-java-src>
added.
Aug 31, 2013 9:39:28 PM org.apache.maven.cli.event.ExecutionEventLogger mojoStarted
INFO: 
Aug 31, 2013 9:39:28 PM org.apache.maven.cli.event.ExecutionEventLogger mojoStarted
INFO: --- maven-remote-resources-plugin:1.4:process (default) @ accumulo-core ---
Aug 31, 2013 9:39:28 PM org.apache.maven.cli.event.ExecutionEventLogger mojoStarted
INFO: 
Aug 31, 2013 9:39:28 PM org.apache.maven.cli.event.ExecutionEventLogger mojoStarted
INFO: --- maven-resources-plugin:2.6:resources (default-resources) @ accumulo-core ---
[INFO] Using 'UTF-8' encoding to copy filtered resources.
[INFO] Copying 1 resource
[INFO] Copying 3 resources
Aug 31, 2013 9:39:28 PM org.apache.maven.cli.event.ExecutionEventLogger mojoStarted
INFO: 
Aug 31, 2013 9:39:28 PM org.apache.maven.cli.event.ExecutionEventLogger mojoStarted
INFO: --- maven-compiler-plugin:2.5.1:compile (default-compile) @ accumulo-core ---
[INFO] Compiling 535 source files to <https://builds.apache.org/job/Accumulo-Trunk/ws/core/target/classes>
[INFO] -------------------------------------------------------------
[ERROR] COMPILATION ERROR : 
[INFO] -------------------------------------------------------------
[ERROR] <https://builds.apache.org/job/Accumulo-Trunk/ws/core/src/main/java/org/apache/accumulo/core/util/shell/ShellOptionsJC.java>:[60,18]
cannot find symbol
symbol  : constructor ParameterException(java.lang.String,java.io.FileNotFoundException)
location: class com.beust.jcommander.ParameterException
[INFO] 1 error
[INFO] -------------------------------------------------------------
Aug 31, 2013 9:39:34 PM org.apache.maven.cli.event.ExecutionEventLogger logReactorSummary
INFO: ------------------------------------------------------------------------
Aug 31, 2013 9:39:34 PM org.apache.maven.cli.event.ExecutionEventLogger logReactorSummary
INFO: Reactor Summary:
Aug 31, 2013 9:39:34 PM org.apache.maven.cli.event.ExecutionEventLogger logReactorSummary
INFO: 
Aug 31, 2013 9:39:34 PM org.apache.maven.cli.event.ExecutionEventLogger logReactorSummary
INFO: Apache Accumulo Project ........................... SUCCESS [14.614s]
Aug 31, 2013 9:39:34 PM org.apache.maven.cli.event.ExecutionEventLogger logReactorSummary
INFO: Trace ............................................. SUCCESS [15.374s]
Aug 31, 2013 9:39:34 PM org.apache.maven.cli.event.ExecutionEventLogger logReactorSummary
INFO: Fate .............................................. SUCCESS [14.233s]
Aug 31, 2013 9:39:34 PM org.apache.maven.cli.event.ExecutionEventLogger logReactorSummary
INFO: Start ............................................. SUCCESS [35.031s]
Aug 31, 2013 9:39:34 PM org.apache.maven.cli.event.ExecutionEventLogger logReactorSummary
INFO: Core .............................................. FAILURE [15.376s]
Aug 31, 2013 9:39:34 PM org.apache.maven.cli.event.ExecutionEventLogger logReactorSummary
INFO: Server ............................................ SKIPPED
Aug 31, 2013 9:39:34 PM org.apache.maven.cli.event.ExecutionEventLogger logReactorSummary
INFO: Examples .......................................... SKIPPED
Aug 31, 2013 9:39:34 PM org.apache.maven.cli.event.ExecutionEventLogger logReactorSummary
INFO: Simple Examples ................................... SKIPPED
Aug 31, 2013 9:39:34 PM org.apache.maven.cli.event.ExecutionEventLogger logReactorSummary
INFO: MiniCluster ....................................... SKIPPED
Aug 31, 2013 9:39:34 PM org.apache.maven.cli.event.ExecutionEventLogger logReactorSummary
INFO: Accumulo Maven Plugin ............................. SKIPPED
Aug 31, 2013 9:39:34 PM org.apache.maven.cli.event.ExecutionEventLogger logReactorSummary
INFO: Testing ........................................... SKIPPED
Aug 31, 2013 9:39:34 PM org.apache.maven.cli.event.ExecutionEventLogger logReactorSummary
INFO: Proxy ............................................. SKIPPED
Aug 31, 2013 9:39:34 PM org.apache.maven.cli.event.ExecutionEventLogger logReactorSummary
INFO: Assemblies ........................................ SKIPPED
Aug 31, 2013 9:39:34 PM org.apache.maven.cli.event.ExecutionEventLogger logReactorSummary
INFO: Documentation ..................................... SKIPPED
Aug 31, 2013 9:39:34 PM org.apache.maven.cli.event.ExecutionEventLogger logResult
INFO: ------------------------------------------------------------------------
Aug 31, 2013 9:39:34 PM org.apache.maven.cli.event.ExecutionEventLogger logResult
INFO: BUILD FAILURE
Aug 31, 2013 9:39:34 PM org.apache.maven.cli.event.ExecutionEventLogger logStats
INFO: ------------------------------------------------------------------------
Aug 31, 2013 9:39:34 PM org.apache.maven.cli.event.ExecutionEventLogger logStats
INFO: Total time: 1:40.198s
Aug 31, 2013 9:39:34 PM org.apache.maven.cli.event.ExecutionEventLogger logStats
INFO: Finished at: Sat Aug 31 21:39:34 UTC 2013
Aug 31, 2013 9:39:34 PM org.apache.maven.cli.event.ExecutionEventLogger logStats
INFO: Final Memory: 31M/220M
Aug 31, 2013 9:39:34 PM org.apache.maven.cli.event.ExecutionEventLogger sessionEnded
INFO: ------------------------------------------------------------------------
[JENKINS] Archiving <https://builds.apache.org/job/Accumulo-Trunk/ws/pom.xml> to /home/hudson/hudson/jobs/Accumulo-Trunk/modules/org.apache.accumulo$accumulo-project/builds/2013-08-31_21-37-48/archive/org.apache.accumulo/accumulo-project/1.6.0-SNAPSHOT/accumulo-project-1.6.0-SNAPSHOT.pom
[JENKINS] Archiving <https://builds.apache.org/job/Accumulo-Trunk/ws/target/accumulo-project-1.6.0-SNAPSHOT-site.xml>
to /home/hudson/hudson/jobs/Accumulo-Trunk/modules/org.apache.accumulo$accumulo-project/builds/2013-08-31_21-37-48/archive/org.apache.accumulo/accumulo-project/1.6.0-SNAPSHOT/accumulo-project-1.6.0-SNAPSHOT-site.xml
[JENKINS] Archiving <https://builds.apache.org/job/Accumulo-Trunk/ws/server/pom.xml>
to /home/hudson/hudson/jobs/Accumulo-Trunk/modules/org.apache.accumulo$accumulo-server/builds/2013-08-31_21-37-48/archive/org.apache.accumulo/accumulo-server/1.6.0-SNAPSHOT/accumulo-server-1.6.0-SNAPSHOT.pom
[JENKINS] Archiving <https://builds.apache.org/job/Accumulo-Trunk/ws/minicluster/pom.xml>
to /home/hudson/hudson/jobs/Accumulo-Trunk/modules/org.apache.accumulo$accumulo-minicluster/builds/2013-08-31_21-37-50/archive/org.apache.accumulo/accumulo-minicluster/1.6.0-SNAPSHOT/accumulo-minicluster-1.6.0-SNAPSHOT.pom
[JENKINS] Archiving <https://builds.apache.org/job/Accumulo-Trunk/ws/maven-plugin/pom.xml>
to /home/hudson/hudson/jobs/Accumulo-Trunk/modules/org.apache.accumulo$accumulo-maven-plugin/builds/2013-08-31_21-37-50/archive/org.apache.accumulo/accumulo-maven-plugin/1.6.0-SNAPSHOT/accumulo-maven-plugin-1.6.0-SNAPSHOT.pom
[JENKINS] Archiving <https://builds.apache.org/job/Accumulo-Trunk/ws/examples/simple/pom.xml>
to /home/hudson/hudson/jobs/Accumulo-Trunk/modules/org.apache.accumulo$accumulo-examples-simple/builds/2013-08-31_21-37-48/archive/org.apache.accumulo/accumulo-examples-simple/1.6.0-SNAPSHOT/accumulo-examples-simple-1.6.0-SNAPSHOT.pom
[JENKINS] Archiving <https://builds.apache.org/job/Accumulo-Trunk/ws/proxy/pom.xml>
to /home/hudson/hudson/jobs/Accumulo-Trunk/modules/org.apache.accumulo$accumulo-proxy/builds/2013-08-31_21-37-48/archive/org.apache.accumulo/accumulo-proxy/1.6.0-SNAPSHOT/accumulo-proxy-1.6.0-SNAPSHOT.pom
[JENKINS] Archiving <https://builds.apache.org/job/Accumulo-Trunk/ws/examples/pom.xml>
to /home/hudson/hudson/jobs/Accumulo-Trunk/modules/org.apache.accumulo$accumulo-examples/builds/2013-08-31_21-37-48/archive/org.apache.accumulo/accumulo-examples/1.6.0-SNAPSHOT/accumulo-examples-1.6.0-SNAPSHOT.pom
[JENKINS] Archiving <https://builds.apache.org/job/Accumulo-Trunk/ws/assemble/pom.xml>
to /home/hudson/hudson/jobs/Accumulo-Trunk/modules/org.apache.accumulo$accumulo/builds/2013-08-31_21-37-48/archive/org.apache.accumulo/accumulo/1.6.0-SNAPSHOT/accumulo-1.6.0-SNAPSHOT.pom
[JENKINS] Archiving <https://builds.apache.org/job/Accumulo-Trunk/ws/test/pom.xml> to
/home/hudson/hudson/jobs/Accumulo-Trunk/modules/org.apache.accumulo$accumulo-test/builds/2013-08-31_21-37-49/archive/org.apache.accumulo/accumulo-test/1.6.0-SNAPSHOT/accumulo-test-1.6.0-SNAPSHOT.pom
[JENKINS] Archiving <https://builds.apache.org/job/Accumulo-Trunk/ws/start/pom.xml>
to /home/hudson/hudson/jobs/Accumulo-Trunk/modules/org.apache.accumulo$accumulo-start/builds/2013-08-31_21-37-48/archive/org.apache.accumulo/accumulo-start/1.6.0-SNAPSHOT/accumulo-start-1.6.0-SNAPSHOT.pom
[JENKINS] Archiving <https://builds.apache.org/job/Accumulo-Trunk/ws/start/target/accumulo-start-1.6.0-SNAPSHOT.jar>
to /home/hudson/hudson/jobs/Accumulo-Trunk/modules/org.apache.accumulo$accumulo-start/builds/2013-08-31_21-37-48/archive/org.apache.accumulo/accumulo-start/1.6.0-SNAPSHOT/accumulo-start-1.6.0-SNAPSHOT.jar
[JENKINS] Archiving <https://builds.apache.org/job/Accumulo-Trunk/ws/fate/pom.xml> to
/home/hudson/hudson/jobs/Accumulo-Trunk/modules/org.apache.accumulo$accumulo-fate/builds/2013-08-31_21-37-48/archive/org.apache.accumulo/accumulo-fate/1.6.0-SNAPSHOT/accumulo-fate-1.6.0-SNAPSHOT.pom
[JENKINS] Archiving <https://builds.apache.org/job/Accumulo-Trunk/ws/fate/target/accumulo-fate-1.6.0-SNAPSHOT.jar>
to /home/hudson/hudson/jobs/Accumulo-Trunk/modules/org.apache.accumulo$accumulo-fate/builds/2013-08-31_21-37-48/archive/org.apache.accumulo/accumulo-fate/1.6.0-SNAPSHOT/accumulo-fate-1.6.0-SNAPSHOT.jar
[JENKINS] Archiving <https://builds.apache.org/job/Accumulo-Trunk/ws/core/pom.xml> to
/home/hudson/hudson/jobs/Accumulo-Trunk/modules/org.apache.accumulo$accumulo-core/builds/2013-08-31_21-37-48/archive/org.apache.accumulo/accumulo-core/1.6.0-SNAPSHOT/accumulo-core-1.6.0-SNAPSHOT.pom
[JENKINS] Archiving <https://builds.apache.org/job/Accumulo-Trunk/ws/trace/pom.xml>
to /home/hudson/hudson/jobs/Accumulo-Trunk/modules/org.apache.accumulo$accumulo-trace/builds/2013-08-31_21-37-48/archive/org.apache.accumulo/accumulo-trace/1.6.0-SNAPSHOT/accumulo-trace-1.6.0-SNAPSHOT.pom
[JENKINS] Archiving <https://builds.apache.org/job/Accumulo-Trunk/ws/trace/target/accumulo-trace-1.6.0-SNAPSHOT.jar>
to /home/hudson/hudson/jobs/Accumulo-Trunk/modules/org.apache.accumulo$accumulo-trace/builds/2013-08-31_21-37-48/archive/org.apache.accumulo/accumulo-trace/1.6.0-SNAPSHOT/accumulo-trace-1.6.0-SNAPSHOT.jar
[JENKINS] Archiving <https://builds.apache.org/job/Accumulo-Trunk/ws/docs/pom.xml> to
/home/hudson/hudson/jobs/Accumulo-Trunk/modules/org.apache.accumulo$accumulo-docs/builds/2013-08-31_21-37-50/archive/org.apache.accumulo/accumulo-docs/1.6.0-SNAPSHOT/accumulo-docs-1.6.0-SNAPSHOT.pom
Waiting for Jenkins to finish collecting data
Sending e-mails to: notifications@accumulo.apache.org
channel stopped

Mime
View raw message