accumulo-notifications mailing list archives

Site index · List index
Message view « Date » · « Thread »
Top « Date » · « Thread »
From Apache Jenkins Server <jenk...@builds.apache.org>
Subject Build failed in Jenkins: Accumulo-Trunk-Hadoop-2.0 #348
Date Tue, 06 Aug 2013 14:47:29 GMT
See <https://builds.apache.org/job/Accumulo-Trunk-Hadoop-2.0/348/changes>

Changes:

[ecn] ACCUMULO-1537 committing Michael Berman's patch to run against IPV6 enabled macs

------------------------------------------
[...truncated 1251 lines...]
[INFO] Build Summary:
[INFO]   Passed: 1, Failed: 0, Errors: 0, Skipped: 0
[INFO] -------------------------------------------------
Aug 6, 2013 2:44:40 PM org.apache.maven.cli.event.ExecutionEventLogger mojoStarted
INFO: 
Aug 6, 2013 2:44:40 PM org.apache.maven.cli.event.ExecutionEventLogger mojoStarted
INFO: --- maven-failsafe-plugin:2.12.4:verify (run-integration-tests) @ accumulo-maven-plugin
---
[INFO] Failsafe report directory: <https://builds.apache.org/job/Accumulo-Trunk-Hadoop-2.0/ws/maven-plugin/target/failsafe-reports>
Aug 6, 2013 2:44:40 PM org.apache.maven.cli.event.ExecutionEventLogger mojoStarted
[JENKINS] Recording test resultsINFO: 
Aug 6, 2013 2:44:40 PM org.apache.maven.cli.event.ExecutionEventLogger mojoStarted
INFO: --- apache-rat-plugin:0.9:check (default) @ accumulo-maven-plugin ---
[INFO] 51 implicit excludes (use -debug for more details).
[INFO] No excludes explicitly specified.

[INFO] 9 resources included (use -debug for more details)
[INFO] Rat check: Summary of files. Unapproved: 0 unknown: 0 generated: 0 approved: 9 licence.
Aug 6, 2013 2:44:41 PM org.apache.maven.cli.event.ExecutionEventLogger projectStarted
INFO:                                                                         
Aug 6, 2013 2:44:41 PM org.apache.maven.cli.event.ExecutionEventLogger projectStarted
INFO: ------------------------------------------------------------------------
Aug 6, 2013 2:44:41 PM org.apache.maven.cli.event.ExecutionEventLogger projectStarted
INFO: Building Testing 1.6.0-SNAPSHOT
Aug 6, 2013 2:44:41 PM org.apache.maven.cli.event.ExecutionEventLogger projectStarted
INFO: ------------------------------------------------------------------------
Aug 6, 2013 2:44:44 PM org.apache.maven.cli.event.ExecutionEventLogger mojoStarted
INFO: 
Aug 6, 2013 2:44:44 PM org.apache.maven.cli.event.ExecutionEventLogger mojoStarted
INFO: --- maven-clean-plugin:2.5:clean (default-clean) @ accumulo-test ---
[INFO] Deleting <https://builds.apache.org/job/Accumulo-Trunk-Hadoop-2.0/ws/test/target>
[INFO] Deleting <https://builds.apache.org/job/Accumulo-Trunk-Hadoop-2.0/ws/test> (includes
= [**/*.pyc, **/*.so], excludes = [])
Aug 6, 2013 2:44:44 PM org.apache.maven.cli.event.ExecutionEventLogger mojoStarted
INFO: 
Aug 6, 2013 2:44:44 PM org.apache.maven.cli.event.ExecutionEventLogger mojoStarted
INFO: --- maven-sortpom-plugin:2.1.0:verify (verify-sorted-pom) @ accumulo-test ---
[INFO] Verifying file <https://builds.apache.org/job/Accumulo-Trunk-Hadoop-2.0/ws/test/pom.xml>
Aug 6, 2013 2:44:44 PM org.apache.maven.cli.event.ExecutionEventLogger mojoStarted
INFO: 
Aug 6, 2013 2:44:44 PM org.apache.maven.cli.event.ExecutionEventLogger mojoStarted
INFO: --- maven-enforcer-plugin:1.0.1:enforce (enforce-mvn) @ accumulo-test ---
Aug 6, 2013 2:44:45 PM org.apache.maven.cli.event.ExecutionEventLogger mojoStarted
INFO: 
Aug 6, 2013 2:44:45 PM org.apache.maven.cli.event.ExecutionEventLogger mojoStarted
INFO: --- maven-remote-resources-plugin:1.4:process (default) @ accumulo-test ---
Aug 6, 2013 2:44:46 PM org.apache.maven.cli.event.ExecutionEventLogger mojoStarted
INFO: 
Aug 6, 2013 2:44:46 PM org.apache.maven.cli.event.ExecutionEventLogger mojoStarted
INFO: --- maven-resources-plugin:2.6:resources (default-resources) @ accumulo-test ---
[INFO] Using 'UTF-8' encoding to copy filtered resources.
[INFO] skip non existing resourceDirectory <https://builds.apache.org/job/Accumulo-Trunk-Hadoop-2.0/ws/test/src/main/resources>
[INFO] Copying 3 resources
Aug 6, 2013 2:44:46 PM org.apache.maven.cli.event.ExecutionEventLogger mojoStarted
INFO: 
Aug 6, 2013 2:44:46 PM org.apache.maven.cli.event.ExecutionEventLogger mojoStarted
INFO: --- maven-compiler-plugin:2.5.1:compile (default-compile) @ accumulo-test ---
[INFO] Compiling 153 source files to <https://builds.apache.org/job/Accumulo-Trunk-Hadoop-2.0/ws/test/target/classes>
Aug 6, 2013 2:44:47 PM org.apache.maven.cli.event.ExecutionEventLogger mojoStarted
INFO: 
Aug 6, 2013 2:44:47 PM org.apache.maven.cli.event.ExecutionEventLogger mojoStarted
INFO: --- maven-resources-plugin:2.6:testResources (default-testResources) @ accumulo-test
---
[INFO] Using 'UTF-8' encoding to copy filtered resources.
[INFO] Copying 4 resources
[INFO] Copying 3 resources
Aug 6, 2013 2:44:47 PM org.apache.maven.cli.event.ExecutionEventLogger mojoStarted
INFO: 
Aug 6, 2013 2:44:47 PM org.apache.maven.cli.event.ExecutionEventLogger mojoStarted
INFO: --- maven-compiler-plugin:2.5.1:testCompile (default-testCompile) @ accumulo-test ---
[INFO] Compiling 79 source files to <https://builds.apache.org/job/Accumulo-Trunk-Hadoop-2.0/ws/test/target/test-classes>
Aug 6, 2013 2:44:49 PM org.apache.maven.cli.event.ExecutionEventLogger mojoStarted
INFO: 
Aug 6, 2013 2:44:49 PM org.apache.maven.cli.event.ExecutionEventLogger mojoStarted
INFO: --- maven-surefire-plugin:2.12.4:test (default-test) @ accumulo-test ---
[INFO] Surefire report directory: <https://builds.apache.org/job/Accumulo-Trunk-Hadoop-2.0/ws/test/target/surefire-reports>

-------------------------------------------------------
 T E S T S
-------------------------------------------------------
Running org.apache.accumulo.test.AuditMessageTest
Tests run: 6, Failures: 0, Errors: 0, Skipped: 0, Time elapsed: 29.591 sec
Running org.apache.accumulo.test.VolumeTest
Tests run: 1, Failures: 0, Errors: 0, Skipped: 0, Time elapsed: 8.737 sec
Running org.apache.accumulo.test.TestAccumuloSplitRecovery
Tests run: 1, Failures: 0, Errors: 0, Skipped: 0, Time elapsed: 13.928 sec
Running org.apache.accumulo.test.randomwalk.FrameworkTest
Tests run: 4, Failures: 0, Errors: 0, Skipped: 0, Time elapsed: 0.021 sec
Running org.apache.accumulo.test.iterator.RegExTest
Tests run: 1, Failures: 0, Errors: 0, Skipped: 0, Time elapsed: 1.336 sec
Running org.apache.accumulo.test.MetaSplitTest
Tests run: 3, Failures: 0, Errors: 0, Skipped: 0, Time elapsed: 19.3 sec
Running org.apache.accumulo.test.ConditionalWriterTest
Tests run: 15, Failures: 0, Errors: 0, Skipped: 0, Time elapsed: 34.054 sec
Running org.apache.accumulo.fate.zookeeper.ZooLockTest
Tests run: 6, Failures: 0, Errors: 0, Skipped: 0, Time elapsed: 5.723 sec

Results :

Tests run: 37, Failures: 0, Errors: 0, Skipped: 0

Aug 6, 2013 2:46:43 PM org.apache.maven.cli.event.ExecutionEventLogger logReactorSummary
INFO: ------------------------------------------------------------------------
Aug 6, 2013 2:46:43 PM org.apache.maven.cli.event.ExecutionEventLogger logReactorSummary
INFO: Reactor Summary:
Aug 6, 2013 2:46:43 PM org.apache.maven.cli.event.ExecutionEventLogger logReactorSummary
INFO: 
Aug 6, 2013 2:46:43 PM org.apache.maven.cli.event.ExecutionEventLogger logReactorSummary
INFO: Apache Accumulo Project ........................... SUCCESS [29.437s]
Aug 6, 2013 2:46:43 PM org.apache.maven.cli.event.ExecutionEventLogger logReactorSummary
INFO: Trace ............................................. SUCCESS [5.826s]
Aug 6, 2013 2:46:43 PM org.apache.maven.cli.event.ExecutionEventLogger logReactorSummary
INFO: Fate .............................................. SUCCESS [4.138s]
Aug 6, 2013 2:46:43 PM org.apache.maven.cli.event.ExecutionEventLogger logReactorSummary
INFO: Start ............................................. SUCCESS [39.173s]
Aug 6, 2013 2:46:43 PM org.apache.maven.cli.event.ExecutionEventLogger logReactorSummary
INFO: Core .............................................. SUCCESS [57.292s]
Aug 6, 2013 2:46:43 PM org.apache.maven.cli.event.ExecutionEventLogger logReactorSummary
INFO: Server ............................................ SUCCESS [29.175s]
Aug 6, 2013 2:46:43 PM org.apache.maven.cli.event.ExecutionEventLogger logReactorSummary
INFO: Examples .......................................... SUCCESS [0.768s]
Aug 6, 2013 2:46:43 PM org.apache.maven.cli.event.ExecutionEventLogger logReactorSummary
INFO: Simple Examples ................................... SUCCESS [8.321s]
Aug 6, 2013 2:46:43 PM org.apache.maven.cli.event.ExecutionEventLogger logReactorSummary
INFO: MiniCluster ....................................... SUCCESS [18.290s]
Aug 6, 2013 2:46:43 PM org.apache.maven.cli.event.ExecutionEventLogger logReactorSummary
INFO: Accumulo Maven Plugin ............................. SUCCESS [54.323s]
Aug 6, 2013 2:46:43 PM org.apache.maven.cli.event.ExecutionEventLogger logReactorSummary
INFO: Testing ........................................... FAILURE [2:01.479s]
Aug 6, 2013 2:46:43 PM org.apache.maven.cli.event.ExecutionEventLogger logReactorSummary
INFO: Proxy ............................................. SKIPPED
Aug 6, 2013 2:46:43 PM org.apache.maven.cli.event.ExecutionEventLogger logReactorSummary
INFO: Assemblies ........................................ SKIPPED
Aug 6, 2013 2:46:43 PM org.apache.maven.cli.event.ExecutionEventLogger logReactorSummary
INFO: Documentation ..................................... SKIPPED
Aug 6, 2013 2:46:43 PM org.apache.maven.cli.event.ExecutionEventLogger logResult
INFO: ------------------------------------------------------------------------
Aug 6, 2013 2:46:43 PM org.apache.maven.cli.event.ExecutionEventLogger logResult
INFO: BUILD FAILURE
Aug 6, 2013 2:46:43 PM org.apache.maven.cli.event.ExecutionEventLogger logStats
INFO: ------------------------------------------------------------------------
Aug 6, 2013 2:46:43 PM org.apache.maven.cli.event.ExecutionEventLogger logStats
INFO: Total time: 6:12.029s
Aug 6, 2013 2:46:43 PM org.apache.maven.cli.event.ExecutionEventLogger logStats
INFO: Finished at: Tue Aug 06 14:46:43 UTC 2013
Aug 6, 2013 2:46:43 PM org.apache.maven.cli.event.ExecutionEventLogger logStats
INFO: Final Memory: 56M/347M
Aug 6, 2013 2:46:43 PM org.apache.maven.cli.event.ExecutionEventLogger sessionEnded
INFO: ------------------------------------------------------------------------
[JENKINS] Archiving <https://builds.apache.org/job/Accumulo-Trunk-Hadoop-2.0/ws/pom.xml>
to /home/hudson/hudson/jobs/Accumulo-Trunk-Hadoop-2.0/modules/org.apache.accumulo$accumulo-project/builds/2013-08-06_14-40-22/archive/org.apache.accumulo/accumulo-project/1.6.0-SNAPSHOT/accumulo-project-1.6.0-SNAPSHOT.pom
[JENKINS] Archiving <https://builds.apache.org/job/Accumulo-Trunk-Hadoop-2.0/ws/target/accumulo-project-1.6.0-SNAPSHOT-site.xml>
to /home/hudson/hudson/jobs/Accumulo-Trunk-Hadoop-2.0/modules/org.apache.accumulo$accumulo-project/builds/2013-08-06_14-40-22/archive/org.apache.accumulo/accumulo-project/1.6.0-SNAPSHOT/accumulo-project-1.6.0-SNAPSHOT-site.xml
[JENKINS] Archiving <https://builds.apache.org/job/Accumulo-Trunk-Hadoop-2.0/ws/server/pom.xml>
to /home/hudson/hudson/jobs/Accumulo-Trunk-Hadoop-2.0/modules/org.apache.accumulo$accumulo-server/builds/2013-08-06_14-40-22/archive/org.apache.accumulo/accumulo-server/1.6.0-SNAPSHOT/accumulo-server-1.6.0-SNAPSHOT.pom
[JENKINS] Archiving <https://builds.apache.org/job/Accumulo-Trunk-Hadoop-2.0/ws/server/target/accumulo-server-1.6.0-SNAPSHOT.jar>
to /home/hudson/hudson/jobs/Accumulo-Trunk-Hadoop-2.0/modules/org.apache.accumulo$accumulo-server/builds/2013-08-06_14-40-22/archive/org.apache.accumulo/accumulo-server/1.6.0-SNAPSHOT/accumulo-server-1.6.0-SNAPSHOT.jar
[JENKINS] Archiving <https://builds.apache.org/job/Accumulo-Trunk-Hadoop-2.0/ws/minicluster/pom.xml>
to /home/hudson/hudson/jobs/Accumulo-Trunk-Hadoop-2.0/modules/org.apache.accumulo$accumulo-minicluster/builds/2013-08-06_14-40-22/archive/org.apache.accumulo/accumulo-minicluster/1.6.0-SNAPSHOT/accumulo-minicluster-1.6.0-SNAPSHOT.pom
[JENKINS] Archiving <https://builds.apache.org/job/Accumulo-Trunk-Hadoop-2.0/ws/minicluster/target/accumulo-minicluster-1.6.0-SNAPSHOT.jar>
to /home/hudson/hudson/jobs/Accumulo-Trunk-Hadoop-2.0/modules/org.apache.accumulo$accumulo-minicluster/builds/2013-08-06_14-40-22/archive/org.apache.accumulo/accumulo-minicluster/1.6.0-SNAPSHOT/accumulo-minicluster-1.6.0-SNAPSHOT.jar
[JENKINS] Archiving <https://builds.apache.org/job/Accumulo-Trunk-Hadoop-2.0/ws/maven-plugin/pom.xml>
to /home/hudson/hudson/jobs/Accumulo-Trunk-Hadoop-2.0/modules/org.apache.accumulo$accumulo-maven-plugin/builds/2013-08-06_14-40-22/archive/org.apache.accumulo/accumulo-maven-plugin/1.6.0-SNAPSHOT/accumulo-maven-plugin-1.6.0-SNAPSHOT.pom
[JENKINS] Archiving <https://builds.apache.org/job/Accumulo-Trunk-Hadoop-2.0/ws/maven-plugin/target/accumulo-maven-plugin-1.6.0-SNAPSHOT.jar>
to /home/hudson/hudson/jobs/Accumulo-Trunk-Hadoop-2.0/modules/org.apache.accumulo$accumulo-maven-plugin/builds/2013-08-06_14-40-22/archive/org.apache.accumulo/accumulo-maven-plugin/1.6.0-SNAPSHOT/accumulo-maven-plugin-1.6.0-SNAPSHOT.jar
[JENKINS] Archiving <https://builds.apache.org/job/Accumulo-Trunk-Hadoop-2.0/ws/examples/simple/pom.xml>
to /home/hudson/hudson/jobs/Accumulo-Trunk-Hadoop-2.0/modules/org.apache.accumulo$accumulo-examples-simple/builds/2013-08-06_14-40-22/archive/org.apache.accumulo/accumulo-examples-simple/1.6.0-SNAPSHOT/accumulo-examples-simple-1.6.0-SNAPSHOT.pom
[JENKINS] Archiving <https://builds.apache.org/job/Accumulo-Trunk-Hadoop-2.0/ws/examples/simple/target/accumulo-examples-simple-1.6.0-SNAPSHOT.jar>
to /home/hudson/hudson/jobs/Accumulo-Trunk-Hadoop-2.0/modules/org.apache.accumulo$accumulo-examples-simple/builds/2013-08-06_14-40-22/archive/org.apache.accumulo/accumulo-examples-simple/1.6.0-SNAPSHOT/accumulo-examples-simple-1.6.0-SNAPSHOT.jar
[JENKINS] Archiving <https://builds.apache.org/job/Accumulo-Trunk-Hadoop-2.0/ws/proxy/pom.xml>
to /home/hudson/hudson/jobs/Accumulo-Trunk-Hadoop-2.0/modules/org.apache.accumulo$accumulo-proxy/builds/2013-08-06_14-40-22/archive/org.apache.accumulo/accumulo-proxy/1.6.0-SNAPSHOT/accumulo-proxy-1.6.0-SNAPSHOT.pom
[JENKINS] Archiving <https://builds.apache.org/job/Accumulo-Trunk-Hadoop-2.0/ws/examples/pom.xml>
to /home/hudson/hudson/jobs/Accumulo-Trunk-Hadoop-2.0/modules/org.apache.accumulo$accumulo-examples/builds/2013-08-06_14-40-22/archive/org.apache.accumulo/accumulo-examples/1.6.0-SNAPSHOT/accumulo-examples-1.6.0-SNAPSHOT.pom
[JENKINS] Archiving <https://builds.apache.org/job/Accumulo-Trunk-Hadoop-2.0/ws/assemble/pom.xml>
to /home/hudson/hudson/jobs/Accumulo-Trunk-Hadoop-2.0/modules/org.apache.accumulo$accumulo/builds/2013-08-06_14-40-22/archive/org.apache.accumulo/accumulo/1.6.0-SNAPSHOT/accumulo-1.6.0-SNAPSHOT.pom
[JENKINS] Archiving <https://builds.apache.org/job/Accumulo-Trunk-Hadoop-2.0/ws/test/pom.xml>
to /home/hudson/hudson/jobs/Accumulo-Trunk-Hadoop-2.0/modules/org.apache.accumulo$accumulo-test/builds/2013-08-06_14-40-22/archive/org.apache.accumulo/accumulo-test/1.6.0-SNAPSHOT/accumulo-test-1.6.0-SNAPSHOT.pom
[JENKINS] Archiving <https://builds.apache.org/job/Accumulo-Trunk-Hadoop-2.0/ws/start/pom.xml>
to /home/hudson/hudson/jobs/Accumulo-Trunk-Hadoop-2.0/modules/org.apache.accumulo$accumulo-start/builds/2013-08-06_14-40-22/archive/org.apache.accumulo/accumulo-start/1.6.0-SNAPSHOT/accumulo-start-1.6.0-SNAPSHOT.pom
[JENKINS] Archiving <https://builds.apache.org/job/Accumulo-Trunk-Hadoop-2.0/ws/start/target/accumulo-start-1.6.0-SNAPSHOT.jar>
to /home/hudson/hudson/jobs/Accumulo-Trunk-Hadoop-2.0/modules/org.apache.accumulo$accumulo-start/builds/2013-08-06_14-40-22/archive/org.apache.accumulo/accumulo-start/1.6.0-SNAPSHOT/accumulo-start-1.6.0-SNAPSHOT.jar
[JENKINS] Archiving <https://builds.apache.org/job/Accumulo-Trunk-Hadoop-2.0/ws/fate/pom.xml>
to /home/hudson/hudson/jobs/Accumulo-Trunk-Hadoop-2.0/modules/org.apache.accumulo$accumulo-fate/builds/2013-08-06_14-40-22/archive/org.apache.accumulo/accumulo-fate/1.6.0-SNAPSHOT/accumulo-fate-1.6.0-SNAPSHOT.pom
[JENKINS] Archiving <https://builds.apache.org/job/Accumulo-Trunk-Hadoop-2.0/ws/fate/target/accumulo-fate-1.6.0-SNAPSHOT.jar>
to /home/hudson/hudson/jobs/Accumulo-Trunk-Hadoop-2.0/modules/org.apache.accumulo$accumulo-fate/builds/2013-08-06_14-40-22/archive/org.apache.accumulo/accumulo-fate/1.6.0-SNAPSHOT/accumulo-fate-1.6.0-SNAPSHOT.jar
[JENKINS] Archiving <https://builds.apache.org/job/Accumulo-Trunk-Hadoop-2.0/ws/core/pom.xml>
to /home/hudson/hudson/jobs/Accumulo-Trunk-Hadoop-2.0/modules/org.apache.accumulo$accumulo-core/builds/2013-08-06_14-40-22/archive/org.apache.accumulo/accumulo-core/1.6.0-SNAPSHOT/accumulo-core-1.6.0-SNAPSHOT.pom
[JENKINS] Archiving <https://builds.apache.org/job/Accumulo-Trunk-Hadoop-2.0/ws/core/target/accumulo-core-1.6.0-SNAPSHOT.jar>
to /home/hudson/hudson/jobs/Accumulo-Trunk-Hadoop-2.0/modules/org.apache.accumulo$accumulo-core/builds/2013-08-06_14-40-22/archive/org.apache.accumulo/accumulo-core/1.6.0-SNAPSHOT/accumulo-core-1.6.0-SNAPSHOT.jar
[JENKINS] Archiving <https://builds.apache.org/job/Accumulo-Trunk-Hadoop-2.0/ws/trace/pom.xml>
to /home/hudson/hudson/jobs/Accumulo-Trunk-Hadoop-2.0/modules/org.apache.accumulo$accumulo-trace/builds/2013-08-06_14-40-22/archive/org.apache.accumulo/accumulo-trace/1.6.0-SNAPSHOT/accumulo-trace-1.6.0-SNAPSHOT.pom
[JENKINS] Archiving <https://builds.apache.org/job/Accumulo-Trunk-Hadoop-2.0/ws/trace/target/accumulo-trace-1.6.0-SNAPSHOT.jar>
to /home/hudson/hudson/jobs/Accumulo-Trunk-Hadoop-2.0/modules/org.apache.accumulo$accumulo-trace/builds/2013-08-06_14-40-22/archive/org.apache.accumulo/accumulo-trace/1.6.0-SNAPSHOT/accumulo-trace-1.6.0-SNAPSHOT.jar
[JENKINS] Archiving <https://builds.apache.org/job/Accumulo-Trunk-Hadoop-2.0/ws/docs/pom.xml>
to /home/hudson/hudson/jobs/Accumulo-Trunk-Hadoop-2.0/modules/org.apache.accumulo$accumulo-docs/builds/2013-08-06_14-40-22/archive/org.apache.accumulo/accumulo-docs/1.6.0-SNAPSHOT/accumulo-docs-1.6.0-SNAPSHOT.pom
Waiting for Jenkins to finish collecting data
mavenExecutionResult exceptions not empty
message : Internal error: hudson.remoting.RemotingSystemException: java.io.StreamCorruptedException:
invalid type code: 00
cause : java.io.StreamCorruptedException: invalid type code: 00
Stack trace : 
org.apache.maven.InternalErrorException: Internal error: hudson.remoting.RemotingSystemException:
java.io.StreamCorruptedException: invalid type code: 00
	at org.apache.maven.lifecycle.internal.BuilderCommon.handleBuildError(BuilderCommon.java:128)
	at org.apache.maven.lifecycle.internal.LifecycleModuleBuilder.buildProject(LifecycleModuleBuilder.java:95)
	at org.apache.maven.lifecycle.internal.LifecycleModuleBuilder.buildProject(LifecycleModuleBuilder.java:59)
	at org.apache.maven.lifecycle.internal.LifecycleStarter.singleThreadedBuild(LifecycleStarter.java:183)
	at org.apache.maven.lifecycle.internal.LifecycleStarter.execute(LifecycleStarter.java:161)
	at org.apache.maven.DefaultMaven.doExecute(DefaultMaven.java:320)
	at org.apache.maven.DefaultMaven.execute(DefaultMaven.java:156)
	at org.jvnet.hudson.maven3.launcher.Maven3Launcher.main(Maven3Launcher.java:117)
	at sun.reflect.NativeMethodAccessorImpl.invoke0(Native Method)
	at sun.reflect.NativeMethodAccessorImpl.invoke(NativeMethodAccessorImpl.java:39)
	at sun.reflect.DelegatingMethodAccessorImpl.invoke(DelegatingMethodAccessorImpl.java:25)
	at java.lang.reflect.Method.invoke(Method.java:597)
	at org.codehaus.plexus.classworlds.launcher.Launcher.launchStandard(Launcher.java:329)
	at org.codehaus.plexus.classworlds.launcher.Launcher.launch(Launcher.java:239)
	at org.jvnet.hudson.maven3.agent.Maven3Main.launch(Maven3Main.java:178)
	at sun.reflect.NativeMethodAccessorImpl.invoke0(Native Method)
	at sun.reflect.NativeMethodAccessorImpl.invoke(NativeMethodAccessorImpl.java:39)
	at sun.reflect.DelegatingMethodAccessorImpl.invoke(DelegatingMethodAccessorImpl.java:25)
	at java.lang.reflect.Method.invoke(Method.java:597)
	at hudson.maven.Maven3Builder.call(Maven3Builder.java:129)
	at hudson.maven.Maven3Builder.call(Maven3Builder.java:67)
	at hudson.remoting.UserRequest.perform(UserRequest.java:118)
	at hudson.remoting.UserRequest.perform(UserRequest.java:48)
	at hudson.remoting.Request$2.run(Request.java:326)
	at hudson.remoting.InterceptingExecutorService$1.call(InterceptingExecutorService.java:72)
	at java.util.concurrent.FutureTask$Sync.innerRun(FutureTask.java:303)
	at java.util.concurrent.FutureTask.run(FutureTask.java:138)
	at java.util.concurrent.ThreadPoolExecutor$Worker.runTask(ThreadPoolExecutor.java:895)
	at java.util.concurrent.ThreadPoolExecutor$Worker.run(ThreadPoolExecutor.java:918)
	at java.lang.Thread.run(Thread.java:662)
Caused by: hudson.remoting.RemotingSystemException: java.io.StreamCorruptedException: invalid
type code: 00
	at hudson.remoting.RemoteInvocationHandler.invoke(RemoteInvocationHandler.java:183)
	at com.sun.proxy.$Proxy7.setExecutedMojos(Unknown Source)
	at hudson.maven.MavenBuildProxy$Filter.setExecutedMojos(MavenBuildProxy.java:243)
	at hudson.maven.Maven3Builder$MavenExecutionListener.recordMojoEnded(Maven3Builder.java:574)
	at hudson.maven.Maven3Builder$MavenExecutionListener.mojoSucceeded(Maven3Builder.java:560)
	at org.apache.maven.lifecycle.internal.DefaultExecutionEventCatapult.fire(DefaultExecutionEventCatapult.java:87)
	at org.apache.maven.lifecycle.internal.DefaultExecutionEventCatapult.fire(DefaultExecutionEventCatapult.java:42)
	at org.apache.maven.lifecycle.internal.MojoExecutor.execute(MojoExecutor.java:228)
	at org.apache.maven.lifecycle.internal.MojoExecutor.execute(MojoExecutor.java:153)
	at org.apache.maven.lifecycle.internal.MojoExecutor.execute(MojoExecutor.java:145)
	at org.apache.maven.lifecycle.internal.LifecycleModuleBuilder.buildProject(LifecycleModuleBuilder.java:84)
	... 28 more
Caused by: java.io.StreamCorruptedException: invalid type code: 00
	at java.io.ObjectInputStream.readObject0(ObjectInputStream.java:1375)
	at java.io.ObjectInputStream.readArray(ObjectInputStream.java:1704)
	at java.io.ObjectInputStream.readObject0(ObjectInputStream.java:1342)
	at java.io.ObjectInputStream.defaultReadFields(ObjectInputStream.java:1989)
	at java.io.ObjectInputStream.defaultReadObject(ObjectInputStream.java:499)
	at java.lang.Throwable.readObject(Throwable.java:913)
	at sun.reflect.GeneratedMethodAccessor129.invoke(Unknown Source)
	at sun.reflect.DelegatingMethodAccessorImpl.invoke(DelegatingMethodAccessorImpl.java:43)
	at java.lang.reflect.Method.invoke(Method.java:606)
	at java.io.ObjectStreamClass.invokeReadObject(ObjectStreamClass.java:1017)
	at java.io.ObjectInputStream.readSerialData(ObjectInputStream.java:1891)
	at java.io.ObjectInputStream.readOrdinaryObject(ObjectInputStream.java:1796)
	at java.io.ObjectInputStream.readObject0(ObjectInputStream.java:1348)
	at java.io.ObjectInputStream.defaultReadFields(ObjectInputStream.java:1989)
	at java.io.ObjectInputStream.readSerialData(ObjectInputStream.java:1913)
	at java.io.ObjectInputStream.readOrdinaryObject(ObjectInputStream.java:1796)
	at java.io.ObjectInputStream.readObject0(ObjectInputStream.java:1348)
	at java.io.ObjectInputStream.readObject(ObjectInputStream.java:370)
	at hudson.remoting.UserRequest.deserialize(UserRequest.java:182)
	at hudson.remoting.UserRequest.perform(UserRequest.java:98)
	at hudson.remoting.UserRequest.perform(UserRequest.java:48)
	at hudson.remoting.Request$2.run(Request.java:326)
	at hudson.remoting.InterceptingExecutorService$1.call(InterceptingExecutorService.java:72)
	at java.util.concurrent.FutureTask$Sync.innerRun(FutureTask.java:334)
	at java.util.concurrent.FutureTask.run(FutureTask.java:166)
	at java.util.concurrent.ThreadPoolExecutor.runWorker(ThreadPoolExecutor.java:1145)
	at java.util.concurrent.ThreadPoolExecutor$Worker.run(ThreadPoolExecutor.java:615)
	at java.lang.Thread.run(Thread.java:724)
Sending e-mails to: notifications@accumulo.apache.org
channel stopped

Mime
View raw message