accumulo-notifications mailing list archives

Site index · List index
Message view « Date » · « Thread »
Top « Date » · « Thread »
From Apache Jenkins Server <jenk...@builds.apache.org>
Subject Build failed in Jenkins: Accumulo-Trunk-Hadoop-2.0 #315
Date Tue, 23 Jul 2013 17:48:53 GMT
See <https://builds.apache.org/job/Accumulo-Trunk-Hadoop-2.0/315/changes>

Changes:

[ecn] ACCUMULO-1585 forgot to add new file

------------------------------------------
[...truncated 903 lines...]
[INFO] 1 resources included (use -debug for more details)
[INFO] Rat check: Summary of files. Unapproved: 0 unknown: 0 generated: 0 approved: 1 licence.

Jul 23, 2013 5:47:55 PM org.apache.maven.cli.event.ExecutionEventLogger projectStarted
INFO:                                                                         
Jul 23, 2013 5:47:55 PM org.apache.maven.cli.event.ExecutionEventLogger projectStarted
INFO: ------------------------------------------------------------------------
Jul 23, 2013 5:47:55 PM org.apache.maven.cli.event.ExecutionEventLogger projectStarted
INFO: Building Simple Examples 1.6.0-SNAPSHOT
Jul 23, 2013 5:47:55 PM org.apache.maven.cli.event.ExecutionEventLogger projectStarted
INFO: ------------------------------------------------------------------------
Jul 23, 2013 5:47:55 PM org.apache.maven.cli.event.ExecutionEventLogger mojoStarted
INFO: 
Jul 23, 2013 5:47:55 PM org.apache.maven.cli.event.ExecutionEventLogger mojoStarted
INFO: --- maven-clean-plugin:2.5:clean (default-clean) @ accumulo-examples-simple ---
[INFO] Deleting <https://builds.apache.org/job/Accumulo-Trunk-Hadoop-2.0/ws/examples/simple>
(includes = [**/*.pyc, **/*.so], excludes = [])
Jul 23, 2013 5:47:55 PM org.apache.maven.cli.event.ExecutionEventLogger mojoStarted
INFO: 
Jul 23, 2013 5:47:55 PM org.apache.maven.cli.event.ExecutionEventLogger mojoStarted
INFO: --- maven-sortpom-plugin:2.1.0:verify (verify-sorted-pom) @ accumulo-examples-simple
---
[INFO] Verifying file <https://builds.apache.org/job/Accumulo-Trunk-Hadoop-2.0/ws/examples/simple/pom.xml>
Jul 23, 2013 5:47:55 PM org.apache.maven.cli.event.ExecutionEventLogger mojoStarted
INFO: 
Jul 23, 2013 5:47:55 PM org.apache.maven.cli.event.ExecutionEventLogger mojoStarted
INFO: --- maven-enforcer-plugin:1.0.1:enforce (enforce-mvn) @ accumulo-examples-simple ---
Jul 23, 2013 5:47:55 PM org.apache.maven.cli.event.ExecutionEventLogger mojoStarted
INFO: 
Jul 23, 2013 5:47:55 PM org.apache.maven.cli.event.ExecutionEventLogger mojoStarted
INFO: --- maven-remote-resources-plugin:1.4:process (default) @ accumulo-examples-simple ---
Jul 23, 2013 5:47:55 PM org.apache.maven.cli.event.ExecutionEventLogger mojoStarted
INFO: 
Jul 23, 2013 5:47:55 PM org.apache.maven.cli.event.ExecutionEventLogger mojoStarted
INFO: --- maven-resources-plugin:2.6:resources (default-resources) @ accumulo-examples-simple
---
[INFO] Using 'UTF-8' encoding to copy filtered resources.
[INFO] Copying 1 resource
[INFO] Copying 3 resources
Jul 23, 2013 5:47:55 PM org.apache.maven.cli.event.ExecutionEventLogger mojoStarted
INFO: 
Jul 23, 2013 5:47:55 PM org.apache.maven.cli.event.ExecutionEventLogger mojoStarted
INFO: --- maven-compiler-plugin:2.5.1:compile (default-compile) @ accumulo-examples-simple
---
[INFO] Compiling 42 source files to <https://builds.apache.org/job/Accumulo-Trunk-Hadoop-2.0/ws/examples/simple/target/classes>
Jul 23, 2013 5:47:58 PM org.apache.maven.cli.event.ExecutionEventLogger mojoStarted
INFO: 
Jul 23, 2013 5:47:58 PM org.apache.maven.cli.event.ExecutionEventLogger mojoStarted
INFO: --- maven-resources-plugin:2.6:testResources (default-testResources) @ accumulo-examples-simple
---
[INFO] Using 'UTF-8' encoding to copy filtered resources.
[INFO] Copying 1 resource
[INFO] Copying 3 resources
Jul 23, 2013 5:47:58 PM org.apache.maven.cli.event.ExecutionEventLogger mojoStarted
INFO: 
Jul 23, 2013 5:47:58 PM org.apache.maven.cli.event.ExecutionEventLogger mojoStarted
INFO: --- maven-compiler-plugin:2.5.1:testCompile (default-testCompile) @ accumulo-examples-simple
---
[INFO] Compiling 5 source files to <https://builds.apache.org/job/Accumulo-Trunk-Hadoop-2.0/ws/examples/simple/target/test-classes>
Jul 23, 2013 5:47:58 PM org.apache.maven.cli.event.ExecutionEventLogger mojoStarted
INFO: 
Jul 23, 2013 5:47:58 PM org.apache.maven.cli.event.ExecutionEventLogger mojoStarted
INFO: --- maven-surefire-plugin:2.12.4:test (default-test) @ accumulo-examples-simple ---
[INFO] Surefire report directory: <https://builds.apache.org/job/Accumulo-Trunk-Hadoop-2.0/ws/examples/simple/target/surefire-reports>

-------------------------------------------------------
 T E S T S
-------------------------------------------------------
Running org.apache.accumulo.examples.simple.dirlist.CountTest
Tests run: 1, Failures: 0, Errors: 0, Skipped: 0, Time elapsed: 0.815 sec
Running org.apache.accumulo.examples.simple.filedata.ChunkInputStreamTest
Tests run: 9, Failures: 0, Errors: 0, Skipped: 0, Time elapsed: 0.095 sec
Running org.apache.accumulo.examples.simple.filedata.KeyUtilTest
Tests run: 1, Failures: 0, Errors: 0, Skipped: 0, Time elapsed: 0.001 sec
Running org.apache.accumulo.examples.simple.filedata.ChunkInputFormatTest
Tests run: 3, Failures: 0, Errors: 0, Skipped: 0, Time elapsed: 3.874 sec
Running org.apache.accumulo.examples.simple.filedata.ChunkCombinerTest
Tests run: 1, Failures: 0, Errors: 0, Skipped: 0, Time elapsed: 0.009 sec

Results :

Tests run: 15, Failures: 0, Errors: 0, Skipped: 0

[JENKINS] Recording test results
Jul 23, 2013 5:48:04 PM org.apache.maven.cli.event.ExecutionEventLogger mojoStarted
INFO: 
Jul 23, 2013 5:48:04 PM org.apache.maven.cli.event.ExecutionEventLogger mojoStarted
INFO: --- maven-jar-plugin:2.4:jar (default-jar) @ accumulo-examples-simple ---
[INFO] Building jar: <https://builds.apache.org/job/Accumulo-Trunk-Hadoop-2.0/ws/examples/simple/target/accumulo-examples-simple-1.6.0-SNAPSHOT.jar>
Jul 23, 2013 5:48:05 PM org.apache.maven.cli.event.ExecutionEventLogger mojoStarted
INFO: 
Jul 23, 2013 5:48:05 PM org.apache.maven.cli.event.ExecutionEventLogger mojoStarted
INFO: --- maven-site-plugin:3.2:attach-descriptor (attach-descriptor) @ accumulo-examples-simple
---
Jul 23, 2013 5:48:05 PM org.apache.maven.cli.event.ExecutionEventLogger mojoStarted
INFO: 
Jul 23, 2013 5:48:05 PM org.apache.maven.cli.event.ExecutionEventLogger mojoStarted
INFO: --- maven-failsafe-plugin:2.12.4:integration-test (run-integration-tests) @ accumulo-examples-simple
---
[JENKINS] Recording test results
Jul 23, 2013 5:48:05 PM org.apache.maven.cli.event.ExecutionEventLogger mojoStarted
INFO: 
Jul 23, 2013 5:48:05 PM org.apache.maven.cli.event.ExecutionEventLogger mojoStarted
INFO: --- maven-failsafe-plugin:2.12.4:verify (run-integration-tests) @ accumulo-examples-simple
---
[INFO] Failsafe report directory: <https://builds.apache.org/job/Accumulo-Trunk-Hadoop-2.0/ws/examples/simple/target/failsafe-reports>
[JENKINS] Recording test resultsJul 23, 2013 5:48:05 PM org.apache.maven.cli.event.ExecutionEventLogger
mojoStarted
INFO: 
Jul 23, 2013 5:48:05 PM org.apache.maven.cli.event.ExecutionEventLogger mojoStarted
INFO: --- apache-rat-plugin:0.9:check (default) @ accumulo-examples-simple ---
[INFO] 51 implicit excludes (use -debug for more details).
[INFO] Exclude: src/main/resources/META-INF/services/org.apache.accumulo.core.util.shell.ShellExtension
[INFO] 49 resources included (use -debug for more details)

[INFO] Rat check: Summary of files. Unapproved: 0 unknown: 0 generated: 0 approved: 49 licence.
Jul 23, 2013 5:48:05 PM org.apache.maven.cli.event.ExecutionEventLogger projectStarted
INFO:                                                                         
Jul 23, 2013 5:48:05 PM org.apache.maven.cli.event.ExecutionEventLogger projectStarted
INFO: ------------------------------------------------------------------------
Jul 23, 2013 5:48:05 PM org.apache.maven.cli.event.ExecutionEventLogger projectStarted
INFO: Building MiniCluster 1.6.0-SNAPSHOT
Jul 23, 2013 5:48:05 PM org.apache.maven.cli.event.ExecutionEventLogger projectStarted
INFO: ------------------------------------------------------------------------
Downloading: http://repo.maven.apache.org/maven2/org/apache/hadoop/hadoop-test/2.0.4-alpha/hadoop-test-2.0.4-alpha.pom
[WARNING] The POM for org.apache.hadoop:hadoop-test:jar:2.0.4-alpha is missing, no dependency
information available
Downloading: http://repo.maven.apache.org/maven2/org/apache/hadoop/hadoop-test/2.0.4-alpha/hadoop-test-2.0.4-alpha.jar
Jul 23, 2013 5:48:06 PM org.apache.maven.cli.event.ExecutionEventLogger logReactorSummary
INFO: ------------------------------------------------------------------------
Jul 23, 2013 5:48:06 PM org.apache.maven.cli.event.ExecutionEventLogger logReactorSummary
INFO: Reactor Summary:
Jul 23, 2013 5:48:06 PM org.apache.maven.cli.event.ExecutionEventLogger logReactorSummary
INFO: 
Jul 23, 2013 5:48:06 PM org.apache.maven.cli.event.ExecutionEventLogger logReactorSummary
INFO: Apache Accumulo Project ........................... SUCCESS [19.986s]
Jul 23, 2013 5:48:06 PM org.apache.maven.cli.event.ExecutionEventLogger logReactorSummary
INFO: Trace ............................................. SUCCESS [6.434s]
Jul 23, 2013 5:48:06 PM org.apache.maven.cli.event.ExecutionEventLogger logReactorSummary
INFO: Fate .............................................. SUCCESS [3.245s]
Jul 23, 2013 5:48:06 PM org.apache.maven.cli.event.ExecutionEventLogger logReactorSummary
INFO: Start ............................................. SUCCESS [41.119s]
Jul 23, 2013 5:48:06 PM org.apache.maven.cli.event.ExecutionEventLogger logReactorSummary
INFO: Core .............................................. SUCCESS [54.138s]
Jul 23, 2013 5:48:06 PM org.apache.maven.cli.event.ExecutionEventLogger logReactorSummary
INFO: Server ............................................ SUCCESS [21.367s]
Jul 23, 2013 5:48:06 PM org.apache.maven.cli.event.ExecutionEventLogger logReactorSummary
INFO: Examples .......................................... SUCCESS [1.037s]
Jul 23, 2013 5:48:06 PM org.apache.maven.cli.event.ExecutionEventLogger logReactorSummary
INFO: Simple Examples ................................... SUCCESS [10.622s]
Jul 23, 2013 5:48:06 PM org.apache.maven.cli.event.ExecutionEventLogger logReactorSummary
INFO: MiniCluster ....................................... FAILURE [0.656s]
Jul 23, 2013 5:48:06 PM org.apache.maven.cli.event.ExecutionEventLogger logReactorSummary
INFO: Accumulo Maven Plugin ............................. SKIPPED
Jul 23, 2013 5:48:06 PM org.apache.maven.cli.event.ExecutionEventLogger logReactorSummary
INFO: Testing ........................................... SKIPPED
Jul 23, 2013 5:48:06 PM org.apache.maven.cli.event.ExecutionEventLogger logReactorSummary
INFO: Proxy ............................................. SKIPPED
Jul 23, 2013 5:48:06 PM org.apache.maven.cli.event.ExecutionEventLogger logReactorSummary
INFO: Assemblies ........................................ SKIPPED
Jul 23, 2013 5:48:06 PM org.apache.maven.cli.event.ExecutionEventLogger logReactorSummary
INFO: Documentation ..................................... SKIPPED
Jul 23, 2013 5:48:06 PM org.apache.maven.cli.event.ExecutionEventLogger logResult
INFO: ------------------------------------------------------------------------
Jul 23, 2013 5:48:06 PM org.apache.maven.cli.event.ExecutionEventLogger logResult
INFO: BUILD FAILURE
Jul 23, 2013 5:48:06 PM org.apache.maven.cli.event.ExecutionEventLogger logStats
INFO: ------------------------------------------------------------------------
Jul 23, 2013 5:48:06 PM org.apache.maven.cli.event.ExecutionEventLogger logStats
INFO: Total time: 2:42.348s
Jul 23, 2013 5:48:06 PM org.apache.maven.cli.event.ExecutionEventLogger logStats
INFO: Finished at: Tue Jul 23 17:48:06 UTC 2013
Jul 23, 2013 5:48:06 PM org.apache.maven.cli.event.ExecutionEventLogger logStats
INFO: Final Memory: 41M/238M
Jul 23, 2013 5:48:06 PM org.apache.maven.cli.event.ExecutionEventLogger sessionEnded
INFO: ------------------------------------------------------------------------
[JENKINS] Archiving <https://builds.apache.org/job/Accumulo-Trunk-Hadoop-2.0/ws/pom.xml>
to /home/hudson/hudson/jobs/Accumulo-Trunk-Hadoop-2.0/modules/org.apache.accumulo$accumulo-project/builds/2013-07-23_17-45-12/archive/org.apache.accumulo/accumulo-project/1.6.0-SNAPSHOT/accumulo-project-1.6.0-SNAPSHOT.pom
[JENKINS] Archiving <https://builds.apache.org/job/Accumulo-Trunk-Hadoop-2.0/ws/target/accumulo-project-1.6.0-SNAPSHOT-site.xml>
to /home/hudson/hudson/jobs/Accumulo-Trunk-Hadoop-2.0/modules/org.apache.accumulo$accumulo-project/builds/2013-07-23_17-45-12/archive/org.apache.accumulo/accumulo-project/1.6.0-SNAPSHOT/accumulo-project-1.6.0-SNAPSHOT-site.xml
[JENKINS] Archiving <https://builds.apache.org/job/Accumulo-Trunk-Hadoop-2.0/ws/server/pom.xml>
to /home/hudson/hudson/jobs/Accumulo-Trunk-Hadoop-2.0/modules/org.apache.accumulo$accumulo-server/builds/2013-07-23_17-45-12/archive/org.apache.accumulo/accumulo-server/1.6.0-SNAPSHOT/accumulo-server-1.6.0-SNAPSHOT.pom
[JENKINS] Archiving <https://builds.apache.org/job/Accumulo-Trunk-Hadoop-2.0/ws/server/target/accumulo-server-1.6.0-SNAPSHOT.jar>
to /home/hudson/hudson/jobs/Accumulo-Trunk-Hadoop-2.0/modules/org.apache.accumulo$accumulo-server/builds/2013-07-23_17-45-12/archive/org.apache.accumulo/accumulo-server/1.6.0-SNAPSHOT/accumulo-server-1.6.0-SNAPSHOT.jar
[JENKINS] Archiving <https://builds.apache.org/job/Accumulo-Trunk-Hadoop-2.0/ws/minicluster/pom.xml>
to /home/hudson/hudson/jobs/Accumulo-Trunk-Hadoop-2.0/modules/org.apache.accumulo$accumulo-minicluster/builds/2013-07-23_17-45-12/archive/org.apache.accumulo/accumulo-minicluster/1.6.0-SNAPSHOT/accumulo-minicluster-1.6.0-SNAPSHOT.pom
[JENKINS] Archiving <https://builds.apache.org/job/Accumulo-Trunk-Hadoop-2.0/ws/maven-plugin/pom.xml>
to /home/hudson/hudson/jobs/Accumulo-Trunk-Hadoop-2.0/modules/org.apache.accumulo$accumulo-maven-plugin/builds/2013-07-23_17-45-12/archive/org.apache.accumulo/accumulo-maven-plugin/1.6.0-SNAPSHOT/accumulo-maven-plugin-1.6.0-SNAPSHOT.pom
[JENKINS] Archiving <https://builds.apache.org/job/Accumulo-Trunk-Hadoop-2.0/ws/examples/simple/pom.xml>
to /home/hudson/hudson/jobs/Accumulo-Trunk-Hadoop-2.0/modules/org.apache.accumulo$accumulo-examples-simple/builds/2013-07-23_17-45-12/archive/org.apache.accumulo/accumulo-examples-simple/1.6.0-SNAPSHOT/accumulo-examples-simple-1.6.0-SNAPSHOT.pom
[JENKINS] Archiving <https://builds.apache.org/job/Accumulo-Trunk-Hadoop-2.0/ws/examples/simple/target/accumulo-examples-simple-1.6.0-SNAPSHOT.jar>
to /home/hudson/hudson/jobs/Accumulo-Trunk-Hadoop-2.0/modules/org.apache.accumulo$accumulo-examples-simple/builds/2013-07-23_17-45-12/archive/org.apache.accumulo/accumulo-examples-simple/1.6.0-SNAPSHOT/accumulo-examples-simple-1.6.0-SNAPSHOT.jar
[JENKINS] Archiving <https://builds.apache.org/job/Accumulo-Trunk-Hadoop-2.0/ws/proxy/pom.xml>
to /home/hudson/hudson/jobs/Accumulo-Trunk-Hadoop-2.0/modules/org.apache.accumulo$accumulo-proxy/builds/2013-07-23_17-45-12/archive/org.apache.accumulo/accumulo-proxy/1.6.0-SNAPSHOT/accumulo-proxy-1.6.0-SNAPSHOT.pom
[JENKINS] Archiving <https://builds.apache.org/job/Accumulo-Trunk-Hadoop-2.0/ws/examples/pom.xml>
to /home/hudson/hudson/jobs/Accumulo-Trunk-Hadoop-2.0/modules/org.apache.accumulo$accumulo-examples/builds/2013-07-23_17-45-12/archive/org.apache.accumulo/accumulo-examples/1.6.0-SNAPSHOT/accumulo-examples-1.6.0-SNAPSHOT.pom
[JENKINS] Archiving <https://builds.apache.org/job/Accumulo-Trunk-Hadoop-2.0/ws/assemble/pom.xml>
to /home/hudson/hudson/jobs/Accumulo-Trunk-Hadoop-2.0/modules/org.apache.accumulo$accumulo/builds/2013-07-23_17-45-12/archive/org.apache.accumulo/accumulo/1.6.0-SNAPSHOT/accumulo-1.6.0-SNAPSHOT.pom
[JENKINS] Archiving <https://builds.apache.org/job/Accumulo-Trunk-Hadoop-2.0/ws/test/pom.xml>
to /home/hudson/hudson/jobs/Accumulo-Trunk-Hadoop-2.0/modules/org.apache.accumulo$accumulo-test/builds/2013-07-23_17-45-12/archive/org.apache.accumulo/accumulo-test/1.6.0-SNAPSHOT/accumulo-test-1.6.0-SNAPSHOT.pom
[JENKINS] Archiving <https://builds.apache.org/job/Accumulo-Trunk-Hadoop-2.0/ws/start/pom.xml>
to /home/hudson/hudson/jobs/Accumulo-Trunk-Hadoop-2.0/modules/org.apache.accumulo$accumulo-start/builds/2013-07-23_17-45-12/archive/org.apache.accumulo/accumulo-start/1.6.0-SNAPSHOT/accumulo-start-1.6.0-SNAPSHOT.pom
[JENKINS] Archiving <https://builds.apache.org/job/Accumulo-Trunk-Hadoop-2.0/ws/start/target/accumulo-start-1.6.0-SNAPSHOT.jar>
to /home/hudson/hudson/jobs/Accumulo-Trunk-Hadoop-2.0/modules/org.apache.accumulo$accumulo-start/builds/2013-07-23_17-45-12/archive/org.apache.accumulo/accumulo-start/1.6.0-SNAPSHOT/accumulo-start-1.6.0-SNAPSHOT.jar
[JENKINS] Archiving <https://builds.apache.org/job/Accumulo-Trunk-Hadoop-2.0/ws/fate/pom.xml>
to /home/hudson/hudson/jobs/Accumulo-Trunk-Hadoop-2.0/modules/org.apache.accumulo$accumulo-fate/builds/2013-07-23_17-45-12/archive/org.apache.accumulo/accumulo-fate/1.6.0-SNAPSHOT/accumulo-fate-1.6.0-SNAPSHOT.pom
[JENKINS] Archiving <https://builds.apache.org/job/Accumulo-Trunk-Hadoop-2.0/ws/fate/target/accumulo-fate-1.6.0-SNAPSHOT.jar>
to /home/hudson/hudson/jobs/Accumulo-Trunk-Hadoop-2.0/modules/org.apache.accumulo$accumulo-fate/builds/2013-07-23_17-45-12/archive/org.apache.accumulo/accumulo-fate/1.6.0-SNAPSHOT/accumulo-fate-1.6.0-SNAPSHOT.jar
[JENKINS] Archiving <https://builds.apache.org/job/Accumulo-Trunk-Hadoop-2.0/ws/core/pom.xml>
to /home/hudson/hudson/jobs/Accumulo-Trunk-Hadoop-2.0/modules/org.apache.accumulo$accumulo-core/builds/2013-07-23_17-45-12/archive/org.apache.accumulo/accumulo-core/1.6.0-SNAPSHOT/accumulo-core-1.6.0-SNAPSHOT.pom
[JENKINS] Archiving <https://builds.apache.org/job/Accumulo-Trunk-Hadoop-2.0/ws/core/target/accumulo-core-1.6.0-SNAPSHOT.jar>
to /home/hudson/hudson/jobs/Accumulo-Trunk-Hadoop-2.0/modules/org.apache.accumulo$accumulo-core/builds/2013-07-23_17-45-12/archive/org.apache.accumulo/accumulo-core/1.6.0-SNAPSHOT/accumulo-core-1.6.0-SNAPSHOT.jar
[JENKINS] Archiving <https://builds.apache.org/job/Accumulo-Trunk-Hadoop-2.0/ws/trace/pom.xml>
to /home/hudson/hudson/jobs/Accumulo-Trunk-Hadoop-2.0/modules/org.apache.accumulo$accumulo-trace/builds/2013-07-23_17-45-12/archive/org.apache.accumulo/accumulo-trace/1.6.0-SNAPSHOT/accumulo-trace-1.6.0-SNAPSHOT.pom
[JENKINS] Archiving <https://builds.apache.org/job/Accumulo-Trunk-Hadoop-2.0/ws/trace/target/accumulo-trace-1.6.0-SNAPSHOT.jar>
to /home/hudson/hudson/jobs/Accumulo-Trunk-Hadoop-2.0/modules/org.apache.accumulo$accumulo-trace/builds/2013-07-23_17-45-12/archive/org.apache.accumulo/accumulo-trace/1.6.0-SNAPSHOT/accumulo-trace-1.6.0-SNAPSHOT.jar
[JENKINS] Archiving <https://builds.apache.org/job/Accumulo-Trunk-Hadoop-2.0/ws/docs/pom.xml>
to /home/hudson/hudson/jobs/Accumulo-Trunk-Hadoop-2.0/modules/org.apache.accumulo$accumulo-docs/builds/2013-07-23_17-45-12/archive/org.apache.accumulo/accumulo-docs/1.6.0-SNAPSHOT/accumulo-docs-1.6.0-SNAPSHOT.pom
Waiting for Jenkins to finish collecting data
mavenExecutionResult exceptions not empty
message : Failed to execute goal on project accumulo-minicluster: Could not resolve dependencies
for project org.apache.accumulo:accumulo-minicluster:jar:1.6.0-SNAPSHOT: Could not find artifact
org.apache.hadoop:hadoop-test:jar:2.0.4-alpha in central (http://repo.maven.apache.org/maven2)
cause : Could not resolve dependencies for project org.apache.accumulo:accumulo-minicluster:jar:1.6.0-SNAPSHOT:
Could not find artifact org.apache.hadoop:hadoop-test:jar:2.0.4-alpha in central (http://repo.maven.apache.org/maven2)
Stack trace : 
org.apache.maven.lifecycle.LifecycleExecutionException: Failed to execute goal on project
accumulo-minicluster: Could not resolve dependencies for project org.apache.accumulo:accumulo-minicluster:jar:1.6.0-SNAPSHOT:
Could not find artifact org.apache.hadoop:hadoop-test:jar:2.0.4-alpha in central (http://repo.maven.apache.org/maven2)
	at org.apache.maven.lifecycle.internal.LifecycleDependencyResolver.getDependencies(LifecycleDependencyResolver.java:210)
	at org.apache.maven.lifecycle.internal.LifecycleDependencyResolver.resolveProjectDependencies(LifecycleDependencyResolver.java:117)
	at org.apache.maven.lifecycle.internal.MojoExecutor.ensureDependenciesAreResolved(MojoExecutor.java:258)
	at org.apache.maven.lifecycle.internal.MojoExecutor.execute(MojoExecutor.java:201)
	at org.apache.maven.lifecycle.internal.MojoExecutor.execute(MojoExecutor.java:153)
	at org.apache.maven.lifecycle.internal.MojoExecutor.execute(MojoExecutor.java:145)
	at org.apache.maven.lifecycle.internal.LifecycleModuleBuilder.buildProject(LifecycleModuleBuilder.java:84)
	at org.apache.maven.lifecycle.internal.LifecycleModuleBuilder.buildProject(LifecycleModuleBuilder.java:59)
	at org.apache.maven.lifecycle.internal.LifecycleStarter.singleThreadedBuild(LifecycleStarter.java:183)
	at org.apache.maven.lifecycle.internal.LifecycleStarter.execute(LifecycleStarter.java:161)
	at org.apache.maven.DefaultMaven.doExecute(DefaultMaven.java:320)
	at org.apache.maven.DefaultMaven.execute(DefaultMaven.java:156)
	at org.jvnet.hudson.maven3.launcher.Maven3Launcher.main(Maven3Launcher.java:117)
	at sun.reflect.NativeMethodAccessorImpl.invoke0(Native Method)
	at sun.reflect.NativeMethodAccessorImpl.invoke(NativeMethodAccessorImpl.java:39)
	at sun.reflect.DelegatingMethodAccessorImpl.invoke(DelegatingMethodAccessorImpl.java:25)
	at java.lang.reflect.Method.invoke(Method.java:597)
	at org.codehaus.plexus.classworlds.launcher.Launcher.launchStandard(Launcher.java:329)
	at org.codehaus.plexus.classworlds.launcher.Launcher.launch(Launcher.java:239)
	at org.jvnet.hudson.maven3.agent.Maven3Main.launch(Maven3Main.java:178)
	at sun.reflect.NativeMethodAccessorImpl.invoke0(Native Method)
	at sun.reflect.NativeMethodAccessorImpl.invoke(NativeMethodAccessorImpl.java:39)
	at sun.reflect.DelegatingMethodAccessorImpl.invoke(DelegatingMethodAccessorImpl.java:25)
	at java.lang.reflect.Method.invoke(Method.java:597)
	at hudson.maven.Maven3Builder.call(Maven3Builder.java:129)
	at hudson.maven.Maven3Builder.call(Maven3Builder.java:67)
	at hudson.remoting.UserRequest.perform(UserRequest.java:118)
	at hudson.remoting.UserRequest.perform(UserRequest.java:48)
	at hudson.remoting.Request$2.run(Request.java:326)
	at hudson.remoting.InterceptingExecutorService$1.call(InterceptingExecutorService.java:72)
	at java.util.concurrent.FutureTask$Sync.innerRun(FutureTask.java:303)
	at java.util.concurrent.FutureTask.run(FutureTask.java:138)
	at java.util.concurrent.ThreadPoolExecutor$Worker.runTask(ThreadPoolExecutor.java:895)
	at java.util.concurrent.ThreadPoolExecutor$Worker.run(ThreadPoolExecutor.java:918)
	at java.lang.Thread.run(Thread.java:662)
Caused by: org.apache.maven.project.DependencyResolutionException: Could not resolve dependencies
for project org.apache.accumulo:accumulo-minicluster:jar:1.6.0-SNAPSHOT: Could not find artifact
org.apache.hadoop:hadoop-test:jar:2.0.4-alpha in central (http://repo.maven.apache.org/maven2)
	at org.apache.maven.project.DefaultProjectDependenciesResolver.resolve(DefaultProjectDependenciesResolver.java:189)
	at org.apache.maven.lifecycle.internal.LifecycleDependencyResolver.getDependencies(LifecycleDependencyResolver.java:185)
	... 34 more
Caused by: org.sonatype.aether.resolution.DependencyResolutionException: Could not find artifact
org.apache.hadoop:hadoop-test:jar:2.0.4-alpha in central (http://repo.maven.apache.org/maven2)
	at org.sonatype.aether.impl.internal.DefaultRepositorySystem.resolveDependencies(DefaultRepositorySystem.java:375)
	at org.apache.maven.project.DefaultProjectDependenciesResolver.resolve(DefaultProjectDependenciesResolver.java:183)
	... 35 more
Caused by: org.sonatype.aether.resolution.ArtifactResolutionException: Could not find artifact
org.apache.hadoop:hadoop-test:jar:2.0.4-alpha in central (http://repo.maven.apache.org/maven2)
	at org.sonatype.aether.impl.internal.DefaultArtifactResolver.resolve(DefaultArtifactResolver.java:538)
	at org.sonatype.aether.impl.internal.DefaultArtifactResolver.resolveArtifacts(DefaultArtifactResolver.java:216)
	at org.sonatype.aether.impl.internal.DefaultRepositorySystem.resolveDependencies(DefaultRepositorySystem.java:358)
	... 36 more
Caused by: org.sonatype.aether.transfer.ArtifactNotFoundException: Could not find artifact
org.apache.hadoop:hadoop-test:jar:2.0.4-alpha in central (http://repo.maven.apache.org/maven2)
	at org.sonatype.aether.connector.wagon.WagonRepositoryConnector$4.wrap(WagonRepositoryConnector.java:947)
	at org.sonatype.aether.connector.wagon.WagonRepositoryConnector$4.wrap(WagonRepositoryConnector.java:941)
	at org.sonatype.aether.connector.wagon.WagonRepositoryConnector$GetTask.run(WagonRepositoryConnector.java:669)
	at org.sonatype.aether.util.concurrency.RunnableErrorForwarder$1.run(RunnableErrorForwarder.java:60)
	... 3 more
Sending e-mails to: notifications@accumulo.apache.org
Sending e-mails to: notifications@accumulo.apache.org
channel stopped

Mime
View raw message