accumulo-notifications mailing list archives

Site index · List index
Message view « Date » · « Thread »
Top « Date » · « Thread »
From Apache Jenkins Server <jenk...@builds.apache.org>
Subject Build failed in Jenkins: Accumulo-Trunk-Hadoop-2.0 » Testing #318
Date Tue, 23 Jul 2013 23:30:08 GMT
See <https://builds.apache.org/job/Accumulo-Trunk-Hadoop-2.0/org.apache.accumulo$accumulo-test/318/changes>

Changes:

[ctubbsii] ACCUMULO-1545 Switch to UTF-8 Charset constant instead of string literals

------------------------------------------
[...truncated 111 lines...]

Tests run: 22, Failures: 0, Errors: 0, Skipped: 0

[JENKINS] Recording test results
Jul 23, 2013 10:57:19 PM org.apache.maven.cli.event.ExecutionEventLogger mojoStarted
INFO: 
Jul 23, 2013 10:57:19 PM org.apache.maven.cli.event.ExecutionEventLogger mojoStarted
INFO: --- maven-jar-plugin:2.4:jar (default-jar) @ accumulo-test ---
[INFO] Building jar: <https://builds.apache.org/job/Accumulo-Trunk-Hadoop-2.0/org.apache.accumulo$accumulo-test/ws/target/accumulo-test-1.6.0-SNAPSHOT.jar>
Jul 23, 2013 10:57:19 PM org.apache.maven.cli.event.ExecutionEventLogger mojoStarted
INFO: 
Jul 23, 2013 10:57:19 PM org.apache.maven.cli.event.ExecutionEventLogger mojoStarted
INFO: --- maven-site-plugin:3.2:attach-descriptor (attach-descriptor) @ accumulo-test ---
Jul 23, 2013 10:57:19 PM org.apache.maven.cli.event.ExecutionEventLogger mojoStarted
INFO: 
Jul 23, 2013 10:57:19 PM org.apache.maven.cli.event.ExecutionEventLogger mojoStarted
INFO: --- maven-dependency-plugin:2.7:build-classpath (setup-mini-classpath) @ accumulo-test
---
Jul 23, 2013 10:57:20 PM org.apache.maven.cli.event.ExecutionEventLogger mojoStarted
INFO: 
Jul 23, 2013 10:57:20 PM org.apache.maven.cli.event.ExecutionEventLogger mojoStarted
INFO: --- maven-sortpom-plugin:2.1.0:verify (verify-sorted-pom) @ accumulo-test ---
[INFO] Verifying file <https://builds.apache.org/job/Accumulo-Trunk-Hadoop-2.0/org.apache.accumulo$accumulo-test/ws/pom.xml>
Jul 23, 2013 10:57:20 PM org.apache.maven.cli.event.ExecutionEventLogger mojoStarted
INFO: 
Jul 23, 2013 10:57:20 PM org.apache.maven.cli.event.ExecutionEventLogger mojoStarted
INFO: --- maven-enforcer-plugin:1.0.1:enforce (enforce-mvn) @ accumulo-test ---
Jul 23, 2013 10:57:20 PM hudson.maven.ExecutedMojo <init>
WARNING: Failed to getClass for org.codehaus.mojo.exec.ExecJavaMojo
Jul 23, 2013 10:57:20 PM org.apache.maven.cli.event.ExecutionEventLogger mojoStarted
INFO: 
Jul 23, 2013 10:57:20 PM org.apache.maven.cli.event.ExecutionEventLogger mojoStarted
INFO: --- exec-maven-plugin:1.2.1:java (run-mini-for-integration-tests) @ accumulo-test ---
Starting MiniAccumuloCluster: testInstance1 in /x1/jenkins/jenkins-slave/workspace/Accumulo-Trunk-Hadoop-2.0/test/target/accumulo-maven-plugin/testInstance1
Starting MiniAccumuloCluster: testInstance2 in /x1/jenkins/jenkins-slave/workspace/Accumulo-Trunk-Hadoop-2.0/test/target/accumulo-maven-plugin/testInstance2
Jul 23, 2013 10:57:28 PM org.apache.maven.cli.event.ExecutionEventLogger mojoStarted
INFO: 
Jul 23, 2013 10:57:28 PM org.apache.maven.cli.event.ExecutionEventLogger mojoStarted
INFO: --- maven-failsafe-plugin:2.12.4:integration-test (run-integration-tests) @ accumulo-test
---
[INFO] Failsafe report directory: <https://builds.apache.org/job/Accumulo-Trunk-Hadoop-2.0/org.apache.accumulo$accumulo-test/ws/target/failsafe-reports>

-------------------------------------------------------
 T E S T S
-------------------------------------------------------
Running org.apache.accumulo.test.TableOperationsIT
Tests run: 3, Failures: 0, Errors: 0, Skipped: 0, Time elapsed: 10.309 sec
Running org.apache.accumulo.test.functional.ScanSessionTimeOutIT
Tests run: 1, Failures: 0, Errors: 0, Skipped: 0, Time elapsed: 20.946 sec
Running org.apache.accumulo.test.functional.DeleteIT
Tests run: 1, Failures: 0, Errors: 0, Skipped: 0, Time elapsed: 33.434 sec
Running org.apache.accumulo.test.functional.ChaoticBlancerIT
Tests run: 1, Failures: 0, Errors: 0, Skipped: 0, Time elapsed: 83.779 sec
Running org.apache.accumulo.test.functional.RestartIT
Tests run: 6, Failures: 0, Errors: 1, Skipped: 0, Time elapsed: 219.252 sec <<< FAILURE!
killedTabletServer(org.apache.accumulo.test.functional.RestartIT)  Time elapsed: 67.49 sec
 <<< ERROR!
java.lang.Exception: test timed out after 60000 milliseconds
	at sun.nio.ch.EPollArrayWrapper.epollWait(Native Method)
	at sun.nio.ch.EPollArrayWrapper.poll(EPollArrayWrapper.java:210)
	at sun.nio.ch.EPollSelectorImpl.doSelect(EPollSelectorImpl.java:65)
	at sun.nio.ch.SelectorImpl.lockAndDoSelect(SelectorImpl.java:69)
	at sun.nio.ch.SelectorImpl.select(SelectorImpl.java:80)
	at org.apache.hadoop.net.SocketIOWithTimeout$SelectorPool.select(SocketIOWithTimeout.java:335)
	at org.apache.hadoop.net.SocketIOWithTimeout.doIO(SocketIOWithTimeout.java:157)
	at org.apache.hadoop.net.SocketInputStream.read(SocketInputStream.java:159)
	at org.apache.hadoop.net.SocketInputStream.read(SocketInputStream.java:129)
	at java.io.FilterInputStream.read(FilterInputStream.java:116)
	at java.io.BufferedInputStream.fill(BufferedInputStream.java:218)
	at java.io.BufferedInputStream.read1(BufferedInputStream.java:258)
	at java.io.BufferedInputStream.read(BufferedInputStream.java:317)
	at org.apache.thrift.transport.TIOStreamTransport.read(TIOStreamTransport.java:127)
	at org.apache.thrift.transport.TTransport.readAll(TTransport.java:84)
	at org.apache.thrift.transport.TFramedTransport.readFrame(TFramedTransport.java:129)
	at org.apache.thrift.transport.TFramedTransport.read(TFramedTransport.java:101)
	at org.apache.thrift.transport.TTransport.readAll(TTransport.java:84)
	at org.apache.accumulo.core.client.impl.ThriftTransportPool$CachedTTransport.readAll(ThriftTransportPool.java:253)
	at org.apache.thrift.protocol.TCompactProtocol.readByte(TCompactProtocol.java:601)
	at org.apache.thrift.protocol.TCompactProtocol.readMessageBegin(TCompactProtocol.java:470)
	at org.apache.thrift.TServiceClient.receiveBase(TServiceClient.java:69)
	at org.apache.accumulo.core.tabletserver.thrift.TabletClientService$Client.recv_startMultiScan(TabletClientService.java:294)
	at org.apache.accumulo.core.tabletserver.thrift.TabletClientService$Client.startMultiScan(TabletClientService.java:274)
	at org.apache.accumulo.core.client.impl.TabletServerBatchReaderIterator.doLookup(TabletServerBatchReaderIterator.java:649)
	at org.apache.accumulo.core.client.impl.TabletServerBatchReaderIterator.doLookup(TabletServerBatchReaderIterator.java:610)
	at org.apache.accumulo.core.metadata.MetadataLocationObtainer.lookupTablets(MetadataLocationObtainer.java:191)
	at org.apache.accumulo.core.client.impl.TabletLocatorImpl.processInvalidated(TabletLocatorImpl.java:595)
	at org.apache.accumulo.core.client.impl.TabletLocatorImpl.binRanges(TabletLocatorImpl.java:275)
	at org.apache.accumulo.core.client.impl.TabletLocatorImpl.processInvalidated(TabletLocatorImpl.java:588)
	at org.apache.accumulo.core.client.impl.TabletLocatorImpl._locateTablet(TabletLocatorImpl.java:539)
	at org.apache.accumulo.core.client.impl.TabletLocatorImpl.locateTablet(TabletLocatorImpl.java:377)
	at org.apache.accumulo.core.client.impl.ThriftScanner.scan(ThriftScanner.java:214)
	at org.apache.accumulo.core.client.impl.ScannerIterator$Reader.run(ScannerIterator.java:82)
	at org.apache.accumulo.core.client.impl.ScannerIterator.hasNext(ScannerIterator.java:164)
	at org.apache.accumulo.test.VerifyIngest.verifyIngest(VerifyIngest.java:162)
	at org.apache.accumulo.test.functional.RestartIT.killedTabletServer(RestartIT.java:117)
	at sun.reflect.NativeMethodAccessorImpl.invoke0(Native Method)
	at sun.reflect.NativeMethodAccessorImpl.invoke(NativeMethodAccessorImpl.java:39)
	at sun.reflect.DelegatingMethodAccessorImpl.invoke(DelegatingMethodAccessorImpl.java:25)
	at java.lang.reflect.Method.invoke(Method.java:597)
	at org.junit.runners.model.FrameworkMethod$1.runReflectiveCall(FrameworkMethod.java:47)
	at org.junit.internal.runners.model.ReflectiveCallable.run(ReflectiveCallable.java:12)
	at org.junit.runners.model.FrameworkMethod.invokeExplosively(FrameworkMethod.java:44)
	at org.junit.internal.runners.statements.InvokeMethod.evaluate(InvokeMethod.java:17)
	at org.junit.internal.runners.statements.FailOnTimeout$StatementThread.run(FailOnTimeout.java:74)

Running org.apache.accumulo.test.functional.DeleteEverythingIT
Tests run: 1, Failures: 0, Errors: 0, Skipped: 0, Time elapsed: 12.252 sec
Running org.apache.accumulo.test.functional.CreateAndUseIT
Tests run: 1, Failures: 0, Errors: 0, Skipped: 0, Time elapsed: 37.255 sec
Running org.apache.accumulo.test.functional.CreateManyScannersIT
Tests run: 1, Failures: 0, Errors: 0, Skipped: 0, Time elapsed: 1.751 sec
Running org.apache.accumulo.test.functional.BinaryStressIT
Tests run: 1, Failures: 0, Errors: 0, Skipped: 0, Time elapsed: 24.85 sec
Running org.apache.accumulo.test.functional.BinaryIT
Tests run: 1, Failures: 0, Errors: 0, Skipped: 0, Time elapsed: 16.535 sec
Running org.apache.accumulo.test.functional.ConstraintIT
Tests run: 1, Failures: 0, Errors: 0, Skipped: 0, Time elapsed: 3.616 sec
Running org.apache.accumulo.test.functional.ZookeeperRestartIT
Tests run: 1, Failures: 0, Errors: 0, Skipped: 0, Time elapsed: 11.07 sec
Running org.apache.accumulo.test.functional.CombinerIT
Tests run: 1, Failures: 0, Errors: 0, Skipped: 0, Time elapsed: 1.696 sec
Running org.apache.accumulo.test.functional.SplitIT
Tests run: 3, Failures: 0, Errors: 0, Skipped: 0, Time elapsed: 176.856 sec
Running org.apache.accumulo.test.functional.BulkSplitOptimizationIT
Tests run: 1, Failures: 0, Errors: 0, Skipped: 0, Time elapsed: 21.066 sec
Running org.apache.accumulo.test.functional.ShutdownIT
Tests run: 6, Failures: 0, Errors: 1, Skipped: 0, Time elapsed: 165.614 sec <<< FAILURE!
shutdownDuringIngest(org.apache.accumulo.test.functional.ShutdownIT)  Time elapsed: 63.553
sec  <<< ERROR!
java.lang.Exception: test timed out after 60000 milliseconds
	at java.lang.Object.wait(Native Method)
	at java.lang.Object.wait(Object.java:485)
	at java.lang.UNIXProcess.waitFor(UNIXProcess.java:165)
	at org.apache.accumulo.test.functional.ShutdownIT.shutdownDuringIngest(ShutdownIT.java:39)
	at sun.reflect.NativeMethodAccessorImpl.invoke0(Native Method)
	at sun.reflect.NativeMethodAccessorImpl.invoke(NativeMethodAccessorImpl.java:39)
	at sun.reflect.DelegatingMethodAccessorImpl.invoke(DelegatingMethodAccessorImpl.java:25)
	at java.lang.reflect.Method.invoke(Method.java:597)
	at org.junit.runners.model.FrameworkMethod$1.runReflectiveCall(FrameworkMethod.java:47)
	at org.junit.internal.runners.model.ReflectiveCallable.run(ReflectiveCallable.java:12)
	at org.junit.runners.model.FrameworkMethod.invokeExplosively(FrameworkMethod.java:44)
	at org.junit.internal.runners.statements.InvokeMethod.evaluate(InvokeMethod.java:17)
	at org.junit.internal.runners.statements.FailOnTimeout$StatementThread.run(FailOnTimeout.java:74)

Running org.apache.accumulo.test.functional.ReadWriteIT
Tests run: 7, Failures: 0, Errors: 1, Skipped: 0, Time elapsed: 207.655 sec <<< FAILURE!
sunnyDay(org.apache.accumulo.test.functional.ReadWriteIT)  Time elapsed: 63.777 sec  <<<
ERROR!
java.lang.Exception: test timed out after 60000 milliseconds
	at java.lang.Object.wait(Native Method)
	at java.lang.Object.wait(Object.java:485)
	at java.lang.UNIXProcess.waitFor(UNIXProcess.java:165)
	at org.apache.accumulo.test.functional.ReadWriteIT.sunnyDay(ReadWriteIT.java:79)
	at sun.reflect.NativeMethodAccessorImpl.invoke0(Native Method)
	at sun.reflect.NativeMethodAccessorImpl.invoke(NativeMethodAccessorImpl.java:39)
	at sun.reflect.DelegatingMethodAccessorImpl.invoke(DelegatingMethodAccessorImpl.java:25)
	at java.lang.reflect.Method.invoke(Method.java:597)
	at org.junit.runners.model.FrameworkMethod$1.runReflectiveCall(FrameworkMethod.java:47)
	at org.junit.internal.runners.model.ReflectiveCallable.run(ReflectiveCallable.java:12)
	at org.junit.runners.model.FrameworkMethod.invokeExplosively(FrameworkMethod.java:44)
	at org.junit.internal.runners.statements.InvokeMethod.evaluate(InvokeMethod.java:17)
	at org.junit.internal.runners.statements.FailOnTimeout$StatementThread.run(FailOnTimeout.java:74)

Running org.apache.accumulo.test.functional.SimpleBalancerFairnessIT
Tests run: 1, Failures: 0, Errors: 0, Skipped: 0, Time elapsed: 107.585 sec
Running org.apache.accumulo.test.functional.ClassLoaderIT
Tests run: 1, Failures: 0, Errors: 0, Skipped: 0, Time elapsed: 12.671 sec
Running org.apache.accumulo.test.functional.StartIT
Tests run: 1, Failures: 0, Errors: 0, Skipped: 0, Time elapsed: 1.148 sec
Running org.apache.accumulo.test.functional.MaxOpenIT
Tests run: 1, Failures: 0, Errors: 0, Skipped: 0, Time elapsed: 13.558 sec
Running org.apache.accumulo.test.functional.BatchWriterFlushIT
Tests run: 1, Failures: 0, Errors: 0, Skipped: 0, Time elapsed: 10.275 sec
Running org.apache.accumulo.test.functional.TabletIT
Tests run: 1, Failures: 0, Errors: 0, Skipped: 0, Time elapsed: 6.933 sec
Running org.apache.accumulo.test.functional.RenameIT
Tests run: 1, Failures: 0, Errors: 0, Skipped: 0, Time elapsed: 15.232 sec
Running org.apache.accumulo.test.functional.WriteAheadLogIT
Tests run: 1, Failures: 0, Errors: 0, Skipped: 0, Time elapsed: 93.462 sec
Running org.apache.accumulo.test.functional.RestartStressIT
Tests run: 1, Failures: 0, Errors: 0, Skipped: 0, Time elapsed: 236.774 sec
Running org.apache.accumulo.test.functional.MergeIT
Tests run: 3, Failures: 0, Errors: 1, Skipped: 0, Time elapsed: 14.26 sec <<< FAILURE!
mergeTest(org.apache.accumulo.test.functional.MergeIT)  Time elapsed: 7.449 sec  <<<
ERROR!
java.lang.Exception: split inconsistency table141_0 [m] != []
	at org.apache.accumulo.test.functional.MergeIT.runMergeTest(MergeIT.java:180)
	at org.apache.accumulo.test.functional.MergeIT.runMergeTest(MergeIT.java:131)
	at org.apache.accumulo.test.functional.MergeIT.mergeTest(MergeIT.java:109)
	at sun.reflect.NativeMethodAccessorImpl.invoke0(Native Method)
	at sun.reflect.NativeMethodAccessorImpl.invoke(NativeMethodAccessorImpl.java:39)
	at sun.reflect.DelegatingMethodAccessorImpl.invoke(DelegatingMethodAccessorImpl.java:25)
	at java.lang.reflect.Method.invoke(Method.java:597)
	at org.junit.runners.model.FrameworkMethod$1.runReflectiveCall(FrameworkMethod.java:47)
	at org.junit.internal.runners.model.ReflectiveCallable.run(ReflectiveCallable.java:12)
	at org.junit.runners.model.FrameworkMethod.invokeExplosively(FrameworkMethod.java:44)
	at org.junit.internal.runners.statements.InvokeMethod.evaluate(InvokeMethod.java:17)
	at org.junit.internal.runners.statements.FailOnTimeout$StatementThread.run(FailOnTimeout.java:74)

Running org.apache.accumulo.test.functional.LogicalTimeIT
Tests run: 1, Failures: 0, Errors: 0, Skipped: 0, Time elapsed: 57.138 sec
Running org.apache.accumulo.test.functional.RowDeleteIT
Tests run: 1, Failures: 0, Errors: 0, Skipped: 0, Time elapsed: 9.006 sec
Running org.apache.accumulo.test.functional.DeleteRowsIT
Tests run: 1, Failures: 0, Errors: 0, Skipped: 0, Time elapsed: 44.96 sec
Running org.apache.accumulo.test.functional.BulkFileIT
Tests run: 1, Failures: 0, Errors: 0, Skipped: 0, Time elapsed: 0.965 sec
Running org.apache.accumulo.test.functional.SplitRecoveryIT
Tests run: 1, Failures: 0, Errors: 0, Skipped: 0, Time elapsed: 0.526 sec
Running org.apache.accumulo.test.functional.ServerSideErrorIT
Tests run: 1, Failures: 0, Errors: 0, Skipped: 0, Time elapsed: 2.418 sec
Running org.apache.accumulo.test.functional.ExamplesIT
Tests run: 1, Failures: 0, Errors: 0, Skipped: 0, Time elapsed: 158.534 sec
Running org.apache.accumulo.test.functional.ScanRangeIT
Tests run: 1, Failures: 0, Errors: 0, Skipped: 0, Time elapsed: 27.123 sec
Running org.apache.accumulo.test.functional.GarbageCollectorIT
Tests run: 2, Failures: 0, Errors: 0, Skipped: 0, Time elapsed: 55.086 sec
Running org.apache.accumulo.test.functional.NativeMapIT
Tests run: 1, Failures: 1, Errors: 0, Skipped: 0, Time elapsed: 0.361 sec <<< FAILURE!
test(org.apache.accumulo.test.functional.NativeMapIT)  Time elapsed: 0.36 sec  <<<
FAILURE!
java.lang.AssertionError: expected:<0> but was:<1>
	at org.junit.Assert.fail(Assert.java:88)
	at org.junit.Assert.failNotEquals(Assert.java:743)
	at org.junit.Assert.assertEquals(Assert.java:118)
	at org.junit.Assert.assertEquals(Assert.java:555)
	at org.junit.Assert.assertEquals(Assert.java:542)
	at org.apache.accumulo.test.functional.NativeMapIT.test(NativeMapIT.java:27)
	at sun.reflect.NativeMethodAccessorImpl.invoke0(Native Method)
	at sun.reflect.NativeMethodAccessorImpl.invoke(NativeMethodAccessorImpl.java:39)
	at sun.reflect.DelegatingMethodAccessorImpl.invoke(DelegatingMethodAccessorImpl.java:25)
	at java.lang.reflect.Method.invoke(Method.java:597)
	at org.junit.runners.model.FrameworkMethod$1.runReflectiveCall(FrameworkMethod.java:47)
	at org.junit.internal.runners.model.ReflectiveCallable.run(ReflectiveCallable.java:12)
	at org.junit.runners.model.FrameworkMethod.invokeExplosively(FrameworkMethod.java:44)
	at org.junit.internal.runners.statements.InvokeMethod.evaluate(InvokeMethod.java:17)
	at org.junit.internal.runners.statements.FailOnTimeout$StatementThread.run(FailOnTimeout.java:74)

Running org.apache.accumulo.test.functional.PermissionsIT
Tests run: 2, Failures: 0, Errors: 0, Skipped: 0, Time elapsed: 5.179 sec
Running org.apache.accumulo.test.functional.BigRootTabletIT
Killed

Results :

Failed tests:   test(org.apache.accumulo.test.functional.NativeMapIT): expected:<0>
but was:<1>

Tests in error: 
  killedTabletServer(org.apache.accumulo.test.functional.RestartIT): test timed out after
60000 milliseconds
  shutdownDuringIngest(org.apache.accumulo.test.functional.ShutdownIT): test timed out after
60000 milliseconds
  sunnyDay(org.apache.accumulo.test.functional.ReadWriteIT): test timed out after 60000 milliseconds
  mergeTest(org.apache.accumulo.test.functional.MergeIT): split inconsistency table141_0 [m]
!= []

Tests run: 62, Failures: 1, Errors: 4, Skipped: 0

[JENKINS] Recording test results

Mime
View raw message