accumulo-notifications mailing list archives

Site index · List index
Message view « Date » · « Thread »
Top « Date » · « Thread »
From Apache Jenkins Server <jenk...@builds.apache.org>
Subject Build failed in Jenkins: Accumulo-Trunk #952
Date Tue, 23 Jul 2013 17:23:37 GMT
See <https://builds.apache.org/job/Accumulo-Trunk/952/>

------------------------------------------
[...truncated 659 lines...]
Tests run: 1, Failures: 0, Errors: 0, Skipped: 0, Time elapsed: 0 sec
Running org.apache.accumulo.core.util.TestStringUtil
Tests run: 1, Failures: 0, Errors: 0, Skipped: 0, Time elapsed: 0 sec
Running org.apache.accumulo.core.cli.TestClientOpts
Tests run: 1, Failures: 0, Errors: 0, Skipped: 0, Time elapsed: 0.006 sec

Results :

Tests run: 428, Failures: 0, Errors: 0, Skipped: 0

[JENKINS] Recording test results
Jul 23, 2013 5:22:44 PM org.apache.maven.cli.event.ExecutionEventLogger mojoStarted
INFO: 
Jul 23, 2013 5:22:44 PM org.apache.maven.cli.event.ExecutionEventLogger mojoStarted
INFO: --- maven-jar-plugin:2.4:jar (default-jar) @ accumulo-core ---
[INFO] Building jar: <https://builds.apache.org/job/Accumulo-Trunk/ws/core/target/accumulo-core-1.6.0-SNAPSHOT.jar>
Jul 23, 2013 5:22:45 PM org.apache.maven.cli.event.ExecutionEventLogger mojoStarted
INFO: 
Jul 23, 2013 5:22:45 PM org.apache.maven.cli.event.ExecutionEventLogger mojoStarted
INFO: --- maven-site-plugin:3.2:attach-descriptor (attach-descriptor) @ accumulo-core ---
Jul 23, 2013 5:22:45 PM org.apache.maven.cli.event.ExecutionEventLogger mojoStarted
INFO: 
Jul 23, 2013 5:22:45 PM org.apache.maven.cli.event.ExecutionEventLogger mojoStarted
INFO: --- maven-failsafe-plugin:2.12.4:integration-test (run-integration-tests) @ accumulo-core
---
[JENKINS] Recording test results
Jul 23, 2013 5:22:45 PM org.apache.maven.cli.event.ExecutionEventLogger mojoStarted
INFO: 
Jul 23, 2013 5:22:45 PM org.apache.maven.cli.event.ExecutionEventLogger mojoStarted
INFO: --- maven-failsafe-plugin:2.12.4:verify (run-integration-tests) @ accumulo-core ---
[INFO] Failsafe report directory: <https://builds.apache.org/job/Accumulo-Trunk/ws/core/target/failsafe-reports>
[JENKINS] Recording test resultsJul 23, 2013 5:22:45 PM org.apache.maven.cli.event.ExecutionEventLogger
mojoStarted
INFO: 
Jul 23, 2013 5:22:45 PM org.apache.maven.cli.event.ExecutionEventLogger mojoStarted
INFO: --- apache-rat-plugin:0.9:check (default) @ accumulo-core ---

[INFO] 51 implicit excludes (use -debug for more details).
[INFO] Exclude: src/test/resources/shelltest.txt
[INFO] Exclude: src/test/resources/org/apache/accumulo/core/file/rfile/ver_3.rf
[INFO] Exclude: src/test/resources/org/apache/accumulo/core/file/rfile/ver_4.rf
[INFO] Exclude: src/test/resources/org/apache/accumulo/core/file/rfile/ver_6.rf
[INFO] 633 resources included (use -debug for more details)
[INFO] Rat check: Summary of files. Unapproved: 0 unknown: 0 generated: 0 approved: 633 licence.
Jul 23, 2013 5:22:46 PM org.apache.maven.cli.event.ExecutionEventLogger projectStarted
INFO:                                                                         
Jul 23, 2013 5:22:46 PM org.apache.maven.cli.event.ExecutionEventLogger projectStarted
INFO: ------------------------------------------------------------------------
Jul 23, 2013 5:22:46 PM org.apache.maven.cli.event.ExecutionEventLogger projectStarted
INFO: Building Server 1.6.0-SNAPSHOT
Jul 23, 2013 5:22:46 PM org.apache.maven.cli.event.ExecutionEventLogger projectStarted
INFO: ------------------------------------------------------------------------
Jul 23, 2013 5:22:46 PM org.apache.maven.cli.event.ExecutionEventLogger mojoStarted
INFO: 
Jul 23, 2013 5:22:46 PM org.apache.maven.cli.event.ExecutionEventLogger mojoStarted
INFO: --- maven-clean-plugin:2.5:clean (default-clean) @ accumulo-server ---
[INFO] Deleting <https://builds.apache.org/job/Accumulo-Trunk/ws/server> (includes =
[**/*.pyc, **/*.so], excludes = [])
Jul 23, 2013 5:22:46 PM org.apache.maven.cli.event.ExecutionEventLogger mojoStarted
INFO: 
Jul 23, 2013 5:22:46 PM org.apache.maven.cli.event.ExecutionEventLogger mojoStarted
INFO: --- maven-sortpom-plugin:2.1.0:verify (verify-sorted-pom) @ accumulo-server ---
[INFO] Verifying file <https://builds.apache.org/job/Accumulo-Trunk/ws/server/pom.xml>
Jul 23, 2013 5:22:46 PM org.apache.maven.cli.event.ExecutionEventLogger mojoStarted
INFO: 
Jul 23, 2013 5:22:46 PM org.apache.maven.cli.event.ExecutionEventLogger mojoStarted
INFO: --- maven-enforcer-plugin:1.0.1:enforce (enforce-mvn) @ accumulo-server ---
Jul 23, 2013 5:22:46 PM org.apache.maven.cli.event.ExecutionEventLogger mojoStarted
INFO: 
Jul 23, 2013 5:22:46 PM org.apache.maven.cli.event.ExecutionEventLogger mojoStarted
INFO: --- maven-remote-resources-plugin:1.4:process (default) @ accumulo-server ---
Jul 23, 2013 5:22:47 PM org.apache.maven.cli.event.ExecutionEventLogger mojoStarted
INFO: 
Jul 23, 2013 5:22:47 PM org.apache.maven.cli.event.ExecutionEventLogger mojoStarted
INFO: --- maven-resources-plugin:2.6:resources (default-resources) @ accumulo-server ---
[INFO] Using 'UTF-8' encoding to copy filtered resources.
[INFO] Copying 38 resources
[INFO] Copying 3 resources
Jul 23, 2013 5:22:47 PM org.apache.maven.cli.event.ExecutionEventLogger mojoStarted
INFO: 
Jul 23, 2013 5:22:47 PM org.apache.maven.cli.event.ExecutionEventLogger mojoStarted
INFO: --- maven-compiler-plugin:2.5.1:compile (default-compile) @ accumulo-server ---
[INFO] Compiling 249 source files to <https://builds.apache.org/job/Accumulo-Trunk/ws/server/target/classes>
[INFO] -------------------------------------------------------------
[ERROR] COMPILATION ERROR : 
[INFO] -------------------------------------------------------------
[ERROR] <https://builds.apache.org/job/Accumulo-Trunk/ws/server/src/main/java/org/apache/accumulo/server/master/Master.java>:[92,33]
cannot find symbol
symbol  : class ServerOpts
location: package org.apache.accumulo.server
[ERROR] <https://builds.apache.org/job/Accumulo-Trunk/ws/server/src/main/java/org/apache/accumulo/server/tabletserver/TabletServer.java>:[138,33]
cannot find symbol
symbol  : class ServerOpts
location: package org.apache.accumulo.server
[ERROR] <https://builds.apache.org/job/Accumulo-Trunk/ws/server/src/main/java/org/apache/accumulo/server/monitor/Monitor.java>:[52,33]
cannot find symbol
symbol  : class ServerOpts
location: package org.apache.accumulo.server
[ERROR] <https://builds.apache.org/job/Accumulo-Trunk/ws/server/src/main/java/org/apache/accumulo/server/gc/SimpleGarbageCollector.java>:[81,33]
cannot find symbol
symbol  : class ServerOpts
location: package org.apache.accumulo.server
[ERROR] <https://builds.apache.org/job/Accumulo-Trunk/ws/server/src/main/java/org/apache/accumulo/server/gc/SimpleGarbageCollector.java>:[110,28]
cannot find symbol
symbol  : class ServerOpts
location: class org.apache.accumulo.server.gc.SimpleGarbageCollector
[ERROR] <https://builds.apache.org/job/Accumulo-Trunk/ws/server/src/main/java/org/apache/accumulo/server/trace/TraceServer.java>:[47,33]
cannot find symbol
symbol  : class ServerOpts
location: package org.apache.accumulo.server
[ERROR] <https://builds.apache.org/job/Accumulo-Trunk/ws/server/src/main/java/org/apache/accumulo/server/master/Master.java>:[1628,6]
cannot find symbol
symbol  : class ServerOpts
location: class org.apache.accumulo.server.master.Master
[ERROR] <https://builds.apache.org/job/Accumulo-Trunk/ws/server/src/main/java/org/apache/accumulo/server/master/Master.java>:[1628,28]
cannot find symbol
symbol  : class ServerOpts
location: class org.apache.accumulo.server.master.Master
[ERROR] <https://builds.apache.org/job/Accumulo-Trunk/ws/server/src/main/java/org/apache/accumulo/server/tabletserver/TabletServer.java>:[3216,6]
cannot find symbol
symbol  : class ServerOpts
location: class org.apache.accumulo.server.tabletserver.TabletServer
[ERROR] <https://builds.apache.org/job/Accumulo-Trunk/ws/server/src/main/java/org/apache/accumulo/server/tabletserver/TabletServer.java>:[3216,28]
cannot find symbol
symbol  : class ServerOpts
location: class org.apache.accumulo.server.tabletserver.TabletServer
[ERROR] <https://builds.apache.org/job/Accumulo-Trunk/ws/server/src/main/java/org/apache/accumulo/server/monitor/Monitor.java>:[454,4]
cannot find symbol
symbol  : class ServerOpts
location: class org.apache.accumulo.server.monitor.Monitor
[ERROR] <https://builds.apache.org/job/Accumulo-Trunk/ws/server/src/main/java/org/apache/accumulo/server/monitor/Monitor.java>:[454,26]
cannot find symbol
symbol  : class ServerOpts
location: class org.apache.accumulo.server.monitor.Monitor
[ERROR] <https://builds.apache.org/job/Accumulo-Trunk/ws/server/src/main/java/org/apache/accumulo/server/gc/SimpleGarbageCollector.java>:[148,8]
cannot find symbol
symbol  : method parseArgs(java.lang.String,java.lang.String[])
location: class org.apache.accumulo.server.gc.SimpleGarbageCollector.Opts
[ERROR] <https://builds.apache.org/job/Accumulo-Trunk/ws/server/src/main/java/org/apache/accumulo/server/gc/SimpleGarbageCollector.java>:[152,31]
cannot find symbol
symbol  : method getAddress()
location: class org.apache.accumulo.server.gc.SimpleGarbageCollector.Opts
[ERROR] <https://builds.apache.org/job/Accumulo-Trunk/ws/server/src/main/java/org/apache/accumulo/server/gc/SimpleGarbageCollector.java>:[396,57]
cannot find symbol
symbol  : method getAddress()
location: class org.apache.accumulo.server.gc.SimpleGarbageCollector.Opts
[ERROR] <https://builds.apache.org/job/Accumulo-Trunk/ws/server/src/main/java/org/apache/accumulo/server/trace/TraceServer.java>:[257,4]
cannot find symbol
symbol  : class ServerOpts
location: class org.apache.accumulo.server.trace.TraceServer
[ERROR] <https://builds.apache.org/job/Accumulo-Trunk/ws/server/src/main/java/org/apache/accumulo/server/trace/TraceServer.java>:[257,26]
cannot find symbol
symbol  : class ServerOpts
location: class org.apache.accumulo.server.trace.TraceServer
[INFO] 17 errors 
[INFO] -------------------------------------------------------------
Jul 23, 2013 5:22:47 PM org.apache.maven.cli.event.ExecutionEventLogger logReactorSummary
INFO: ------------------------------------------------------------------------
Jul 23, 2013 5:22:47 PM org.apache.maven.cli.event.ExecutionEventLogger logReactorSummary
INFO: Reactor Summary:
Jul 23, 2013 5:22:47 PM org.apache.maven.cli.event.ExecutionEventLogger logReactorSummary
INFO: 
Jul 23, 2013 5:22:47 PM org.apache.maven.cli.event.ExecutionEventLogger logReactorSummary
INFO: Apache Accumulo Project ........................... SUCCESS [5.902s]
Jul 23, 2013 5:22:47 PM org.apache.maven.cli.event.ExecutionEventLogger logReactorSummary
INFO: Trace ............................................. SUCCESS [3.827s]
Jul 23, 2013 5:22:47 PM org.apache.maven.cli.event.ExecutionEventLogger logReactorSummary
INFO: Fate .............................................. SUCCESS [1.492s]
Jul 23, 2013 5:22:47 PM org.apache.maven.cli.event.ExecutionEventLogger logReactorSummary
INFO: Start ............................................. SUCCESS [22.335s]
Jul 23, 2013 5:22:47 PM org.apache.maven.cli.event.ExecutionEventLogger logReactorSummary
INFO: Core .............................................. SUCCESS [1:21.204s]
Jul 23, 2013 5:22:47 PM org.apache.maven.cli.event.ExecutionEventLogger logReactorSummary
INFO: Server ............................................ FAILURE [1.134s]
Jul 23, 2013 5:22:47 PM org.apache.maven.cli.event.ExecutionEventLogger logReactorSummary
INFO: Examples .......................................... SKIPPED
Jul 23, 2013 5:22:47 PM org.apache.maven.cli.event.ExecutionEventLogger logReactorSummary
INFO: Simple Examples ................................... SKIPPED
Jul 23, 2013 5:22:47 PM org.apache.maven.cli.event.ExecutionEventLogger logReactorSummary
INFO: MiniCluster ....................................... SKIPPED
Jul 23, 2013 5:22:47 PM org.apache.maven.cli.event.ExecutionEventLogger logReactorSummary
INFO: Accumulo Maven Plugin ............................. SKIPPED
Jul 23, 2013 5:22:47 PM org.apache.maven.cli.event.ExecutionEventLogger logReactorSummary
INFO: Testing ........................................... SKIPPED
Jul 23, 2013 5:22:47 PM org.apache.maven.cli.event.ExecutionEventLogger logReactorSummary
INFO: Proxy ............................................. SKIPPED
Jul 23, 2013 5:22:47 PM org.apache.maven.cli.event.ExecutionEventLogger logReactorSummary
INFO: Assemblies ........................................ SKIPPED
Jul 23, 2013 5:22:47 PM org.apache.maven.cli.event.ExecutionEventLogger logReactorSummary
INFO: Documentation ..................................... SKIPPED
Jul 23, 2013 5:22:47 PM org.apache.maven.cli.event.ExecutionEventLogger logResult
INFO: ------------------------------------------------------------------------
Jul 23, 2013 5:22:47 PM org.apache.maven.cli.event.ExecutionEventLogger logResult
INFO: BUILD FAILURE
Jul 23, 2013 5:22:47 PM org.apache.maven.cli.event.ExecutionEventLogger logStats
INFO: ------------------------------------------------------------------------
Jul 23, 2013 5:22:47 PM org.apache.maven.cli.event.ExecutionEventLogger logStats
INFO: Total time: 1:57.098s
Jul 23, 2013 5:22:47 PM org.apache.maven.cli.event.ExecutionEventLogger logStats
INFO: Finished at: Tue Jul 23 17:22:47 UTC 2013
Jul 23, 2013 5:22:48 PM org.apache.maven.cli.event.ExecutionEventLogger logStats
INFO: Final Memory: 35M/204M
Jul 23, 2013 5:22:48 PM org.apache.maven.cli.event.ExecutionEventLogger sessionEnded
INFO: ------------------------------------------------------------------------
[JENKINS] Archiving <https://builds.apache.org/job/Accumulo-Trunk/ws/pom.xml> to /home/hudson/hudson/jobs/Accumulo-Trunk/modules/org.apache.accumulo$accumulo-project/builds/2013-07-23_17-20-47/archive/org.apache.accumulo/accumulo-project/1.6.0-SNAPSHOT/accumulo-project-1.6.0-SNAPSHOT.pom
[JENKINS] Archiving <https://builds.apache.org/job/Accumulo-Trunk/ws/target/accumulo-project-1.6.0-SNAPSHOT-site.xml>
to /home/hudson/hudson/jobs/Accumulo-Trunk/modules/org.apache.accumulo$accumulo-project/builds/2013-07-23_17-20-47/archive/org.apache.accumulo/accumulo-project/1.6.0-SNAPSHOT/accumulo-project-1.6.0-SNAPSHOT-site.xml
[JENKINS] Archiving <https://builds.apache.org/job/Accumulo-Trunk/ws/server/pom.xml>
to /home/hudson/hudson/jobs/Accumulo-Trunk/modules/org.apache.accumulo$accumulo-server/builds/2013-07-23_17-20-47/archive/org.apache.accumulo/accumulo-server/1.6.0-SNAPSHOT/accumulo-server-1.6.0-SNAPSHOT.pom
[JENKINS] Archiving <https://builds.apache.org/job/Accumulo-Trunk/ws/minicluster/pom.xml>
to /home/hudson/hudson/jobs/Accumulo-Trunk/modules/org.apache.accumulo$accumulo-minicluster/builds/2013-07-23_17-20-47/archive/org.apache.accumulo/accumulo-minicluster/1.6.0-SNAPSHOT/accumulo-minicluster-1.6.0-SNAPSHOT.pom
[JENKINS] Archiving <https://builds.apache.org/job/Accumulo-Trunk/ws/maven-plugin/pom.xml>
to /home/hudson/hudson/jobs/Accumulo-Trunk/modules/org.apache.accumulo$accumulo-maven-plugin/builds/2013-07-23_17-20-47/archive/org.apache.accumulo/accumulo-maven-plugin/1.6.0-SNAPSHOT/accumulo-maven-plugin-1.6.0-SNAPSHOT.pom
[JENKINS] Archiving <https://builds.apache.org/job/Accumulo-Trunk/ws/examples/simple/pom.xml>
to /home/hudson/hudson/jobs/Accumulo-Trunk/modules/org.apache.accumulo$accumulo-examples-simple/builds/2013-07-23_17-20-47/archive/org.apache.accumulo/accumulo-examples-simple/1.6.0-SNAPSHOT/accumulo-examples-simple-1.6.0-SNAPSHOT.pom
[JENKINS] Archiving <https://builds.apache.org/job/Accumulo-Trunk/ws/proxy/pom.xml>
to /home/hudson/hudson/jobs/Accumulo-Trunk/modules/org.apache.accumulo$accumulo-proxy/builds/2013-07-23_17-20-47/archive/org.apache.accumulo/accumulo-proxy/1.6.0-SNAPSHOT/accumulo-proxy-1.6.0-SNAPSHOT.pom
[JENKINS] Archiving <https://builds.apache.org/job/Accumulo-Trunk/ws/examples/pom.xml>
to /home/hudson/hudson/jobs/Accumulo-Trunk/modules/org.apache.accumulo$accumulo-examples/builds/2013-07-23_17-20-47/archive/org.apache.accumulo/accumulo-examples/1.6.0-SNAPSHOT/accumulo-examples-1.6.0-SNAPSHOT.pom
[JENKINS] Archiving <https://builds.apache.org/job/Accumulo-Trunk/ws/assemble/pom.xml>
to /home/hudson/hudson/jobs/Accumulo-Trunk/modules/org.apache.accumulo$accumulo/builds/2013-07-23_17-20-47/archive/org.apache.accumulo/accumulo/1.6.0-SNAPSHOT/accumulo-1.6.0-SNAPSHOT.pom
[JENKINS] Archiving <https://builds.apache.org/job/Accumulo-Trunk/ws/test/pom.xml> to
/home/hudson/hudson/jobs/Accumulo-Trunk/modules/org.apache.accumulo$accumulo-test/builds/2013-07-23_17-20-47/archive/org.apache.accumulo/accumulo-test/1.6.0-SNAPSHOT/accumulo-test-1.6.0-SNAPSHOT.pom
[JENKINS] Archiving <https://builds.apache.org/job/Accumulo-Trunk/ws/start/pom.xml>
to /home/hudson/hudson/jobs/Accumulo-Trunk/modules/org.apache.accumulo$accumulo-start/builds/2013-07-23_17-20-47/archive/org.apache.accumulo/accumulo-start/1.6.0-SNAPSHOT/accumulo-start-1.6.0-SNAPSHOT.pom
[JENKINS] Archiving <https://builds.apache.org/job/Accumulo-Trunk/ws/start/target/accumulo-start-1.6.0-SNAPSHOT.jar>
to /home/hudson/hudson/jobs/Accumulo-Trunk/modules/org.apache.accumulo$accumulo-start/builds/2013-07-23_17-20-47/archive/org.apache.accumulo/accumulo-start/1.6.0-SNAPSHOT/accumulo-start-1.6.0-SNAPSHOT.jar
[JENKINS] Archiving <https://builds.apache.org/job/Accumulo-Trunk/ws/fate/pom.xml> to
/home/hudson/hudson/jobs/Accumulo-Trunk/modules/org.apache.accumulo$accumulo-fate/builds/2013-07-23_17-20-47/archive/org.apache.accumulo/accumulo-fate/1.6.0-SNAPSHOT/accumulo-fate-1.6.0-SNAPSHOT.pom
[JENKINS] Archiving <https://builds.apache.org/job/Accumulo-Trunk/ws/fate/target/accumulo-fate-1.6.0-SNAPSHOT.jar>
to /home/hudson/hudson/jobs/Accumulo-Trunk/modules/org.apache.accumulo$accumulo-fate/builds/2013-07-23_17-20-47/archive/org.apache.accumulo/accumulo-fate/1.6.0-SNAPSHOT/accumulo-fate-1.6.0-SNAPSHOT.jar
[JENKINS] Archiving <https://builds.apache.org/job/Accumulo-Trunk/ws/core/pom.xml> to
/home/hudson/hudson/jobs/Accumulo-Trunk/modules/org.apache.accumulo$accumulo-core/builds/2013-07-23_17-20-47/archive/org.apache.accumulo/accumulo-core/1.6.0-SNAPSHOT/accumulo-core-1.6.0-SNAPSHOT.pom
[JENKINS] Archiving <https://builds.apache.org/job/Accumulo-Trunk/ws/core/target/accumulo-core-1.6.0-SNAPSHOT.jar>
to /home/hudson/hudson/jobs/Accumulo-Trunk/modules/org.apache.accumulo$accumulo-core/builds/2013-07-23_17-20-47/archive/org.apache.accumulo/accumulo-core/1.6.0-SNAPSHOT/accumulo-core-1.6.0-SNAPSHOT.jar
[JENKINS] Archiving <https://builds.apache.org/job/Accumulo-Trunk/ws/trace/pom.xml>
to /home/hudson/hudson/jobs/Accumulo-Trunk/modules/org.apache.accumulo$accumulo-trace/builds/2013-07-23_17-20-47/archive/org.apache.accumulo/accumulo-trace/1.6.0-SNAPSHOT/accumulo-trace-1.6.0-SNAPSHOT.pom
[JENKINS] Archiving <https://builds.apache.org/job/Accumulo-Trunk/ws/trace/target/accumulo-trace-1.6.0-SNAPSHOT.jar>
to /home/hudson/hudson/jobs/Accumulo-Trunk/modules/org.apache.accumulo$accumulo-trace/builds/2013-07-23_17-20-47/archive/org.apache.accumulo/accumulo-trace/1.6.0-SNAPSHOT/accumulo-trace-1.6.0-SNAPSHOT.jar
[JENKINS] Archiving <https://builds.apache.org/job/Accumulo-Trunk/ws/docs/pom.xml> to
/home/hudson/hudson/jobs/Accumulo-Trunk/modules/org.apache.accumulo$accumulo-docs/builds/2013-07-23_17-20-47/archive/org.apache.accumulo/accumulo-docs/1.6.0-SNAPSHOT/accumulo-docs-1.6.0-SNAPSHOT.pom
Waiting for Jenkins to finish collecting data
mavenExecutionResult exceptions not empty
message : Failed to execute goal org.apache.maven.plugins:maven-compiler-plugin:2.5.1:compile
(default-compile) on project accumulo-server: Compilation failure
cause : Compilation failure
Stack trace : 
org.apache.maven.lifecycle.LifecycleExecutionException: Failed to execute goal org.apache.maven.plugins:maven-compiler-plugin:2.5.1:compile
(default-compile) on project accumulo-server: Compilation failure
	at org.apache.maven.lifecycle.internal.MojoExecutor.execute(MojoExecutor.java:213)
	at org.apache.maven.lifecycle.internal.MojoExecutor.execute(MojoExecutor.java:153)
	at org.apache.maven.lifecycle.internal.MojoExecutor.execute(MojoExecutor.java:145)
	at org.apache.maven.lifecycle.internal.LifecycleModuleBuilder.buildProject(LifecycleModuleBuilder.java:84)
	at org.apache.maven.lifecycle.internal.LifecycleModuleBuilder.buildProject(LifecycleModuleBuilder.java:59)
	at org.apache.maven.lifecycle.internal.LifecycleStarter.singleThreadedBuild(LifecycleStarter.java:183)
	at org.apache.maven.lifecycle.internal.LifecycleStarter.execute(LifecycleStarter.java:161)
	at org.apache.maven.DefaultMaven.doExecute(DefaultMaven.java:320)
	at org.apache.maven.DefaultMaven.execute(DefaultMaven.java:156)
	at org.jvnet.hudson.maven3.launcher.Maven3Launcher.main(Maven3Launcher.java:117)
	at sun.reflect.NativeMethodAccessorImpl.invoke0(Native Method)
	at sun.reflect.NativeMethodAccessorImpl.invoke(NativeMethodAccessorImpl.java:39)
	at sun.reflect.DelegatingMethodAccessorImpl.invoke(DelegatingMethodAccessorImpl.java:25)
	at java.lang.reflect.Method.invoke(Method.java:597)
	at org.codehaus.plexus.classworlds.launcher.Launcher.launchStandard(Launcher.java:329)
	at org.codehaus.plexus.classworlds.launcher.Launcher.launch(Launcher.java:239)
	at org.jvnet.hudson.maven3.agent.Maven3Main.launch(Maven3Main.java:178)
	at sun.reflect.NativeMethodAccessorImpl.invoke0(Native Method)
	at sun.reflect.NativeMethodAccessorImpl.invoke(NativeMethodAccessorImpl.java:39)
	at sun.reflect.DelegatingMethodAccessorImpl.invoke(DelegatingMethodAccessorImpl.java:25)
	at java.lang.reflect.Method.invoke(Method.java:597)
	at hudson.maven.Maven3Builder.call(Maven3Builder.java:129)
	at hudson.maven.Maven3Builder.call(Maven3Builder.java:67)
	at hudson.remoting.UserRequest.perform(UserRequest.java:118)
	at hudson.remoting.UserRequest.perform(UserRequest.java:48)
	at hudson.remoting.Request$2.run(Request.java:326)
	at hudson.remoting.InterceptingExecutorService$1.call(InterceptingExecutorService.java:72)
	at java.util.concurrent.FutureTask$Sync.innerRun(FutureTask.java:303)
	at java.util.concurrent.FutureTask.run(FutureTask.java:138)
	at java.util.concurrent.ThreadPoolExecutor$Worker.runTask(ThreadPoolExecutor.java:895)
	at java.util.concurrent.ThreadPoolExecutor$Worker.run(ThreadPoolExecutor.java:918)
	at java.lang.Thread.run(Thread.java:662)
Caused by: org.apache.maven.plugin.CompilationFailureException: Compilation failure
	at org.apache.maven.plugin.AbstractCompilerMojo.execute(AbstractCompilerMojo.java:729)
	at org.apache.maven.plugin.CompilerMojo.execute(CompilerMojo.java:128)
	at org.apache.maven.plugin.DefaultBuildPluginManager.executeMojo(DefaultBuildPluginManager.java:101)
	at org.apache.maven.lifecycle.internal.MojoExecutor.execute(MojoExecutor.java:209)
	... 31 more
Sending e-mails to: notifications@accumulo.apache.org
channel stopped

Mime
View raw message