accumulo-notifications mailing list archives

Site index · List index
Message view « Date » · « Thread »
Top « Date » · « Thread »
From Apache Jenkins Server <jenk...@builds.apache.org>
Subject Build failed in Jenkins: Accumulo-1.5 #166
Date Wed, 31 Jul 2013 17:24:19 GMT
See <https://builds.apache.org/job/Accumulo-1.5/166/changes>

Changes:

[keith] ACCUMULO-1626 fixed equals method in mutation

------------------------------------------
[...truncated 1218 lines...]
Jul 31, 2013 5:22:32 PM org.apache.maven.cli.event.ExecutionEventLogger mojoStarted
INFO: --- maven-jar-plugin:2.4:jar (default-jar) @ accumulo-test ---
[INFO] Building jar: <https://builds.apache.org/job/Accumulo-1.5/ws/test/target/accumulo-test-1.5.1-SNAPSHOT.jar>
Jul 31, 2013 5:22:33 PM org.apache.maven.cli.event.ExecutionEventLogger mojoStarted
INFO: 
Jul 31, 2013 5:22:33 PM org.apache.maven.cli.event.ExecutionEventLogger mojoStarted
INFO: --- maven-site-plugin:3.2:attach-descriptor (attach-descriptor) @ accumulo-test ---
Jul 31, 2013 5:22:33 PM org.apache.maven.cli.event.ExecutionEventLogger mojoStarted
INFO: 
Jul 31, 2013 5:22:33 PM org.apache.maven.cli.event.ExecutionEventLogger mojoStarted
INFO: --- maven-failsafe-plugin:2.12.4:integration-test (run-integration-tests) @ accumulo-test
---
[JENKINS] Recording test results
Jul 31, 2013 5:22:33 PM org.apache.maven.cli.event.ExecutionEventLogger mojoStarted
INFO: 
Jul 31, 2013 5:22:33 PM org.apache.maven.cli.event.ExecutionEventLogger mojoStarted
INFO: --- maven-failsafe-plugin:2.12.4:verify (verify-integration-tests) @ accumulo-test ---
[INFO] Failsafe report directory: <https://builds.apache.org/job/Accumulo-1.5/ws/test/target/failsafe-reports>
[JENKINS] Recording test resultsJul 31, 2013 5:22:33 PM org.apache.maven.cli.event.ExecutionEventLogger
mojoStarted
INFO: 
Jul 31, 2013 5:22:33 PM org.apache.maven.cli.event.ExecutionEventLogger mojoStarted
INFO: --- apache-rat-plugin:0.9:check (default) @ accumulo-test ---
[INFO] 51 implicit excludes (use -debug for more details).
[INFO] Exclude: system/bench/lib/*splits
[INFO] 377 resources included (use -debug for more details)

[INFO] Rat check: Summary of files. Unapproved: 0 unknown: 0 generated: 0 approved: 362 licence.
Jul 31, 2013 5:22:35 PM org.apache.maven.cli.event.ExecutionEventLogger projectStarted
INFO:                                                                         
Jul 31, 2013 5:22:35 PM org.apache.maven.cli.event.ExecutionEventLogger projectStarted
INFO: ------------------------------------------------------------------------
Jul 31, 2013 5:22:35 PM org.apache.maven.cli.event.ExecutionEventLogger projectStarted
INFO: Building Proxy 1.5.1-SNAPSHOT
Jul 31, 2013 5:22:35 PM org.apache.maven.cli.event.ExecutionEventLogger projectStarted
INFO: ------------------------------------------------------------------------
Jul 31, 2013 5:22:35 PM org.apache.maven.cli.event.ExecutionEventLogger mojoStarted
INFO: 
Jul 31, 2013 5:22:35 PM org.apache.maven.cli.event.ExecutionEventLogger mojoStarted
INFO: --- maven-clean-plugin:2.5:clean (default-clean) @ accumulo-proxy ---
[INFO] Deleting <https://builds.apache.org/job/Accumulo-1.5/ws/proxy> (includes = [**/*.pyc],
excludes = [])
Jul 31, 2013 5:22:35 PM org.apache.maven.cli.event.ExecutionEventLogger mojoStarted
INFO: 
Jul 31, 2013 5:22:35 PM org.apache.maven.cli.event.ExecutionEventLogger mojoStarted
INFO: --- maven-sortpom-plugin:2.1.0:verify (verify-sorted-pom) @ accumulo-proxy ---
[INFO] Verifying file <https://builds.apache.org/job/Accumulo-1.5/ws/proxy/pom.xml>
Jul 31, 2013 5:22:35 PM org.apache.maven.cli.event.ExecutionEventLogger mojoStarted
INFO: 
Jul 31, 2013 5:22:35 PM org.apache.maven.cli.event.ExecutionEventLogger mojoStarted
INFO: --- maven-enforcer-plugin:1.0.1:enforce (enforce-mvn) @ accumulo-proxy ---
Jul 31, 2013 5:22:35 PM org.apache.maven.cli.event.ExecutionEventLogger mojoStarted
INFO: 
Jul 31, 2013 5:22:35 PM org.apache.maven.cli.event.ExecutionEventLogger mojoStarted
INFO: --- maven-remote-resources-plugin:1.4:process (default) @ accumulo-proxy ---
Jul 31, 2013 5:22:36 PM org.apache.maven.cli.event.ExecutionEventLogger mojoStarted
INFO: 
Jul 31, 2013 5:22:36 PM org.apache.maven.cli.event.ExecutionEventLogger mojoStarted
INFO: --- maven-resources-plugin:2.6:resources (default-resources) @ accumulo-proxy ---
[INFO] Using 'UTF-8' encoding to copy filtered resources.
[INFO] skip non existing resourceDirectory <https://builds.apache.org/job/Accumulo-1.5/ws/proxy/src/main/resources>
[INFO] Copying 3 resources
Jul 31, 2013 5:22:36 PM org.apache.maven.cli.event.ExecutionEventLogger mojoStarted
INFO: 
Jul 31, 2013 5:22:36 PM org.apache.maven.cli.event.ExecutionEventLogger mojoStarted
INFO: --- maven-compiler-plugin:2.5.1:compile (default-compile) @ accumulo-proxy ---
[INFO] Compiling 37 source files to <https://builds.apache.org/job/Accumulo-1.5/ws/proxy/target/classes>
Jul 31, 2013 5:22:38 PM org.apache.maven.cli.event.ExecutionEventLogger mojoStarted
INFO: 
Jul 31, 2013 5:22:38 PM org.apache.maven.cli.event.ExecutionEventLogger mojoStarted
INFO: --- maven-resources-plugin:2.6:testResources (default-testResources) @ accumulo-proxy
---
[INFO] Using 'UTF-8' encoding to copy filtered resources.
[INFO] Copying 1 resource
[INFO] Copying 3 resources
Jul 31, 2013 5:22:38 PM org.apache.maven.cli.event.ExecutionEventLogger mojoStarted
INFO: 
Jul 31, 2013 5:22:38 PM org.apache.maven.cli.event.ExecutionEventLogger mojoStarted
INFO: --- maven-compiler-plugin:2.5.1:testCompile (default-testCompile) @ accumulo-proxy ---
[INFO] Compiling 5 source files to <https://builds.apache.org/job/Accumulo-1.5/ws/proxy/target/test-classes>
Jul 31, 2013 5:22:38 PM org.apache.maven.cli.event.ExecutionEventLogger mojoStarted
INFO: 
Jul 31, 2013 5:22:38 PM org.apache.maven.cli.event.ExecutionEventLogger mojoStarted
INFO: --- maven-surefire-plugin:2.12.4:test (default-test) @ accumulo-proxy ---
[INFO] Surefire report directory: <https://builds.apache.org/job/Accumulo-1.5/ws/proxy/target/surefire-reports>

-------------------------------------------------------
 T E S T S
-------------------------------------------------------
Running org.apache.accumulo.proxy.TestProxySecurityOperations
Tests run: 5, Failures: 0, Errors: 0, Skipped: 0, Time elapsed: 0.833 sec
Running org.apache.accumulo.proxy.TestProxyTableOperations
Tests run: 8, Failures: 0, Errors: 0, Skipped: 0, Time elapsed: 0.194 sec
Running org.apache.accumulo.proxy.SimpleTest
Tests run: 9, Failures: 0, Errors: 0, Skipped: 0, Time elapsed: 38.422 sec
Running org.apache.accumulo.proxy.TestProxyReadWrite
Tests run: 8, Failures: 0, Errors: 0, Skipped: 0, Time elapsed: 6.043 sec
Running org.apache.accumulo.proxy.TestProxyInstanceOperations
Tests run: 2, Failures: 0, Errors: 0, Skipped: 0, Time elapsed: 0.069 sec

Results :

Tests run: 32, Failures: 0, Errors: 0, Skipped: 0

Jul 31, 2013 5:23:25 PM org.apache.maven.cli.event.ExecutionEventLogger logReactorSummary
INFO: ------------------------------------------------------------------------
Jul 31, 2013 5:23:25 PM org.apache.maven.cli.event.ExecutionEventLogger logReactorSummary
INFO: Reactor Summary:
Jul 31, 2013 5:23:25 PM org.apache.maven.cli.event.ExecutionEventLogger logReactorSummary
INFO: 
Jul 31, 2013 5:23:25 PM org.apache.maven.cli.event.ExecutionEventLogger logReactorSummary
INFO: Apache Accumulo Project ........................... SUCCESS [33.914s]
Jul 31, 2013 5:23:25 PM org.apache.maven.cli.event.ExecutionEventLogger logReactorSummary
INFO: Trace ............................................. SUCCESS [6.848s]
Jul 31, 2013 5:23:25 PM org.apache.maven.cli.event.ExecutionEventLogger logReactorSummary
INFO: Fate .............................................. SUCCESS [2.736s]
Jul 31, 2013 5:23:25 PM org.apache.maven.cli.event.ExecutionEventLogger logReactorSummary
INFO: Start ............................................. SUCCESS [34.968s]
Jul 31, 2013 5:23:25 PM org.apache.maven.cli.event.ExecutionEventLogger logReactorSummary
INFO: Core .............................................. SUCCESS [1:25.294s]
Jul 31, 2013 5:23:25 PM org.apache.maven.cli.event.ExecutionEventLogger logReactorSummary
INFO: Server ............................................ SUCCESS [10.163s]
Jul 31, 2013 5:23:25 PM org.apache.maven.cli.event.ExecutionEventLogger logReactorSummary
INFO: Examples .......................................... SUCCESS [1.143s]
Jul 31, 2013 5:23:25 PM org.apache.maven.cli.event.ExecutionEventLogger logReactorSummary
INFO: Simple Examples ................................... SUCCESS [15.995s]
Jul 31, 2013 5:23:25 PM org.apache.maven.cli.event.ExecutionEventLogger logReactorSummary
INFO: MiniCluster ....................................... SUCCESS [16.229s]
Jul 31, 2013 5:23:25 PM org.apache.maven.cli.event.ExecutionEventLogger logReactorSummary
INFO: Testing ........................................... SUCCESS [2:26.519s]
Jul 31, 2013 5:23:25 PM org.apache.maven.cli.event.ExecutionEventLogger logReactorSummary
INFO: Proxy ............................................. FAILURE [50.085s]
Jul 31, 2013 5:23:25 PM org.apache.maven.cli.event.ExecutionEventLogger logReactorSummary
INFO: Assemblies ........................................ SKIPPED
Jul 31, 2013 5:23:25 PM org.apache.maven.cli.event.ExecutionEventLogger logResult
INFO: ------------------------------------------------------------------------
Jul 31, 2013 5:23:25 PM org.apache.maven.cli.event.ExecutionEventLogger logResult
INFO: BUILD FAILURE
Jul 31, 2013 5:23:25 PM org.apache.maven.cli.event.ExecutionEventLogger logStats
INFO: ------------------------------------------------------------------------
Jul 31, 2013 5:23:25 PM org.apache.maven.cli.event.ExecutionEventLogger logStats
INFO: Total time: 6:47.919s
Jul 31, 2013 5:23:25 PM org.apache.maven.cli.event.ExecutionEventLogger logStats
INFO: Finished at: Wed Jul 31 17:23:25 UTC 2013
Jul 31, 2013 5:23:25 PM org.apache.maven.cli.event.ExecutionEventLogger logStats
INFO: Final Memory: 32M/146M
Jul 31, 2013 5:23:25 PM org.apache.maven.cli.event.ExecutionEventLogger sessionEnded
INFO: ------------------------------------------------------------------------
[JENKINS] Archiving <https://builds.apache.org/job/Accumulo-1.5/ws/pom.xml> to /home/hudson/hudson/jobs/Accumulo-1.5/modules/org.apache.accumulo$accumulo-project/builds/2013-07-31_17-16-26/archive/org.apache.accumulo/accumulo-project/1.5.1-SNAPSHOT/accumulo-project-1.5.1-SNAPSHOT.pom
[JENKINS] Archiving <https://builds.apache.org/job/Accumulo-1.5/ws/target/accumulo-project-1.5.1-SNAPSHOT-site.xml>
to /home/hudson/hudson/jobs/Accumulo-1.5/modules/org.apache.accumulo$accumulo-project/builds/2013-07-31_17-16-26/archive/org.apache.accumulo/accumulo-project/1.5.1-SNAPSHOT/accumulo-project-1.5.1-SNAPSHOT-site.xml
[JENKINS] Archiving <https://builds.apache.org/job/Accumulo-1.5/ws/server/pom.xml> to
/home/hudson/hudson/jobs/Accumulo-1.5/modules/org.apache.accumulo$accumulo-server/builds/2013-07-31_17-16-26/archive/org.apache.accumulo/accumulo-server/1.5.1-SNAPSHOT/accumulo-server-1.5.1-SNAPSHOT.pom
[JENKINS] Archiving <https://builds.apache.org/job/Accumulo-1.5/ws/server/target/accumulo-server-1.5.1-SNAPSHOT.jar>
to /home/hudson/hudson/jobs/Accumulo-1.5/modules/org.apache.accumulo$accumulo-server/builds/2013-07-31_17-16-26/archive/org.apache.accumulo/accumulo-server/1.5.1-SNAPSHOT/accumulo-server-1.5.1-SNAPSHOT.jar
[JENKINS] Archiving <https://builds.apache.org/job/Accumulo-1.5/ws/minicluster/pom.xml>
to /home/hudson/hudson/jobs/Accumulo-1.5/modules/org.apache.accumulo$accumulo-minicluster/builds/2013-07-31_17-16-26/archive/org.apache.accumulo/accumulo-minicluster/1.5.1-SNAPSHOT/accumulo-minicluster-1.5.1-SNAPSHOT.pom
[JENKINS] Archiving <https://builds.apache.org/job/Accumulo-1.5/ws/minicluster/target/accumulo-minicluster-1.5.1-SNAPSHOT.jar>
to /home/hudson/hudson/jobs/Accumulo-1.5/modules/org.apache.accumulo$accumulo-minicluster/builds/2013-07-31_17-16-26/archive/org.apache.accumulo/accumulo-minicluster/1.5.1-SNAPSHOT/accumulo-minicluster-1.5.1-SNAPSHOT.jar
[JENKINS] Archiving <https://builds.apache.org/job/Accumulo-1.5/ws/examples/simple/pom.xml>
to /home/hudson/hudson/jobs/Accumulo-1.5/modules/org.apache.accumulo$accumulo-examples-simple/builds/2013-07-31_17-16-26/archive/org.apache.accumulo/accumulo-examples-simple/1.5.1-SNAPSHOT/accumulo-examples-simple-1.5.1-SNAPSHOT.pom
[JENKINS] Archiving <https://builds.apache.org/job/Accumulo-1.5/ws/examples/simple/target/accumulo-examples-simple-1.5.1-SNAPSHOT.jar>
to /home/hudson/hudson/jobs/Accumulo-1.5/modules/org.apache.accumulo$accumulo-examples-simple/builds/2013-07-31_17-16-26/archive/org.apache.accumulo/accumulo-examples-simple/1.5.1-SNAPSHOT/accumulo-examples-simple-1.5.1-SNAPSHOT.jar
[JENKINS] Archiving <https://builds.apache.org/job/Accumulo-1.5/ws/proxy/pom.xml> to
/home/hudson/hudson/jobs/Accumulo-1.5/modules/org.apache.accumulo$accumulo-proxy/builds/2013-07-31_17-16-26/archive/org.apache.accumulo/accumulo-proxy/1.5.1-SNAPSHOT/accumulo-proxy-1.5.1-SNAPSHOT.pom
[JENKINS] Archiving <https://builds.apache.org/job/Accumulo-1.5/ws/examples/pom.xml>
to /home/hudson/hudson/jobs/Accumulo-1.5/modules/org.apache.accumulo$accumulo-examples/builds/2013-07-31_17-16-26/archive/org.apache.accumulo/accumulo-examples/1.5.1-SNAPSHOT/accumulo-examples-1.5.1-SNAPSHOT.pom
[JENKINS] Archiving <https://builds.apache.org/job/Accumulo-1.5/ws/assemble/pom.xml>
to /home/hudson/hudson/jobs/Accumulo-1.5/modules/org.apache.accumulo$accumulo/builds/2013-07-31_17-16-26/archive/org.apache.accumulo/accumulo/1.5.1-SNAPSHOT/accumulo-1.5.1-SNAPSHOT.pom
[JENKINS] Archiving <https://builds.apache.org/job/Accumulo-1.5/ws/test/pom.xml> to
/home/hudson/hudson/jobs/Accumulo-1.5/modules/org.apache.accumulo$accumulo-test/builds/2013-07-31_17-16-26/archive/org.apache.accumulo/accumulo-test/1.5.1-SNAPSHOT/accumulo-test-1.5.1-SNAPSHOT.pom
[JENKINS] Archiving <https://builds.apache.org/job/Accumulo-1.5/ws/test/target/accumulo-test-1.5.1-SNAPSHOT.jar>
to /home/hudson/hudson/jobs/Accumulo-1.5/modules/org.apache.accumulo$accumulo-test/builds/2013-07-31_17-16-26/archive/org.apache.accumulo/accumulo-test/1.5.1-SNAPSHOT/accumulo-test-1.5.1-SNAPSHOT.jar
[JENKINS] Archiving <https://builds.apache.org/job/Accumulo-1.5/ws/start/pom.xml> to
/home/hudson/hudson/jobs/Accumulo-1.5/modules/org.apache.accumulo$accumulo-start/builds/2013-07-31_17-16-26/archive/org.apache.accumulo/accumulo-start/1.5.1-SNAPSHOT/accumulo-start-1.5.1-SNAPSHOT.pom
[JENKINS] Archiving <https://builds.apache.org/job/Accumulo-1.5/ws/start/target/accumulo-start-1.5.1-SNAPSHOT.jar>
to /home/hudson/hudson/jobs/Accumulo-1.5/modules/org.apache.accumulo$accumulo-start/builds/2013-07-31_17-16-26/archive/org.apache.accumulo/accumulo-start/1.5.1-SNAPSHOT/accumulo-start-1.5.1-SNAPSHOT.jar
[JENKINS] Archiving <https://builds.apache.org/job/Accumulo-1.5/ws/fate/pom.xml> to
/home/hudson/hudson/jobs/Accumulo-1.5/modules/org.apache.accumulo$accumulo-fate/builds/2013-07-31_17-16-26/archive/org.apache.accumulo/accumulo-fate/1.5.1-SNAPSHOT/accumulo-fate-1.5.1-SNAPSHOT.pom
[JENKINS] Archiving <https://builds.apache.org/job/Accumulo-1.5/ws/fate/target/accumulo-fate-1.5.1-SNAPSHOT.jar>
to /home/hudson/hudson/jobs/Accumulo-1.5/modules/org.apache.accumulo$accumulo-fate/builds/2013-07-31_17-16-26/archive/org.apache.accumulo/accumulo-fate/1.5.1-SNAPSHOT/accumulo-fate-1.5.1-SNAPSHOT.jar
[JENKINS] Archiving <https://builds.apache.org/job/Accumulo-1.5/ws/core/pom.xml> to
/home/hudson/hudson/jobs/Accumulo-1.5/modules/org.apache.accumulo$accumulo-core/builds/2013-07-31_17-16-26/archive/org.apache.accumulo/accumulo-core/1.5.1-SNAPSHOT/accumulo-core-1.5.1-SNAPSHOT.pom
[JENKINS] Archiving <https://builds.apache.org/job/Accumulo-1.5/ws/core/target/accumulo-core-1.5.1-SNAPSHOT.jar>
to /home/hudson/hudson/jobs/Accumulo-1.5/modules/org.apache.accumulo$accumulo-core/builds/2013-07-31_17-16-26/archive/org.apache.accumulo/accumulo-core/1.5.1-SNAPSHOT/accumulo-core-1.5.1-SNAPSHOT.jar
[JENKINS] Archiving <https://builds.apache.org/job/Accumulo-1.5/ws/trace/pom.xml> to
/home/hudson/hudson/jobs/Accumulo-1.5/modules/org.apache.accumulo$accumulo-trace/builds/2013-07-31_17-16-26/archive/org.apache.accumulo/accumulo-trace/1.5.1-SNAPSHOT/accumulo-trace-1.5.1-SNAPSHOT.pom
[JENKINS] Archiving <https://builds.apache.org/job/Accumulo-1.5/ws/trace/target/accumulo-trace-1.5.1-SNAPSHOT.jar>
to /home/hudson/hudson/jobs/Accumulo-1.5/modules/org.apache.accumulo$accumulo-trace/builds/2013-07-31_17-16-26/archive/org.apache.accumulo/accumulo-trace/1.5.1-SNAPSHOT/accumulo-trace-1.5.1-SNAPSHOT.jar
Waiting for Jenkins to finish collecting data
mavenExecutionResult exceptions not empty
message : Internal error: hudson.remoting.RemotingSystemException: java.io.StreamCorruptedException:
invalid type code: 00
cause : java.io.StreamCorruptedException: invalid type code: 00
Stack trace : 
org.apache.maven.InternalErrorException: Internal error: hudson.remoting.RemotingSystemException:
java.io.StreamCorruptedException: invalid type code: 00
	at org.apache.maven.lifecycle.internal.BuilderCommon.handleBuildError(BuilderCommon.java:128)
	at org.apache.maven.lifecycle.internal.LifecycleModuleBuilder.buildProject(LifecycleModuleBuilder.java:95)
	at org.apache.maven.lifecycle.internal.LifecycleModuleBuilder.buildProject(LifecycleModuleBuilder.java:59)
	at org.apache.maven.lifecycle.internal.LifecycleStarter.singleThreadedBuild(LifecycleStarter.java:183)
	at org.apache.maven.lifecycle.internal.LifecycleStarter.execute(LifecycleStarter.java:161)
	at org.apache.maven.DefaultMaven.doExecute(DefaultMaven.java:320)
	at org.apache.maven.DefaultMaven.execute(DefaultMaven.java:156)
	at org.jvnet.hudson.maven3.launcher.Maven3Launcher.main(Maven3Launcher.java:117)
	at sun.reflect.NativeMethodAccessorImpl.invoke0(Native Method)
	at sun.reflect.NativeMethodAccessorImpl.invoke(NativeMethodAccessorImpl.java:39)
	at sun.reflect.DelegatingMethodAccessorImpl.invoke(DelegatingMethodAccessorImpl.java:25)
	at java.lang.reflect.Method.invoke(Method.java:597)
	at org.codehaus.plexus.classworlds.launcher.Launcher.launchStandard(Launcher.java:329)
	at org.codehaus.plexus.classworlds.launcher.Launcher.launch(Launcher.java:239)
	at org.jvnet.hudson.maven3.agent.Maven3Main.launch(Maven3Main.java:178)
	at sun.reflect.NativeMethodAccessorImpl.invoke0(Native Method)
	at sun.reflect.NativeMethodAccessorImpl.invoke(NativeMethodAccessorImpl.java:39)
	at sun.reflect.DelegatingMethodAccessorImpl.invoke(DelegatingMethodAccessorImpl.java:25)
	at java.lang.reflect.Method.invoke(Method.java:597)
	at hudson.maven.Maven3Builder.call(Maven3Builder.java:129)
	at hudson.maven.Maven3Builder.call(Maven3Builder.java:67)
	at hudson.remoting.UserRequest.perform(UserRequest.java:118)
	at hudson.remoting.UserRequest.perform(UserRequest.java:48)
	at hudson.remoting.Request$2.run(Request.java:326)
	at hudson.remoting.InterceptingExecutorService$1.call(InterceptingExecutorService.java:72)
	at java.util.concurrent.FutureTask$Sync.innerRun(FutureTask.java:303)
	at java.util.concurrent.FutureTask.run(FutureTask.java:138)
	at java.util.concurrent.ThreadPoolExecutor$Worker.runTask(ThreadPoolExecutor.java:895)
	at java.util.concurrent.ThreadPoolExecutor$Worker.run(ThreadPoolExecutor.java:918)
	at java.lang.Thread.run(Thread.java:662)
Caused by: hudson.remoting.RemotingSystemException: java.io.StreamCorruptedException: invalid
type code: 00
	at hudson.remoting.RemoteInvocationHandler.invoke(RemoteInvocationHandler.java:183)
	at com.sun.proxy.$Proxy7.setExecutedMojos(Unknown Source)
	at hudson.maven.MavenBuildProxy$Filter.setExecutedMojos(MavenBuildProxy.java:243)
	at hudson.maven.Maven3Builder$MavenExecutionListener.recordMojoEnded(Maven3Builder.java:574)
	at hudson.maven.Maven3Builder$MavenExecutionListener.mojoSucceeded(Maven3Builder.java:560)
	at org.apache.maven.lifecycle.internal.DefaultExecutionEventCatapult.fire(DefaultExecutionEventCatapult.java:87)
	at org.apache.maven.lifecycle.internal.DefaultExecutionEventCatapult.fire(DefaultExecutionEventCatapult.java:42)
	at org.apache.maven.lifecycle.internal.MojoExecutor.execute(MojoExecutor.java:228)
	at org.apache.maven.lifecycle.internal.MojoExecutor.execute(MojoExecutor.java:153)
	at org.apache.maven.lifecycle.internal.MojoExecutor.execute(MojoExecutor.java:145)
	at org.apache.maven.lifecycle.internal.LifecycleModuleBuilder.buildProject(LifecycleModuleBuilder.java:84)
	... 28 more
Caused by: java.io.StreamCorruptedException: invalid type code: 00
	at java.io.ObjectInputStream.readObject0(ObjectInputStream.java:1375)
	at java.io.ObjectInputStream.defaultReadFields(ObjectInputStream.java:1989)
	at java.io.ObjectInputStream.readSerialData(ObjectInputStream.java:1913)
	at java.io.ObjectInputStream.readOrdinaryObject(ObjectInputStream.java:1796)
	at java.io.ObjectInputStream.readObject0(ObjectInputStream.java:1348)
	at java.io.ObjectInputStream.readArray(ObjectInputStream.java:1704)
	at java.io.ObjectInputStream.readObject0(ObjectInputStream.java:1342)
	at java.io.ObjectInputStream.defaultReadFields(ObjectInputStream.java:1989)
	at java.io.ObjectInputStream.defaultReadObject(ObjectInputStream.java:499)
	at java.lang.Throwable.readObject(Throwable.java:913)
	at sun.reflect.GeneratedMethodAccessor129.invoke(Unknown Source)
	at sun.reflect.DelegatingMethodAccessorImpl.invoke(DelegatingMethodAccessorImpl.java:43)
	at java.lang.reflect.Method.invoke(Method.java:606)
	at java.io.ObjectStreamClass.invokeReadObject(ObjectStreamClass.java:1017)
	at java.io.ObjectInputStream.readSerialData(ObjectInputStream.java:1891)
	at java.io.ObjectInputStream.readOrdinaryObject(ObjectInputStream.java:1796)
	at java.io.ObjectInputStream.readObject0(ObjectInputStream.java:1348)
	at java.io.ObjectInputStream.defaultReadFields(ObjectInputStream.java:1989)
	at java.io.ObjectInputStream.readSerialData(ObjectInputStream.java:1913)
	at java.io.ObjectInputStream.readOrdinaryObject(ObjectInputStream.java:1796)
	at java.io.ObjectInputStream.readObject0(ObjectInputStream.java:1348)
	at java.io.ObjectInputStream.readObject(ObjectInputStream.java:370)
	at hudson.remoting.UserRequest.deserialize(UserRequest.java:182)
	at hudson.remoting.UserRequest.perform(UserRequest.java:98)
	at hudson.remoting.UserRequest.perform(UserRequest.java:48)
	at hudson.remoting.Request$2.run(Request.java:326)
	at hudson.remoting.InterceptingExecutorService$1.call(InterceptingExecutorService.java:72)
	at java.util.concurrent.FutureTask$Sync.innerRun(FutureTask.java:334)
	at java.util.concurrent.FutureTask.run(FutureTask.java:166)
	at java.util.concurrent.ThreadPoolExecutor.runWorker(ThreadPoolExecutor.java:1145)
	at java.util.concurrent.ThreadPoolExecutor$Worker.run(ThreadPoolExecutor.java:615)
	at java.lang.Thread.run(Thread.java:724)
Sending e-mails to: notifications@accumulo.apache.org
channel stopped

Mime
View raw message