accumulo-notifications mailing list archives

Site index · List index
Message view « Date » · « Thread »
Top « Date » · « Thread »
From Apache Jenkins Server <jenk...@builds.apache.org>
Subject Build failed in Jenkins: Accumulo-1.5 #153
Date Tue, 23 Jul 2013 17:26:10 GMT
See <https://builds.apache.org/job/Accumulo-1.5/153/>

------------------------------------------
Started by user vines
Building remotely on ubuntu3 in workspace <https://builds.apache.org/job/Accumulo-1.5/ws/>
Checkout:Accumulo-1.5 / <https://builds.apache.org/job/Accumulo-1.5/ws/> - hudson.remoting.Channel@67e045c1:ubuntu3
Using strategy: Default
Cloning the remote Git repository
Cloning repository https://git-wip-us.apache.org/repos/asf/accumulo.git
git --version
git version 1.7.9.5
Fetching upstream changes from origin
Commencing build of Revision 35c7591a3c86f3518833efca1921dcded227e961 (remotes/origin/1.5.1-SNAPSHOT)
Checking out Revision 35c7591a3c86f3518833efca1921dcded227e961 (remotes/origin/1.5.1-SNAPSHOT)
No change to record in branch remotes/origin/1.5.1-SNAPSHOT
Parsing POMs
Modules changed, recalculating dependency graph
[Accumulo-1.5] $ /home/hudson/tools/java/latest1.6/bin/java -cp /home/jenkins/jenkins-slave/maven3-agent.jar:/home/hudson/tools/maven/apache-maven-3.0.4/boot/plexus-classworlds-2.4.jar
org.jvnet.hudson.maven3.agent.Maven3Main /home/hudson/tools/maven/apache-maven-3.0.4 /x1/jenkins/jenkins-slave/slave.jar
/home/jenkins/jenkins-slave/maven3-interceptor.jar /home/jenkins/jenkins-slave/maven3-interceptor-commons.jar
32805
<===[JENKINS REMOTING CAPACITY]===>   channel started
log4j:WARN No appenders could be found for logger (org.apache.commons.beanutils.converters.BooleanConverter).
log4j:WARN Please initialize the log4j system properly.
Executing Maven:  -B -f <https://builds.apache.org/job/Accumulo-1.5/ws/pom.xml> -Dmaven.repo.local=/home/jenkins/jenkins-slave/maven-repositories/1
clean verify -P check-licenses
Jul 23, 2013 5:25:27 PM org.apache.maven.cli.event.ExecutionEventLogger projectDiscoveryStarted
INFO: Scanning for projects...
Jul 23, 2013 5:25:28 PM org.apache.maven.cli.event.ExecutionEventLogger sessionStarted
INFO: ------------------------------------------------------------------------
Jul 23, 2013 5:25:28 PM org.apache.maven.cli.event.ExecutionEventLogger sessionStarted
INFO: Reactor Build Order:
Jul 23, 2013 5:25:28 PM org.apache.maven.cli.event.ExecutionEventLogger sessionStarted
INFO: 
Jul 23, 2013 5:25:28 PM org.apache.maven.cli.event.ExecutionEventLogger sessionStarted
INFO: Apache Accumulo Project
Jul 23, 2013 5:25:28 PM org.apache.maven.cli.event.ExecutionEventLogger sessionStarted
INFO: Trace
Jul 23, 2013 5:25:28 PM org.apache.maven.cli.event.ExecutionEventLogger sessionStarted
INFO: Fate
Jul 23, 2013 5:25:28 PM org.apache.maven.cli.event.ExecutionEventLogger sessionStarted
INFO: Start
Jul 23, 2013 5:25:28 PM org.apache.maven.cli.event.ExecutionEventLogger sessionStarted
INFO: Core
Jul 23, 2013 5:25:28 PM org.apache.maven.cli.event.ExecutionEventLogger sessionStarted
INFO: Server
Jul 23, 2013 5:25:28 PM org.apache.maven.cli.event.ExecutionEventLogger sessionStarted
INFO: Examples
Jul 23, 2013 5:25:28 PM org.apache.maven.cli.event.ExecutionEventLogger sessionStarted
INFO: Simple Examples
Jul 23, 2013 5:25:28 PM org.apache.maven.cli.event.ExecutionEventLogger sessionStarted
INFO: MiniCluster
Jul 23, 2013 5:25:28 PM org.apache.maven.cli.event.ExecutionEventLogger sessionStarted
INFO: Testing
Jul 23, 2013 5:25:28 PM org.apache.maven.cli.event.ExecutionEventLogger sessionStarted
INFO: Proxy
Jul 23, 2013 5:25:28 PM org.apache.maven.cli.event.ExecutionEventLogger sessionStarted
INFO: Assemblies
Jul 23, 2013 5:25:28 PM org.apache.maven.cli.event.ExecutionEventLogger projectStarted
INFO:                                                                         
Jul 23, 2013 5:25:28 PM org.apache.maven.cli.event.ExecutionEventLogger projectStarted
INFO: ------------------------------------------------------------------------
Jul 23, 2013 5:25:28 PM org.apache.maven.cli.event.ExecutionEventLogger projectStarted
INFO: Building Apache Accumulo Project 1.5.1-SNAPSHOT
Jul 23, 2013 5:25:28 PM org.apache.maven.cli.event.ExecutionEventLogger projectStarted
INFO: ------------------------------------------------------------------------
Jul 23, 2013 5:25:28 PM org.apache.maven.cli.event.ExecutionEventLogger mojoStarted
INFO: 
Jul 23, 2013 5:25:28 PM org.apache.maven.cli.event.ExecutionEventLogger mojoStarted
INFO: --- maven-clean-plugin:2.5:clean (default-clean) @ accumulo-project ---
[INFO] Deleting <https://builds.apache.org/job/Accumulo-1.5/ws/test> (includes = [**/*.so],
excludes = [])
[INFO] Deleting <https://builds.apache.org/job/Accumulo-1.5/ws/> (includes = [**/*.pyc],
excludes = [])
Jul 23, 2013 5:25:30 PM org.apache.maven.cli.event.ExecutionEventLogger mojoStarted
INFO: 
Jul 23, 2013 5:25:30 PM org.apache.maven.cli.event.ExecutionEventLogger mojoStarted
INFO: --- maven-sortpom-plugin:2.1.0:verify (verify-sorted-pom) @ accumulo-project ---
[INFO] Verifying file <https://builds.apache.org/job/Accumulo-1.5/ws/pom.xml>
Jul 23, 2013 5:25:30 PM org.apache.maven.cli.event.ExecutionEventLogger mojoStarted
INFO: 
Jul 23, 2013 5:25:30 PM org.apache.maven.cli.event.ExecutionEventLogger mojoStarted
INFO: --- maven-enforcer-plugin:1.0.1:enforce (enforce-mvn) @ accumulo-project ---
Jul 23, 2013 5:25:30 PM org.apache.maven.cli.event.ExecutionEventLogger mojoStarted
INFO: 
Jul 23, 2013 5:25:30 PM org.apache.maven.cli.event.ExecutionEventLogger mojoStarted
INFO: --- maven-remote-resources-plugin:1.4:process (default) @ accumulo-project ---
Jul 23, 2013 5:25:31 PM org.apache.maven.cli.event.ExecutionEventLogger mojoStarted
INFO: 
Jul 23, 2013 5:25:31 PM org.apache.maven.cli.event.ExecutionEventLogger mojoStarted
INFO: --- maven-dependency-plugin:2.7:copy-dependencies (copy-dependencies) @ accumulo-project
---
Jul 23, 2013 5:25:31 PM org.apache.maven.cli.event.ExecutionEventLogger mojoStarted
INFO: 
Jul 23, 2013 5:25:31 PM org.apache.maven.cli.event.ExecutionEventLogger mojoStarted
INFO: --- maven-site-plugin:3.2:attach-descriptor (attach-descriptor) @ accumulo-project ---
Jul 23, 2013 5:25:32 PM org.apache.maven.cli.event.ExecutionEventLogger mojoStarted
INFO: 
Jul 23, 2013 5:25:32 PM org.apache.maven.cli.event.ExecutionEventLogger mojoStarted
INFO: --- maven-failsafe-plugin:2.12.4:integration-test (run-integration-tests) @ accumulo-project
---
[INFO] No tests to run.
[JENKINS] Recording test results
Jul 23, 2013 5:25:32 PM org.apache.maven.cli.event.ExecutionEventLogger mojoStarted
INFO: 
Jul 23, 2013 5:25:32 PM org.apache.maven.cli.event.ExecutionEventLogger mojoStarted
INFO: --- maven-failsafe-plugin:2.12.4:verify (verify-integration-tests) @ accumulo-project
---
[INFO] No tests to run.
[JENKINS] Recording test resultsJul 23, 2013 5:25:32 PM org.apache.maven.cli.event.ExecutionEventLogger
mojoStarted
INFO: 
Jul 23, 2013 5:25:32 PM org.apache.maven.cli.event.ExecutionEventLogger mojoStarted
INFO: --- apache-rat-plugin:0.8:check (default) @ accumulo-project ---

[INFO] Exclude: docs/apidocs/package-list
Jul 23, 2013 5:25:33 PM org.apache.maven.cli.event.ExecutionEventLogger logReactorSummary
INFO: ------------------------------------------------------------------------
Jul 23, 2013 5:25:33 PM org.apache.maven.cli.event.ExecutionEventLogger logReactorSummary
INFO: Reactor Summary:
Jul 23, 2013 5:25:33 PM org.apache.maven.cli.event.ExecutionEventLogger logReactorSummary
INFO: 
Jul 23, 2013 5:25:33 PM org.apache.maven.cli.event.ExecutionEventLogger logReactorSummary
INFO: Apache Accumulo Project ........................... FAILURE [5.278s]
Jul 23, 2013 5:25:33 PM org.apache.maven.cli.event.ExecutionEventLogger logReactorSummary
INFO: Trace ............................................. SKIPPED
Jul 23, 2013 5:25:33 PM org.apache.maven.cli.event.ExecutionEventLogger logReactorSummary
INFO: Fate .............................................. SKIPPED
Jul 23, 2013 5:25:33 PM org.apache.maven.cli.event.ExecutionEventLogger logReactorSummary
INFO: Start ............................................. SKIPPED
Jul 23, 2013 5:25:33 PM org.apache.maven.cli.event.ExecutionEventLogger logReactorSummary
INFO: Core .............................................. SKIPPED
Jul 23, 2013 5:25:33 PM org.apache.maven.cli.event.ExecutionEventLogger logReactorSummary
INFO: Server ............................................ SKIPPED
Jul 23, 2013 5:25:33 PM org.apache.maven.cli.event.ExecutionEventLogger logReactorSummary
INFO: Examples .......................................... SKIPPED
Jul 23, 2013 5:25:33 PM org.apache.maven.cli.event.ExecutionEventLogger logReactorSummary
INFO: Simple Examples ................................... SKIPPED
Jul 23, 2013 5:25:33 PM org.apache.maven.cli.event.ExecutionEventLogger logReactorSummary
INFO: MiniCluster ....................................... SKIPPED
Jul 23, 2013 5:25:33 PM org.apache.maven.cli.event.ExecutionEventLogger logReactorSummary
INFO: Testing ........................................... SKIPPED
Jul 23, 2013 5:25:33 PM org.apache.maven.cli.event.ExecutionEventLogger logReactorSummary
INFO: Proxy ............................................. SKIPPED
Jul 23, 2013 5:25:33 PM org.apache.maven.cli.event.ExecutionEventLogger logReactorSummary
INFO: Assemblies ........................................ SKIPPED
Jul 23, 2013 5:25:33 PM org.apache.maven.cli.event.ExecutionEventLogger logResult
INFO: ------------------------------------------------------------------------
Jul 23, 2013 5:25:33 PM org.apache.maven.cli.event.ExecutionEventLogger logResult
INFO: BUILD FAILURE
Jul 23, 2013 5:25:33 PM org.apache.maven.cli.event.ExecutionEventLogger logStats
INFO: ------------------------------------------------------------------------
Jul 23, 2013 5:25:33 PM org.apache.maven.cli.event.ExecutionEventLogger logStats
INFO: Total time: 6.321s
Jul 23, 2013 5:25:33 PM org.apache.maven.cli.event.ExecutionEventLogger logStats
INFO: Finished at: Tue Jul 23 17:25:33 UTC 2013
Jul 23, 2013 5:25:33 PM org.apache.maven.cli.event.ExecutionEventLogger logStats
INFO: Final Memory: 20M/209M
Jul 23, 2013 5:25:33 PM org.apache.maven.cli.event.ExecutionEventLogger sessionEnded
INFO: ------------------------------------------------------------------------
[JENKINS] Archiving <https://builds.apache.org/job/Accumulo-1.5/ws/pom.xml> to /home/hudson/hudson/jobs/Accumulo-1.5/modules/org.apache.accumulo$accumulo-project/builds/2013-07-23_17-25-23/archive/org.apache.accumulo/accumulo-project/1.5.1-SNAPSHOT/accumulo-project-1.5.1-SNAPSHOT.pom
[JENKINS] Archiving <https://builds.apache.org/job/Accumulo-1.5/ws/target/accumulo-project-1.5.1-SNAPSHOT-site.xml>
to /home/hudson/hudson/jobs/Accumulo-1.5/modules/org.apache.accumulo$accumulo-project/builds/2013-07-23_17-25-23/archive/org.apache.accumulo/accumulo-project/1.5.1-SNAPSHOT/accumulo-project-1.5.1-SNAPSHOT-site.xml
[JENKINS] Archiving <https://builds.apache.org/job/Accumulo-1.5/ws/server/pom.xml> to
/home/hudson/hudson/jobs/Accumulo-1.5/modules/org.apache.accumulo$accumulo-server/builds/2013-07-23_17-25-23/archive/org.apache.accumulo/accumulo-server/1.5.1-SNAPSHOT/accumulo-server-1.5.1-SNAPSHOT.pom
[JENKINS] Archiving <https://builds.apache.org/job/Accumulo-1.5/ws/minicluster/pom.xml>
to /home/hudson/hudson/jobs/Accumulo-1.5/modules/org.apache.accumulo$accumulo-minicluster/builds/2013-07-23_17-25-23/archive/org.apache.accumulo/accumulo-minicluster/1.5.1-SNAPSHOT/accumulo-minicluster-1.5.1-SNAPSHOT.pom
[JENKINS] Archiving <https://builds.apache.org/job/Accumulo-1.5/ws/examples/simple/pom.xml>
to /home/hudson/hudson/jobs/Accumulo-1.5/modules/org.apache.accumulo$accumulo-examples-simple/builds/2013-07-23_17-25-23/archive/org.apache.accumulo/accumulo-examples-simple/1.5.1-SNAPSHOT/accumulo-examples-simple-1.5.1-SNAPSHOT.pom
[JENKINS] Archiving <https://builds.apache.org/job/Accumulo-1.5/ws/proxy/pom.xml> to
/home/hudson/hudson/jobs/Accumulo-1.5/modules/org.apache.accumulo$accumulo-proxy/builds/2013-07-23_17-25-23/archive/org.apache.accumulo/accumulo-proxy/1.5.1-SNAPSHOT/accumulo-proxy-1.5.1-SNAPSHOT.pom
[JENKINS] Archiving <https://builds.apache.org/job/Accumulo-1.5/ws/examples/pom.xml>
to /home/hudson/hudson/jobs/Accumulo-1.5/modules/org.apache.accumulo$accumulo-examples/builds/2013-07-23_17-25-23/archive/org.apache.accumulo/accumulo-examples/1.5.1-SNAPSHOT/accumulo-examples-1.5.1-SNAPSHOT.pom
[JENKINS] Archiving <https://builds.apache.org/job/Accumulo-1.5/ws/assemble/pom.xml>
to /home/hudson/hudson/jobs/Accumulo-1.5/modules/org.apache.accumulo$accumulo/builds/2013-07-23_17-25-23/archive/org.apache.accumulo/accumulo/1.5.1-SNAPSHOT/accumulo-1.5.1-SNAPSHOT.pom
[JENKINS] Archiving <https://builds.apache.org/job/Accumulo-1.5/ws/test/pom.xml> to
/home/hudson/hudson/jobs/Accumulo-1.5/modules/org.apache.accumulo$accumulo-test/builds/2013-07-23_17-25-23/archive/org.apache.accumulo/accumulo-test/1.5.1-SNAPSHOT/accumulo-test-1.5.1-SNAPSHOT.pom
[JENKINS] Archiving <https://builds.apache.org/job/Accumulo-1.5/ws/start/pom.xml> to
/home/hudson/hudson/jobs/Accumulo-1.5/modules/org.apache.accumulo$accumulo-start/builds/2013-07-23_17-25-23/archive/org.apache.accumulo/accumulo-start/1.5.1-SNAPSHOT/accumulo-start-1.5.1-SNAPSHOT.pom
[JENKINS] Archiving <https://builds.apache.org/job/Accumulo-1.5/ws/fate/pom.xml> to
/home/hudson/hudson/jobs/Accumulo-1.5/modules/org.apache.accumulo$accumulo-fate/builds/2013-07-23_17-25-23/archive/org.apache.accumulo/accumulo-fate/1.5.1-SNAPSHOT/accumulo-fate-1.5.1-SNAPSHOT.pom
[JENKINS] Archiving <https://builds.apache.org/job/Accumulo-1.5/ws/core/pom.xml> to
/home/hudson/hudson/jobs/Accumulo-1.5/modules/org.apache.accumulo$accumulo-core/builds/2013-07-23_17-25-23/archive/org.apache.accumulo/accumulo-core/1.5.1-SNAPSHOT/accumulo-core-1.5.1-SNAPSHOT.pom
[JENKINS] Archiving <https://builds.apache.org/job/Accumulo-1.5/ws/trace/pom.xml> to
/home/hudson/hudson/jobs/Accumulo-1.5/modules/org.apache.accumulo$accumulo-trace/builds/2013-07-23_17-25-23/archive/org.apache.accumulo/accumulo-trace/1.5.1-SNAPSHOT/accumulo-trace-1.5.1-SNAPSHOT.pom
Waiting for Jenkins to finish collecting data
mavenExecutionResult exceptions not empty
message : Failed to execute goal org.apache.rat:apache-rat-plugin:0.8:check (default) on project
accumulo-project: Too many unapproved licenses: 19
cause : Too many unapproved licenses: 19
Stack trace : 
org.apache.maven.lifecycle.LifecycleExecutionException: Failed to execute goal org.apache.rat:apache-rat-plugin:0.8:check
(default) on project accumulo-project: Too many unapproved licenses: 19
	at org.apache.maven.lifecycle.internal.MojoExecutor.execute(MojoExecutor.java:213)
	at org.apache.maven.lifecycle.internal.MojoExecutor.execute(MojoExecutor.java:153)
	at org.apache.maven.lifecycle.internal.MojoExecutor.execute(MojoExecutor.java:145)
	at org.apache.maven.lifecycle.internal.LifecycleModuleBuilder.buildProject(LifecycleModuleBuilder.java:84)
	at org.apache.maven.lifecycle.internal.LifecycleModuleBuilder.buildProject(LifecycleModuleBuilder.java:59)
	at org.apache.maven.lifecycle.internal.LifecycleStarter.singleThreadedBuild(LifecycleStarter.java:183)
	at org.apache.maven.lifecycle.internal.LifecycleStarter.execute(LifecycleStarter.java:161)
	at org.apache.maven.DefaultMaven.doExecute(DefaultMaven.java:320)
	at org.apache.maven.DefaultMaven.execute(DefaultMaven.java:156)
	at org.jvnet.hudson.maven3.launcher.Maven3Launcher.main(Maven3Launcher.java:117)
	at sun.reflect.NativeMethodAccessorImpl.invoke0(Native Method)
	at sun.reflect.NativeMethodAccessorImpl.invoke(NativeMethodAccessorImpl.java:39)
	at sun.reflect.DelegatingMethodAccessorImpl.invoke(DelegatingMethodAccessorImpl.java:25)
	at java.lang.reflect.Method.invoke(Method.java:597)
	at org.codehaus.plexus.classworlds.launcher.Launcher.launchStandard(Launcher.java:329)
	at org.codehaus.plexus.classworlds.launcher.Launcher.launch(Launcher.java:239)
	at org.jvnet.hudson.maven3.agent.Maven3Main.launch(Maven3Main.java:178)
	at sun.reflect.NativeMethodAccessorImpl.invoke0(Native Method)
	at sun.reflect.NativeMethodAccessorImpl.invoke(NativeMethodAccessorImpl.java:39)
	at sun.reflect.DelegatingMethodAccessorImpl.invoke(DelegatingMethodAccessorImpl.java:25)
	at java.lang.reflect.Method.invoke(Method.java:597)
	at hudson.maven.Maven3Builder.call(Maven3Builder.java:129)
	at hudson.maven.Maven3Builder.call(Maven3Builder.java:67)
	at hudson.remoting.UserRequest.perform(UserRequest.java:118)
	at hudson.remoting.UserRequest.perform(UserRequest.java:48)
	at hudson.remoting.Request$2.run(Request.java:326)
	at hudson.remoting.InterceptingExecutorService$1.call(InterceptingExecutorService.java:72)
	at java.util.concurrent.FutureTask$Sync.innerRun(FutureTask.java:303)
	at java.util.concurrent.FutureTask.run(FutureTask.java:138)
	at java.util.concurrent.ThreadPoolExecutor$Worker.runTask(ThreadPoolExecutor.java:895)
	at java.util.concurrent.ThreadPoolExecutor$Worker.run(ThreadPoolExecutor.java:918)
	at java.lang.Thread.run(Thread.java:662)
Caused by: org.apache.rat.mp.RatCheckException: Too many unapproved licenses: 19
	at org.apache.rat.mp.RatCheckMojo.check(RatCheckMojo.java:167)
	at org.apache.rat.mp.RatCheckMojo.execute(RatCheckMojo.java:159)
	at org.apache.maven.plugin.DefaultBuildPluginManager.executeMojo(DefaultBuildPluginManager.java:101)
	at org.apache.maven.lifecycle.internal.MojoExecutor.execute(MojoExecutor.java:209)
	... 31 more
Sending e-mails to: notifications@accumulo.apache.org
channel stopped

Mime
View raw message