accumulo-notifications mailing list archives

Site index · List index
Message view « Date » · « Thread »
Top « Date » · « Thread »
From Apache Jenkins Server <jenk...@builds.apache.org>
Subject Build failed in Jenkins: Accumulo-Trunk » Testing #922
Date Thu, 20 Jun 2013 17:03:12 GMT
See <https://builds.apache.org/job/Accumulo-Trunk/org.apache.accumulo$accumulo-test/922/changes>

Changes:

[ecn] ACCUMULO-118 move unit test into test area

------------------------------------------
[...truncated 491 lines...]
	at org.junit.Assert.fail(Assert.java:88)
	at org.junit.Assert.failNotEquals(Assert.java:743)
	at org.junit.Assert.assertEquals(Assert.java:118)
	at org.junit.Assert.assertEquals(Assert.java:555)
	at org.junit.Assert.assertEquals(Assert.java:542)
	at org.apache.accumulo.test.ShellServerTest.assertGoodExit(ShellServerTest.java:136)
	at org.apache.accumulo.test.ShellServerTest.exec(ShellServerTest.java:115)
	at org.apache.accumulo.test.ShellServerTest.trace(ShellServerTest.java:773)
	at sun.reflect.NativeMethodAccessorImpl.invoke0(Native Method)
	at sun.reflect.NativeMethodAccessorImpl.invoke(NativeMethodAccessorImpl.java:39)
	at sun.reflect.DelegatingMethodAccessorImpl.invoke(DelegatingMethodAccessorImpl.java:25)
	at java.lang.reflect.Method.invoke(Method.java:597)
	at org.junit.runners.model.FrameworkMethod$1.runReflectiveCall(FrameworkMethod.java:47)
	at org.junit.internal.runners.model.ReflectiveCallable.run(ReflectiveCallable.java:12)
	at org.junit.runners.model.FrameworkMethod.invokeExplosively(FrameworkMethod.java:44)
	at org.junit.internal.runners.statements.InvokeMethod.evaluate(InvokeMethod.java:17)
	at org.junit.internal.runners.statements.FailOnTimeout$StatementThread.run(FailOnTimeout.java:74)

testPertableClasspath(org.apache.accumulo.test.ShellServerTest)  Time elapsed: 0.068 sec 
<<< FAILURE!
java.lang.AssertionError: expected:<0> but was:<9>
	at org.junit.Assert.fail(Assert.java:88)
	at org.junit.Assert.failNotEquals(Assert.java:743)
	at org.junit.Assert.assertEquals(Assert.java:118)
	at org.junit.Assert.assertEquals(Assert.java:555)
	at org.junit.Assert.assertEquals(Assert.java:542)
	at org.apache.accumulo.test.ShellServerTest.assertGoodExit(ShellServerTest.java:136)
	at org.apache.accumulo.test.ShellServerTest.exec(ShellServerTest.java:115)
	at org.apache.accumulo.test.ShellServerTest.testPertableClasspath(ShellServerTest.java:739)
	at sun.reflect.NativeMethodAccessorImpl.invoke0(Native Method)
	at sun.reflect.NativeMethodAccessorImpl.invoke(NativeMethodAccessorImpl.java:39)
	at sun.reflect.DelegatingMethodAccessorImpl.invoke(DelegatingMethodAccessorImpl.java:25)
	at java.lang.reflect.Method.invoke(Method.java:597)
	at org.junit.runners.model.FrameworkMethod$1.runReflectiveCall(FrameworkMethod.java:47)
	at org.junit.internal.runners.model.ReflectiveCallable.run(ReflectiveCallable.java:12)
	at org.junit.runners.model.FrameworkMethod.invokeExplosively(FrameworkMethod.java:44)
	at org.junit.internal.runners.statements.InvokeMethod.evaluate(InvokeMethod.java:17)
	at org.junit.internal.runners.statements.FailOnTimeout$StatementThread.run(FailOnTimeout.java:74)

setscaniterDeletescaniter(org.apache.accumulo.test.ShellServerTest)  Time elapsed: 0.049 sec
 <<< FAILURE!
java.lang.AssertionError: expected:<0> but was:<10>
	at org.junit.Assert.fail(Assert.java:88)
	at org.junit.Assert.failNotEquals(Assert.java:743)
	at org.junit.Assert.assertEquals(Assert.java:118)
	at org.junit.Assert.assertEquals(Assert.java:555)
	at org.junit.Assert.assertEquals(Assert.java:542)
	at org.apache.accumulo.test.ShellServerTest.assertGoodExit(ShellServerTest.java:136)
	at org.apache.accumulo.test.ShellServerTest.exec(ShellServerTest.java:115)
	at org.apache.accumulo.test.ShellServerTest.setscaniterDeletescaniter(ShellServerTest.java:235)
	at sun.reflect.NativeMethodAccessorImpl.invoke0(Native Method)
	at sun.reflect.NativeMethodAccessorImpl.invoke(NativeMethodAccessorImpl.java:39)
	at sun.reflect.DelegatingMethodAccessorImpl.invoke(DelegatingMethodAccessorImpl.java:25)
	at java.lang.reflect.Method.invoke(Method.java:597)
	at org.junit.runners.model.FrameworkMethod$1.runReflectiveCall(FrameworkMethod.java:47)
	at org.junit.internal.runners.model.ReflectiveCallable.run(ReflectiveCallable.java:12)
	at org.junit.runners.model.FrameworkMethod.invokeExplosively(FrameworkMethod.java:44)
	at org.junit.internal.runners.statements.InvokeMethod.evaluate(InvokeMethod.java:17)
	at org.junit.internal.runners.statements.FailOnTimeout$StatementThread.run(FailOnTimeout.java:74)

clearCls(org.apache.accumulo.test.ShellServerTest)  Time elapsed: 0.001 sec  <<<
FAILURE!
java.lang.AssertionError: expected:<0> but was:<10>
	at org.junit.Assert.fail(Assert.java:88)
	at org.junit.Assert.failNotEquals(Assert.java:743)
	at org.junit.Assert.assertEquals(Assert.java:118)
	at org.junit.Assert.assertEquals(Assert.java:555)
	at org.junit.Assert.assertEquals(Assert.java:542)
	at org.apache.accumulo.test.ShellServerTest.assertGoodExit(ShellServerTest.java:136)
	at org.apache.accumulo.test.ShellServerTest.exec(ShellServerTest.java:128)
	at org.apache.accumulo.test.ShellServerTest.exec(ShellServerTest.java:122)
	at org.apache.accumulo.test.ShellServerTest.clearCls(ShellServerTest.java:422)
	at sun.reflect.NativeMethodAccessorImpl.invoke0(Native Method)
	at sun.reflect.NativeMethodAccessorImpl.invoke(NativeMethodAccessorImpl.java:39)
	at sun.reflect.DelegatingMethodAccessorImpl.invoke(DelegatingMethodAccessorImpl.java:25)
	at java.lang.reflect.Method.invoke(Method.java:597)
	at org.junit.runners.model.FrameworkMethod$1.runReflectiveCall(FrameworkMethod.java:47)
	at org.junit.internal.runners.model.ReflectiveCallable.run(ReflectiveCallable.java:12)
	at org.junit.runners.model.FrameworkMethod.invokeExplosively(FrameworkMethod.java:44)
	at org.junit.internal.runners.statements.InvokeMethod.evaluate(InvokeMethod.java:17)
	at org.junit.internal.runners.statements.FailOnTimeout$StatementThread.run(FailOnTimeout.java:74)

deletemany(org.apache.accumulo.test.ShellServerTest)  Time elapsed: 0.061 sec  <<<
FAILURE!
java.lang.AssertionError: expected:<10> but was:<1>
	at org.junit.Assert.fail(Assert.java:88)
	at org.junit.Assert.failNotEquals(Assert.java:743)
	at org.junit.Assert.assertEquals(Assert.java:118)
	at org.junit.Assert.assertEquals(Assert.java:555)
	at org.junit.Assert.assertEquals(Assert.java:542)
	at org.apache.accumulo.test.ShellServerTest.deletemany(ShellServerTest.java:487)
	at sun.reflect.NativeMethodAccessorImpl.invoke0(Native Method)
	at sun.reflect.NativeMethodAccessorImpl.invoke(NativeMethodAccessorImpl.java:39)
	at sun.reflect.DelegatingMethodAccessorImpl.invoke(DelegatingMethodAccessorImpl.java:25)
	at java.lang.reflect.Method.invoke(Method.java:597)
	at org.junit.runners.model.FrameworkMethod$1.runReflectiveCall(FrameworkMethod.java:47)
	at org.junit.internal.runners.model.ReflectiveCallable.run(ReflectiveCallable.java:12)
	at org.junit.runners.model.FrameworkMethod.invokeExplosively(FrameworkMethod.java:44)
	at org.junit.internal.runners.statements.InvokeMethod.evaluate(InvokeMethod.java:17)
	at org.junit.internal.runners.statements.FailOnTimeout$StatementThread.run(FailOnTimeout.java:74)

deleterows(org.apache.accumulo.test.ShellServerTest)  Time elapsed: 0.424 sec  <<<
FAILURE!
java.lang.AssertionError
	at org.junit.Assert.fail(Assert.java:86)
	at org.junit.Assert.assertTrue(Assert.java:41)
	at org.junit.Assert.assertTrue(Assert.java:52)
	at org.apache.accumulo.test.ShellServerTest.deleterows(ShellServerTest.java:517)
	at sun.reflect.NativeMethodAccessorImpl.invoke0(Native Method)
	at sun.reflect.NativeMethodAccessorImpl.invoke(NativeMethodAccessorImpl.java:39)
	at sun.reflect.DelegatingMethodAccessorImpl.invoke(DelegatingMethodAccessorImpl.java:25)
	at java.lang.reflect.Method.invoke(Method.java:597)
	at org.junit.runners.model.FrameworkMethod$1.runReflectiveCall(FrameworkMethod.java:47)
	at org.junit.internal.runners.model.ReflectiveCallable.run(ReflectiveCallable.java:12)
	at org.junit.runners.model.FrameworkMethod.invokeExplosively(FrameworkMethod.java:44)
	at org.junit.internal.runners.statements.InvokeMethod.evaluate(InvokeMethod.java:17)
	at org.junit.internal.runners.statements.FailOnTimeout$StatementThread.run(FailOnTimeout.java:74)

execfile(org.apache.accumulo.test.ShellServerTest)  Time elapsed: 0.012 sec  <<<
FAILURE!
java.lang.AssertionError: expected:<0> but was:<12>
	at org.junit.Assert.fail(Assert.java:88)
	at org.junit.Assert.failNotEquals(Assert.java:743)
	at org.junit.Assert.assertEquals(Assert.java:118)
	at org.junit.Assert.assertEquals(Assert.java:555)
	at org.junit.Assert.assertEquals(Assert.java:542)
	at org.apache.accumulo.test.ShellServerTest.assertGoodExit(ShellServerTest.java:136)
	at org.apache.accumulo.test.ShellServerTest.exec(ShellServerTest.java:128)
	at org.apache.accumulo.test.ShellServerTest.execfile(ShellServerTest.java:250)
	at sun.reflect.NativeMethodAccessorImpl.invoke0(Native Method)
	at sun.reflect.NativeMethodAccessorImpl.invoke(NativeMethodAccessorImpl.java:39)
	at sun.reflect.DelegatingMethodAccessorImpl.invoke(DelegatingMethodAccessorImpl.java:25)
	at java.lang.reflect.Method.invoke(Method.java:597)
	at org.junit.runners.model.FrameworkMethod$1.runReflectiveCall(FrameworkMethod.java:47)
	at org.junit.internal.runners.model.ReflectiveCallable.run(ReflectiveCallable.java:12)
	at org.junit.runners.model.FrameworkMethod.invokeExplosively(FrameworkMethod.java:44)
	at org.junit.internal.runners.statements.InvokeMethod.evaluate(InvokeMethod.java:17)
	at org.junit.internal.runners.statements.FailOnTimeout$StatementThread.run(FailOnTimeout.java:74)

clonetable(org.apache.accumulo.test.ShellServerTest)  Time elapsed: 0.981 sec  <<<
FAILURE!
java.lang.AssertionError: expected:<0> but was:<12>
	at org.junit.Assert.fail(Assert.java:88)
	at org.junit.Assert.failNotEquals(Assert.java:743)
	at org.junit.Assert.assertEquals(Assert.java:118)
	at org.junit.Assert.assertEquals(Assert.java:555)
	at org.junit.Assert.assertEquals(Assert.java:542)
	at org.apache.accumulo.test.ShellServerTest.assertGoodExit(ShellServerTest.java:136)
	at org.apache.accumulo.test.ShellServerTest.exec(ShellServerTest.java:115)
	at org.apache.accumulo.test.ShellServerTest.clonetable(ShellServerTest.java:430)
	at sun.reflect.NativeMethodAccessorImpl.invoke0(Native Method)
	at sun.reflect.NativeMethodAccessorImpl.invoke(NativeMethodAccessorImpl.java:39)
	at sun.reflect.DelegatingMethodAccessorImpl.invoke(DelegatingMethodAccessorImpl.java:25)
	at java.lang.reflect.Method.invoke(Method.java:597)
	at org.junit.runners.model.FrameworkMethod$1.runReflectiveCall(FrameworkMethod.java:47)
	at org.junit.internal.runners.model.ReflectiveCallable.run(ReflectiveCallable.java:12)
	at org.junit.runners.model.FrameworkMethod.invokeExplosively(FrameworkMethod.java:44)
	at org.junit.internal.runners.statements.InvokeMethod.evaluate(InvokeMethod.java:17)
	at org.junit.internal.runners.statements.FailOnTimeout$StatementThread.run(FailOnTimeout.java:74)

notable(org.apache.accumulo.test.ShellServerTest)  Time elapsed: 0.001 sec  <<< FAILURE!
java.lang.AssertionError: expected:<0> but was:<13>
	at org.junit.Assert.fail(Assert.java:88)
	at org.junit.Assert.failNotEquals(Assert.java:743)
	at org.junit.Assert.assertEquals(Assert.java:118)
	at org.junit.Assert.assertEquals(Assert.java:555)
	at org.junit.Assert.assertEquals(Assert.java:542)
	at org.apache.accumulo.test.ShellServerTest.assertGoodExit(ShellServerTest.java:136)
	at org.apache.accumulo.test.ShellServerTest.exec(ShellServerTest.java:115)
	at org.apache.accumulo.test.ShellServerTest.notable(ShellServerTest.java:369)
	at sun.reflect.NativeMethodAccessorImpl.invoke0(Native Method)
	at sun.reflect.NativeMethodAccessorImpl.invoke(NativeMethodAccessorImpl.java:39)
	at sun.reflect.DelegatingMethodAccessorImpl.invoke(DelegatingMethodAccessorImpl.java:25)
	at java.lang.reflect.Method.invoke(Method.java:597)
	at org.junit.runners.model.FrameworkMethod$1.runReflectiveCall(FrameworkMethod.java:47)
	at org.junit.internal.runners.model.ReflectiveCallable.run(ReflectiveCallable.java:12)
	at org.junit.runners.model.FrameworkMethod.invokeExplosively(FrameworkMethod.java:44)
	at org.junit.internal.runners.statements.InvokeMethod.evaluate(InvokeMethod.java:17)
	at org.junit.internal.runners.statements.FailOnTimeout$StatementThread.run(FailOnTimeout.java:74)

Running org.apache.accumulo.test.VolumeTest
Tests run: 1, Failures: 0, Errors: 0, Skipped: 0, Time elapsed: 6.282 sec
Running org.apache.accumulo.test.TestAccumuloSplitRecovery
Tests run: 1, Failures: 0, Errors: 0, Skipped: 0, Time elapsed: 10.494 sec
Running org.apache.accumulo.fate.zookeeper.ZooLockTest
Tests run: 6, Failures: 0, Errors: 0, Skipped: 0, Time elapsed: 3.059 sec

Results :

Failed tests:   interpreter(org.apache.accumulo.test.ShellServerTest): HexScan present in
root@miniInstance t> interpreter -l(..)
  exporttableImporttable(org.apache.accumulo.test.ShellServerTest): expected:<0> but
was:<1>
  groups(org.apache.accumulo.test.ShellServerTest): expected:<0> but was:<2>
  listscans(org.apache.accumulo.test.ShellServerTest): expected:<0> but was:<1>
  maxrow(org.apache.accumulo.test.ShellServerTest): expected:<0> but was:<2>
  importDirectory(org.apache.accumulo.test.ShellServerTest): expected:<0> but was:<3>
  constraint(org.apache.accumulo.test.ShellServerTest): expected:<0> but was:<3>
  renametable(org.apache.accumulo.test.ShellServerTest): expected:<0> but was:<3>
  listcompactions(org.apache.accumulo.test.ShellServerTest): expected:<0> but was:<4>
  classpath(org.apache.accumulo.test.ShellServerTest): expected:<0> but was:<4>
  du(org.apache.accumulo.test.ShellServerTest): expected:<0> but was:<5>
  grep(org.apache.accumulo.test.ShellServerTest): expected:<0> but was:<6>
  help(org.apache.accumulo.test.ShellServerTest): expected:<0> but was:<6>
  info(org.apache.accumulo.test.ShellServerTest): expected:<0> but was:<6>
  iter(org.apache.accumulo.test.ShellServerTest): expected:<0> but was:<7>
  ping(org.apache.accumulo.test.ShellServerTest): expected:<0> but was:<7>
  user(org.apache.accumulo.test.ShellServerTest): expected:<0> but was:<7>
  debug(org.apache.accumulo.test.ShellServerTest): expected:<0> but was:<7>
  egrep(org.apache.accumulo.test.ShellServerTest): expected:<0> but was:<8>
  merge(org.apache.accumulo.test.ShellServerTest): expected:<0> but was:<9>
  sleep(org.apache.accumulo.test.ShellServerTest): expected:<0> but was:<9>
  trace(org.apache.accumulo.test.ShellServerTest): expected:<0> but was:<9>
  testPertableClasspath(org.apache.accumulo.test.ShellServerTest): expected:<0> but
was:<9>
  setscaniterDeletescaniter(org.apache.accumulo.test.ShellServerTest): expected:<0>
but was:<10>
  clearCls(org.apache.accumulo.test.ShellServerTest): expected:<0> but was:<10>
  deletemany(org.apache.accumulo.test.ShellServerTest): expected:<10> but was:<1>
  deleterows(org.apache.accumulo.test.ShellServerTest)
  execfile(org.apache.accumulo.test.ShellServerTest): expected:<0> but was:<12>
  clonetable(org.apache.accumulo.test.ShellServerTest): expected:<0> but was:<12>
  notable(org.apache.accumulo.test.ShellServerTest): expected:<0> but was:<13>

Tests run: 53, Failures: 30, Errors: 0, Skipped: 0

[ERROR] There are test failures.

Please refer to <https://builds.apache.org/job/Accumulo-Trunk/org.apache.accumulo$accumulo-test/ws/target/surefire-reports>
for the individual test results.
[JENKINS] Recording test results
[INFO] 
[INFO] --- maven-jar-plugin:2.4:jar (default-jar) @ accumulo-test ---
[INFO] Building jar: <https://builds.apache.org/job/Accumulo-Trunk/org.apache.accumulo$accumulo-test/ws/target/accumulo-test-1.6.0-SNAPSHOT.jar>
[INFO] 
[INFO] --- maven-site-plugin:3.2:attach-descriptor (attach-descriptor) @ accumulo-test ---
[INFO] [INFO] Failsafe report directory: <https://builds.apache.org/job/Accumulo-Trunk/org.apache.accumulo$accumulo-test/ws/target/failsafe-reports>

-------------------------------------------------------
 T E S T S
-------------------------------------------------------

[INFO] --- maven-failsafe-plugin:2.12.4:integration-test (run-integration-tests) @ accumulo-test
---
Running org.apache.accumulo.test.TableOperationsIT
Tests run: 3, Failures: 0, Errors: 0, Skipped: 0, Time elapsed: 12.823 sec

Results :

Tests run: 3, Failures: 0, Errors: 0, Skipped: 0

[INFO] [INFO] Failsafe report directory: <https://builds.apache.org/job/Accumulo-Trunk/org.apache.accumulo$accumulo-test/ws/target/failsafe-reports>

[INFO] --- maven-failsafe-plugin:2.12.4:verify (verify-integration-tests) @ accumulo-test
---
[JENKINS] Recording test results
[INFO] 51 implicit excludes (use -debug for more details).
[INFO] [INFO] Exclude: system/bench/lib/*splits
[INFO] Exclude: system/continuous/*.txt

[INFO] 378 resources included (use -debug for more details)
[INFO] --- apache-rat-plugin:0.9:check (default) @ accumulo-test ---
[INFO] Rat check: Summary of files. Unapproved: 1 unknown: 1 generated: 0 approved: 362 licence.

Mime
View raw message