accumulo-notifications mailing list archives

Site index · List index
Message view « Date » · « Thread »
Top « Date » · « Thread »
From Apache Jenkins Server <jenk...@builds.apache.org>
Subject Build failed in Jenkins: Accumulo-Trunk-Hadoop-2.0 #275
Date Wed, 19 Jun 2013 04:12:38 GMT
See <https://builds.apache.org/job/Accumulo-Trunk-Hadoop-2.0/275/changes>

Changes:

[cjnolet] ACCUMULO-1499 Applying patch from Miguel Pereira that moves sanity checking of MiniAccumuloConfig
inputs into the MiniAccumuloConfig's initialize method.

------------------------------------------
[...truncated 2549 lines...]
Tests run: 2, Failures: 0, Errors: 0, Skipped: 0, Time elapsed: 0.001 sec
Running org.apache.accumulo.core.file.blockfile.cache.TestLruBlockCache
Tests run: 7, Failures: 0, Errors: 0, Skipped: 0, Time elapsed: 1.029 sec
Running org.apache.accumulo.core.file.FileOperationsTest
Tests run: 1, Failures: 0, Errors: 0, Skipped: 0, Time elapsed: 0.042 sec
Running org.apache.accumulo.core.security.AuthorizationsTest
Tests run: 6, Failures: 0, Errors: 0, Skipped: 0, Time elapsed: 0.007 sec
Running org.apache.accumulo.core.security.VisibilityEvaluatorTest
Tests run: 4, Failures: 0, Errors: 0, Skipped: 0, Time elapsed: 0.003 sec
Running org.apache.accumulo.core.security.ColumnVisibilityTest
Tests run: 12, Failures: 0, Errors: 0, Skipped: 0, Time elapsed: 0.004 sec
Running org.apache.accumulo.core.cli.TestClientOpts
Tests run: 1, Failures: 0, Errors: 0, Skipped: 0, Time elapsed: 0.01 sec
Running org.apache.accumulo.core.constraints.DefaultKeySizeConstraintTest
Tests run: 1, Failures: 0, Errors: 0, Skipped: 0, Time elapsed: 0.011 sec
Running org.apache.accumulo.core.client.ClientSideIteratorTest
Tests run: 2, Failures: 0, Errors: 0, Skipped: 0, Time elapsed: 0.031 sec
Running org.apache.accumulo.core.client.RowIteratorTest
Tests run: 2, Failures: 0, Errors: 0, Skipped: 0, Time elapsed: 0.001 sec
Running org.apache.accumulo.core.client.TestThrift1474
Tests run: 1, Failures: 0, Errors: 0, Skipped: 0, Time elapsed: 0.052 sec
Running org.apache.accumulo.core.client.security.tokens.PasswordTokenTest
Tests run: 1, Failures: 0, Errors: 0, Skipped: 0, Time elapsed: 0.007 sec
Running org.apache.accumulo.core.client.security.SecurityErrorCodeTest
Tests run: 1, Failures: 0, Errors: 0, Skipped: 0, Time elapsed: 0.001 sec
Running org.apache.accumulo.core.client.mock.MockTableOperationsTest
Tests run: 6, Failures: 0, Errors: 0, Skipped: 0, Time elapsed: 0.178 sec
Running org.apache.accumulo.core.client.mock.TestBatchScanner821
Tests run: 1, Failures: 0, Errors: 0, Skipped: 0, Time elapsed: 0.013 sec
Running org.apache.accumulo.core.client.mock.MockConnectorTest
Tests run: 10, Failures: 0, Errors: 0, Skipped: 0, Time elapsed: 0.148 sec
Running org.apache.accumulo.core.client.mapred.AccumuloOutputFormatTest
Tests run: 2, Failures: 0, Errors: 0, Skipped: 0, Time elapsed: 1.414 sec
Running org.apache.accumulo.core.client.mapred.TokenFileTest
Tests run: 1, Failures: 0, Errors: 0, Skipped: 0, Time elapsed: 1.428 sec
Running org.apache.accumulo.core.client.mapred.AccumuloFileOutputFormatTest
Tests run: 4, Failures: 0, Errors: 0, Skipped: 0, Time elapsed: 3.346 sec
Running org.apache.accumulo.core.client.mapred.AccumuloRowInputFormatTest
Tests run: 1, Failures: 0, Errors: 0, Skipped: 0, Time elapsed: 1.1 sec
Running org.apache.accumulo.core.client.mapred.AccumuloInputFormatTest
Tests run: 6, Failures: 0, Errors: 0, Skipped: 0, Time elapsed: 1.157 sec
Running org.apache.accumulo.core.client.mapreduce.AccumuloOutputFormatTest
Tests run: 2, Failures: 0, Errors: 0, Skipped: 0, Time elapsed: 1.116 sec
Running org.apache.accumulo.core.client.mapreduce.TokenFileTest
Tests run: 1, Failures: 0, Errors: 0, Skipped: 0, Time elapsed: 1.144 sec
Running org.apache.accumulo.core.client.mapreduce.AccumuloFileOutputFormatTest
Tests run: 4, Failures: 0, Errors: 0, Skipped: 0, Time elapsed: 3.279 sec
Running org.apache.accumulo.core.client.mapreduce.AccumuloRowInputFormatTest
Tests run: 1, Failures: 0, Errors: 0, Skipped: 0, Time elapsed: 1.086 sec
Running org.apache.accumulo.core.client.mapreduce.lib.partition.RangePartitionerTest
Tests run: 2, Failures: 0, Errors: 0, Skipped: 0, Time elapsed: 0.684 sec
Running org.apache.accumulo.core.client.mapreduce.AccumuloInputFormatTest
Tests run: 9, Failures: 0, Errors: 0, Skipped: 0, Time elapsed: 1.171 sec
Running org.apache.accumulo.core.client.impl.ScannerOptionsTest
Tests run: 2, Failures: 0, Errors: 0, Skipped: 0, Time elapsed: 0 sec
Running org.apache.accumulo.core.client.impl.TabletLocatorImplTest
Tests run: 18, Failures: 0, Errors: 0, Skipped: 0, Time elapsed: 0.029 sec
Running org.apache.accumulo.core.client.admin.TableOperationsHelperTest
Tests run: 1, Failures: 0, Errors: 0, Skipped: 0, Time elapsed: 0.002 sec
Running org.apache.accumulo.core.client.admin.FindMaxTest
Tests run: 1, Failures: 0, Errors: 0, Skipped: 0, Time elapsed: 1.256 sec
Running org.apache.accumulo.core.client.lexicoder.ReverseLexicoderTest
Tests run: 2, Failures: 0, Errors: 0, Skipped: 0, Time elapsed: 0.008 sec
Running org.apache.accumulo.core.client.lexicoder.ULongLexicoderTest
Tests run: 2, Failures: 0, Errors: 0, Skipped: 0, Time elapsed: 0.001 sec
Running org.apache.accumulo.core.client.lexicoder.UIntegerLexicoderTest
Tests run: 1, Failures: 0, Errors: 0, Skipped: 0, Time elapsed: 0 sec
Running org.apache.accumulo.core.client.lexicoder.LongLexicoderTest
Tests run: 1, Failures: 0, Errors: 0, Skipped: 0, Time elapsed: 0.001 sec
Running org.apache.accumulo.core.client.lexicoder.BigIntegerLexicoderTest
Tests run: 1, Failures: 0, Errors: 0, Skipped: 0, Time elapsed: 0.002 sec
Running org.apache.accumulo.core.client.lexicoder.UUIDLexicoderTest
Tests run: 1, Failures: 0, Errors: 0, Skipped: 0, Time elapsed: 0.012 sec
Running org.apache.accumulo.core.client.lexicoder.ListLexicoderTest
Tests run: 1, Failures: 0, Errors: 0, Skipped: 0, Time elapsed: 0.001 sec
Running org.apache.accumulo.core.client.lexicoder.DoubleLexicoderTest
Tests run: 1, Failures: 0, Errors: 0, Skipped: 0, Time elapsed: 0.001 sec
Running org.apache.accumulo.core.client.lexicoder.PairLexicoderTest
Tests run: 1, Failures: 0, Errors: 0, Skipped: 0, Time elapsed: 0.001 sec
Running org.apache.accumulo.core.client.lexicoder.IntegerLexicoderTest
Tests run: 1, Failures: 0, Errors: 0, Skipped: 0, Time elapsed: 0 sec
Running org.apache.accumulo.core.client.BatchWriterConfigTest
Tests run: 10, Failures: 0, Errors: 0, Skipped: 0, Time elapsed: 0.002 sec
Running org.apache.accumulo.core.iterators.FirstEntryInRowIteratorTest
Tests run: 1, Failures: 0, Errors: 0, Skipped: 0, Time elapsed: 0 sec
Running org.apache.accumulo.core.iterators.system.DeletingIteratorTest
Tests run: 4, Failures: 0, Errors: 0, Skipped: 0, Time elapsed: 0.002 sec
Running org.apache.accumulo.core.iterators.system.VisibilityFilterTest
Tests run: 1, Failures: 0, Errors: 0, Skipped: 0, Time elapsed: 0 sec
Running org.apache.accumulo.core.iterators.system.MultiIteratorTest
Tests run: 7, Failures: 0, Errors: 0, Skipped: 0, Time elapsed: 0.209 sec
Running org.apache.accumulo.core.iterators.system.SourceSwitchingIteratorTest
Tests run: 5, Failures: 0, Errors: 0, Skipped: 0, Time elapsed: 0.002 sec
Running org.apache.accumulo.core.iterators.system.ColumnFilterTest
Tests run: 3, Failures: 0, Errors: 0, Skipped: 0, Time elapsed: 0.001 sec
Running org.apache.accumulo.core.iterators.system.ColumnFamilySkippingIteratorTest
Tests run: 3, Failures: 0, Errors: 0, Skipped: 0, Time elapsed: 0.587 sec
Running org.apache.accumulo.core.iterators.system.TimeSettingIteratorTest
Tests run: 1, Failures: 0, Errors: 0, Skipped: 0, Time elapsed: 0.001 sec
Running org.apache.accumulo.core.iterators.user.RowDeletingIteratorTest
Tests run: 4, Failures: 0, Errors: 0, Skipped: 0, Time elapsed: 0.002 sec
Running org.apache.accumulo.core.iterators.user.BigDecimalCombinerTest
Tests run: 1, Failures: 0, Errors: 0, Skipped: 0, Time elapsed: 0.002 sec
Running org.apache.accumulo.core.iterators.user.GrepIteratorTest
Tests run: 1, Failures: 0, Errors: 0, Skipped: 0, Time elapsed: 0 sec
Running org.apache.accumulo.core.iterators.user.FilterTest
Tests run: 11, Failures: 0, Errors: 0, Skipped: 0, Time elapsed: 0.065 sec
Running org.apache.accumulo.core.iterators.user.WholeColumnFamilyIteratorTest
Tests run: 3, Failures: 0, Errors: 0, Skipped: 0, Time elapsed: 0.002 sec
Running org.apache.accumulo.core.iterators.user.VisibilityFilterTest
Tests run: 9, Failures: 0, Errors: 0, Skipped: 0, Time elapsed: 0.064 sec
Running org.apache.accumulo.core.iterators.user.WholeRowIteratorTest
Tests run: 3, Failures: 0, Errors: 0, Skipped: 0, Time elapsed: 0.002 sec
Running org.apache.accumulo.core.iterators.user.TransformingIteratorTest
Tests run: 16, Failures: 0, Errors: 0, Skipped: 0, Time elapsed: 0.106 sec
Running org.apache.accumulo.core.iterators.user.RegExFilterTest
Tests run: 1, Failures: 0, Errors: 0, Skipped: 0, Time elapsed: 0.001 sec
Running org.apache.accumulo.core.iterators.user.LargeRowFilterTest
Tests run: 5, Failures: 0, Errors: 0, Skipped: 0, Time elapsed: 0.056 sec
Running org.apache.accumulo.core.iterators.user.IntersectingIteratorTest
Tests run: 6, Failures: 0, Errors: 0, Skipped: 0, Time elapsed: 0.729 sec
Running org.apache.accumulo.core.iterators.user.VersioningIteratorTest
Tests run: 6, Failures: 0, Errors: 0, Skipped: 0, Time elapsed: 0.002 sec
Running org.apache.accumulo.core.iterators.user.CombinerTest
Tests run: 14, Failures: 0, Errors: 0, Skipped: 0, Time elapsed: 0.008 sec
Running org.apache.accumulo.core.iterators.user.IndexedDocIteratorTest
Tests run: 5, Failures: 0, Errors: 0, Skipped: 0, Time elapsed: 0.599 sec
Running org.apache.accumulo.core.iterators.user.RowFilterTest
Tests run: 1, Failures: 0, Errors: 0, Skipped: 0, Time elapsed: 0.011 sec
Running org.apache.accumulo.core.iterators.aggregation.NumSummationTest
Tests run: 5, Failures: 0, Errors: 0, Skipped: 0, Time elapsed: 0.003 sec
Running org.apache.accumulo.core.iterators.aggregation.conf.AggregatorConfigurationTest
Tests run: 2, Failures: 0, Errors: 0, Skipped: 0, Time elapsed: 0.004 sec
Running org.apache.accumulo.core.iterators.IterUtilTest
Tests run: 5, Failures: 0, Errors: 0, Skipped: 0, Time elapsed: 0.005 sec
Running org.apache.accumulo.core.iterators.AggregatingIteratorTest
Tests run: 7, Failures: 0, Errors: 0, Skipped: 0, Time elapsed: 0.006 sec
Running org.apache.accumulo.core.iterators.FirstEntryInRowTest
Tests run: 2, Failures: 0, Errors: 0, Skipped: 0, Time elapsed: 0.016 sec
Running org.apache.accumulo.core.conf.PropertyTest
Tests run: 5, Failures: 0, Errors: 0, Skipped: 0, Time elapsed: 0.017 sec

Results :

Tests run: 393, Failures: 0, Errors: 0, Skipped: 0

[INFO] ------------------------------------------------------------------------
[INFO] Reactor Summary:
[INFO] 
[INFO] Apache Accumulo Project ........................... SUCCESS [50.175s]
[INFO] Trace ............................................. SUCCESS [8.011s]
[INFO] Fate .............................................. SUCCESS [3.557s]
[INFO] Start ............................................. SUCCESS [37.800s]
[INFO] Core .............................................. FAILURE [39.804s]
[INFO] Server ............................................ SKIPPED
[INFO] Examples .......................................... SKIPPED
[INFO] Simple Examples ................................... SKIPPED
[INFO] MiniCluster ....................................... SKIPPED
[INFO] Testing ........................................... SKIPPED
[INFO] Proxy ............................................. SKIPPED
[INFO] Assemblies ........................................ SKIPPED
[INFO] Documentation ..................................... SKIPPED
[INFO] ------------------------------------------------------------------------
[INFO] BUILD FAILURE
[INFO] ------------------------------------------------------------------------
[INFO] Total time: 2:25.031s
[INFO] Finished at: Wed Jun 19 04:11:26 UTC 2013
[INFO] Final Memory: 37M/175M
[INFO] ------------------------------------------------------------------------
[JENKINS] Archiving <https://builds.apache.org/job/Accumulo-Trunk-Hadoop-2.0/ws/accumulo-trunk/pom.xml>
to /home/hudson/hudson/jobs/Accumulo-Trunk-Hadoop-2.0/modules/org.apache.accumulo$accumulo-project/builds/2013-06-19_04-08-40/archive/org.apache.accumulo/accumulo-project/1.6.0-SNAPSHOT/accumulo-project-1.6.0-SNAPSHOT.pom
[JENKINS] Archiving <https://builds.apache.org/job/Accumulo-Trunk-Hadoop-2.0/ws/accumulo-trunk/target/accumulo-project-1.6.0-SNAPSHOT-site.xml>
to /home/hudson/hudson/jobs/Accumulo-Trunk-Hadoop-2.0/modules/org.apache.accumulo$accumulo-project/builds/2013-06-19_04-08-40/archive/org.apache.accumulo/accumulo-project/1.6.0-SNAPSHOT/accumulo-project-1.6.0-SNAPSHOT-site.xml
[JENKINS] Archiving <https://builds.apache.org/job/Accumulo-Trunk-Hadoop-2.0/ws/accumulo-trunk/server/pom.xml>
to /home/hudson/hudson/jobs/Accumulo-Trunk-Hadoop-2.0/modules/org.apache.accumulo$accumulo-server/builds/2013-06-19_04-08-41/archive/org.apache.accumulo/accumulo-server/1.6.0-SNAPSHOT/accumulo-server-1.6.0-SNAPSHOT.pom
[JENKINS] Archiving <https://builds.apache.org/job/Accumulo-Trunk-Hadoop-2.0/ws/accumulo-trunk/minicluster/pom.xml>
to /home/hudson/hudson/jobs/Accumulo-Trunk-Hadoop-2.0/modules/org.apache.accumulo$accumulo-minicluster/builds/2013-06-19_04-08-42/archive/org.apache.accumulo/accumulo-minicluster/1.6.0-SNAPSHOT/accumulo-minicluster-1.6.0-SNAPSHOT.pom
[JENKINS] Archiving <https://builds.apache.org/job/Accumulo-Trunk-Hadoop-2.0/ws/accumulo-trunk/examples/simple/pom.xml>
to /home/hudson/hudson/jobs/Accumulo-Trunk-Hadoop-2.0/modules/org.apache.accumulo$accumulo-examples-simple/builds/2013-06-19_04-08-41/archive/org.apache.accumulo/accumulo-examples-simple/1.6.0-SNAPSHOT/accumulo-examples-simple-1.6.0-SNAPSHOT.pom
[JENKINS] Archiving <https://builds.apache.org/job/Accumulo-Trunk-Hadoop-2.0/ws/accumulo-trunk/proxy/pom.xml>
to /home/hudson/hudson/jobs/Accumulo-Trunk-Hadoop-2.0/modules/org.apache.accumulo$accumulo-proxy/builds/2013-06-19_04-08-42/archive/org.apache.accumulo/accumulo-proxy/1.6.0-SNAPSHOT/accumulo-proxy-1.6.0-SNAPSHOT.pom
[JENKINS] Archiving <https://builds.apache.org/job/Accumulo-Trunk-Hadoop-2.0/ws/accumulo-trunk/examples/pom.xml>
to /home/hudson/hudson/jobs/Accumulo-Trunk-Hadoop-2.0/modules/org.apache.accumulo$accumulo-examples/builds/2013-06-19_04-08-41/archive/org.apache.accumulo/accumulo-examples/1.6.0-SNAPSHOT/accumulo-examples-1.6.0-SNAPSHOT.pom
[JENKINS] Archiving <https://builds.apache.org/job/Accumulo-Trunk-Hadoop-2.0/ws/accumulo-trunk/assemble/pom.xml>
to /home/hudson/hudson/jobs/Accumulo-Trunk-Hadoop-2.0/modules/org.apache.accumulo$accumulo/builds/2013-06-19_04-08-42/archive/org.apache.accumulo/accumulo/1.6.0-SNAPSHOT/accumulo-1.6.0-SNAPSHOT.pom
[JENKINS] Archiving <https://builds.apache.org/job/Accumulo-Trunk-Hadoop-2.0/ws/accumulo-trunk/test/pom.xml>
to /home/hudson/hudson/jobs/Accumulo-Trunk-Hadoop-2.0/modules/org.apache.accumulo$accumulo-test/builds/2013-06-19_04-08-42/archive/org.apache.accumulo/accumulo-test/1.6.0-SNAPSHOT/accumulo-test-1.6.0-SNAPSHOT.pom
[JENKINS] Archiving <https://builds.apache.org/job/Accumulo-Trunk-Hadoop-2.0/ws/accumulo-trunk/start/pom.xml>
to /home/hudson/hudson/jobs/Accumulo-Trunk-Hadoop-2.0/modules/org.apache.accumulo$accumulo-start/builds/2013-06-19_04-08-41/archive/org.apache.accumulo/accumulo-start/1.6.0-SNAPSHOT/accumulo-start-1.6.0-SNAPSHOT.pom
[JENKINS] Archiving <https://builds.apache.org/job/Accumulo-Trunk-Hadoop-2.0/ws/accumulo-trunk/start/target/accumulo-start-1.6.0-SNAPSHOT.jar>
to /home/hudson/hudson/jobs/Accumulo-Trunk-Hadoop-2.0/modules/org.apache.accumulo$accumulo-start/builds/2013-06-19_04-08-41/archive/org.apache.accumulo/accumulo-start/1.6.0-SNAPSHOT/accumulo-start-1.6.0-SNAPSHOT.jar
[JENKINS] Archiving <https://builds.apache.org/job/Accumulo-Trunk-Hadoop-2.0/ws/accumulo-trunk/fate/pom.xml>
to /home/hudson/hudson/jobs/Accumulo-Trunk-Hadoop-2.0/modules/org.apache.accumulo$accumulo-fate/builds/2013-06-19_04-08-41/archive/org.apache.accumulo/accumulo-fate/1.6.0-SNAPSHOT/accumulo-fate-1.6.0-SNAPSHOT.pom
[JENKINS] Archiving <https://builds.apache.org/job/Accumulo-Trunk-Hadoop-2.0/ws/accumulo-trunk/fate/target/accumulo-fate-1.6.0-SNAPSHOT.jar>
to /home/hudson/hudson/jobs/Accumulo-Trunk-Hadoop-2.0/modules/org.apache.accumulo$accumulo-fate/builds/2013-06-19_04-08-41/archive/org.apache.accumulo/accumulo-fate/1.6.0-SNAPSHOT/accumulo-fate-1.6.0-SNAPSHOT.jar
[JENKINS] Archiving <https://builds.apache.org/job/Accumulo-Trunk-Hadoop-2.0/ws/accumulo-trunk/core/pom.xml>
to /home/hudson/hudson/jobs/Accumulo-Trunk-Hadoop-2.0/modules/org.apache.accumulo$accumulo-core/builds/2013-06-19_04-08-40/archive/org.apache.accumulo/accumulo-core/1.6.0-SNAPSHOT/accumulo-core-1.6.0-SNAPSHOT.pom
[JENKINS] Archiving <https://builds.apache.org/job/Accumulo-Trunk-Hadoop-2.0/ws/accumulo-trunk/trace/pom.xml>
to /home/hudson/hudson/jobs/Accumulo-Trunk-Hadoop-2.0/modules/org.apache.accumulo$accumulo-trace/builds/2013-06-19_04-08-40/archive/org.apache.accumulo/accumulo-trace/1.6.0-SNAPSHOT/accumulo-trace-1.6.0-SNAPSHOT.pom
[JENKINS] Archiving <https://builds.apache.org/job/Accumulo-Trunk-Hadoop-2.0/ws/accumulo-trunk/trace/target/accumulo-trace-1.6.0-SNAPSHOT.jar>
to /home/hudson/hudson/jobs/Accumulo-Trunk-Hadoop-2.0/modules/org.apache.accumulo$accumulo-trace/builds/2013-06-19_04-08-40/archive/org.apache.accumulo/accumulo-trace/1.6.0-SNAPSHOT/accumulo-trace-1.6.0-SNAPSHOT.jar
[JENKINS] Archiving <https://builds.apache.org/job/Accumulo-Trunk-Hadoop-2.0/ws/accumulo-trunk/docs/pom.xml>
to /home/hudson/hudson/jobs/Accumulo-Trunk-Hadoop-2.0/modules/org.apache.accumulo$accumulo-docs/builds/2013-06-19_04-08-42/archive/org.apache.accumulo/accumulo-docs/1.6.0-SNAPSHOT/accumulo-docs-1.6.0-SNAPSHOT.pom
Waiting for Jenkins to finish collecting data
mavenExecutionResult exceptions not empty
message : Internal error: java.lang.reflect.UndeclaredThrowableException
cause : null
Stack trace : 
org.apache.maven.InternalErrorException: Internal error: java.lang.reflect.UndeclaredThrowableException
	at org.apache.maven.lifecycle.internal.BuilderCommon.handleBuildError(BuilderCommon.java:128)
	at org.apache.maven.lifecycle.internal.LifecycleModuleBuilder.buildProject(LifecycleModuleBuilder.java:95)
	at org.apache.maven.lifecycle.internal.LifecycleModuleBuilder.buildProject(LifecycleModuleBuilder.java:59)
	at org.apache.maven.lifecycle.internal.LifecycleStarter.singleThreadedBuild(LifecycleStarter.java:183)
	at org.apache.maven.lifecycle.internal.LifecycleStarter.execute(LifecycleStarter.java:161)
	at org.apache.maven.DefaultMaven.doExecute(DefaultMaven.java:320)
	at org.apache.maven.DefaultMaven.execute(DefaultMaven.java:156)
	at org.jvnet.hudson.maven3.launcher.Maven3Launcher.main(Maven3Launcher.java:79)
	at sun.reflect.NativeMethodAccessorImpl.invoke0(Native Method)
	at sun.reflect.NativeMethodAccessorImpl.invoke(NativeMethodAccessorImpl.java:39)
	at sun.reflect.DelegatingMethodAccessorImpl.invoke(DelegatingMethodAccessorImpl.java:25)
	at java.lang.reflect.Method.invoke(Method.java:597)
	at org.codehaus.plexus.classworlds.launcher.Launcher.launchStandard(Launcher.java:329)
	at org.codehaus.plexus.classworlds.launcher.Launcher.launch(Launcher.java:239)
	at org.jvnet.hudson.maven3.agent.Maven3Main.launch(Maven3Main.java:158)
	at hudson.maven.Maven3Builder.call(Maven3Builder.java:100)
	at hudson.maven.Maven3Builder.call(Maven3Builder.java:66)
	at hudson.remoting.UserRequest.perform(UserRequest.java:118)
	at hudson.remoting.UserRequest.perform(UserRequest.java:48)
	at hudson.remoting.Request$2.run(Request.java:326)
	at hudson.remoting.InterceptingExecutorService$1.call(InterceptingExecutorService.java:72)
	at java.util.concurrent.FutureTask$Sync.innerRun(FutureTask.java:303)
	at java.util.concurrent.FutureTask.run(FutureTask.java:138)
	at java.util.concurrent.ThreadPoolExecutor$Worker.runTask(ThreadPoolExecutor.java:895)
	at java.util.concurrent.ThreadPoolExecutor$Worker.run(ThreadPoolExecutor.java:918)
	at java.lang.Thread.run(Thread.java:662)
Caused by: java.lang.reflect.UndeclaredThrowableException
	at com.sun.proxy.$Proxy2.setExecutedMojos(Unknown Source)
	at hudson.maven.MavenBuildProxy$Filter.setExecutedMojos(MavenBuildProxy.java:243)
	at hudson.maven.Maven3Builder$MavenExecutionListener.recordMojoEnded(Maven3Builder.java:439)
	at hudson.maven.Maven3Builder$MavenExecutionListener.mojoSucceeded(Maven3Builder.java:425)
	at org.apache.maven.lifecycle.internal.DefaultExecutionEventCatapult.fire(DefaultExecutionEventCatapult.java:87)
	at org.apache.maven.lifecycle.internal.DefaultExecutionEventCatapult.fire(DefaultExecutionEventCatapult.java:42)
	at org.apache.maven.lifecycle.internal.MojoExecutor.execute(MojoExecutor.java:228)
	at org.apache.maven.lifecycle.internal.MojoExecutor.execute(MojoExecutor.java:153)
	at org.apache.maven.lifecycle.internal.MojoExecutor.execute(MojoExecutor.java:145)
	at org.apache.maven.lifecycle.internal.LifecycleModuleBuilder.buildProject(LifecycleModuleBuilder.java:84)
	... 24 more
Caused by: java.io.StreamCorruptedException: invalid type code: 0B
	at java.io.ObjectInputStream.readObject0(ObjectInputStream.java:1374)
	at java.io.ObjectInputStream.defaultReadFields(ObjectInputStream.java:1970)
	at java.io.ObjectInputStream.readSerialData(ObjectInputStream.java:1894)
	at java.io.ObjectInputStream.readOrdinaryObject(ObjectInputStream.java:1777)
	at java.io.ObjectInputStream.readObject0(ObjectInputStream.java:1347)
	at java.io.ObjectInputStream.readObject(ObjectInputStream.java:369)
	at hudson.remoting.UserRequest.deserialize(UserRequest.java:182)
	at hudson.remoting.UserRequest.perform(UserRequest.java:98)
	at hudson.remoting.UserRequest.perform(UserRequest.java:48)
	at hudson.remoting.Request$2.run(Request.java:326)
	at hudson.remoting.InterceptingExecutorService$1.call(InterceptingExecutorService.java:72)
	at java.util.concurrent.FutureTask$Sync.innerRun(FutureTask.java:334)
	at java.util.concurrent.FutureTask.run(FutureTask.java:166)
	at java.util.concurrent.ThreadPoolExecutor.runWorker(ThreadPoolExecutor.java:1145)
	at java.util.concurrent.ThreadPoolExecutor$Worker.run(ThreadPoolExecutor.java:615)
	at java.lang.Thread.run(Thread.java:722)
Sending e-mails to: notifications@accumulo.apache.org
channel stopped

Mime
View raw message