accumulo-notifications mailing list archives

Site index · List index
Message view « Date » · « Thread »
Top « Date » · « Thread »
From Apache Jenkins Server <jenk...@builds.apache.org>
Subject Build failed in Jenkins: Accumulo-1.4.x #310
Date Thu, 30 May 2013 15:10:18 GMT
See <https://builds.apache.org/job/Accumulo-1.4.x/310/changes>

Changes:

[kturner] ACCUMULO-1473 Fixed multiple bugs in FindOfflineTablets

------------------------------------------
[...truncated 2128 lines...]
 T E S T S
-------------------------------------------------------

[INFO] --- maven-surefire-plugin:2.9:test (default-test) @ accumulo-proxy ---
Running org.apache.accumulo.proxy.TestProxySecurityOperations
Tests run: 5, Failures: 0, Errors: 0, Skipped: 0, Time elapsed: 0.61 sec
Running org.apache.accumulo.proxy.TestProxyTableOperations
Tests run: 5, Failures: 0, Errors: 0, Skipped: 0, Time elapsed: 0.111 sec
Running org.apache.accumulo.proxy.SimpleTest
org.apache.thrift.protocol.TJSONProtocol$Factory
Tests run: 8, Failures: 0, Errors: 0, Skipped: 0, Time elapsed: 26.759 sec
Running org.apache.accumulo.proxy.TestProxyReadWrite
Tests run: 8, Failures: 0, Errors: 0, Skipped: 0, Time elapsed: 6.179 sec
Running org.apache.accumulo.proxy.TestProxyInstanceOperations
Tests run: 2, Failures: 0, Errors: 0, Skipped: 0, Time elapsed: 0.025 sec

Results :

Tests run: 28, Failures: 0, Errors: 0, Skipped: 0

[JENKINS] Recording test results
[INFO] 
[INFO] --- maven-jar-plugin:2.3.1:jar (default-jar) @ accumulo-proxy ---
[INFO] Building jar: <https://builds.apache.org/job/Accumulo-1.4.x/ws/1.4/lib/accumulo-proxy-1.4.4-SNAPSHOT.jar>
[INFO] 
[INFO] --- maven-site-plugin:3.0:attach-descriptor (attach-descriptor) @ accumulo-proxy ---
[INFO] 
[INFO] --- maven-enforcer-plugin:1.0.1:enforce (enforce-mvn) @ accumulo-proxy ---
[INFO] ****************************************************
*** thrift is not available
***   expecting 'thrift -version' to return 0.6
*** generated code will not be updated
****************************************************

[INFO] --- exec-maven-plugin:1.2:exec (generate-thrift) @ accumulo-proxy ---
[INFO] 
[INFO] --- maven-remote-resources-plugin:1.2.1:process (default) @ accumulo-proxy ---
[INFO] [debug] execute contextualize
[INFO] Using 'UTF-8' encoding to copy filtered resources.
[INFO] skip non existing resourceDirectory <https://builds.apache.org/job/Accumulo-1.4.x/ws/1.4/src/proxy/src/main/resources>
[INFO] Copying 3 resources
[INFO] Copying 3 resources

[INFO] --- maven-resources-plugin:2.5:resources (default-resources) @ accumulo-proxy ---
[INFO] [INFO] guava-13.0.1.jar already exists in destination.
[INFO] libthrift-0.6.1.jar already exists in destination.

[INFO] --- maven-dependency-plugin:2.1:copy-dependencies (copy-dependencies) @ accumulo-proxy
---
[INFO] [INFO] Nothing to compile - all classes are up to date

[INFO] --- maven-compiler-plugin:2.3.2:compile (default-compile) @ accumulo-proxy ---
[INFO] 
[INFO] --- cobertura-maven-plugin:2.5.2:instrument (default-cli) @ accumulo-proxy ---
[INFO] Cobertura 1.9.4.1 - GNU GPL License (NO WARRANTY) - See COPYRIGHT file
Instrumenting 492 files to <https://builds.apache.org/job/Accumulo-1.4.x/ws/1.4/src/proxy/target/generated-classes/cobertura>
[cobertura] WARN  [main] net.sourceforge.cobertura.instrument.ClassInstrumenter - No line
number information found for class org.apache.accumulo.proxy.thrift.AccumuloProxy$update_args.
 Perhaps you need to compile with debug=true?
[cobertura] WARN  [main] net.sourceforge.cobertura.instrument.ClassInstrumenter - No line
number information found for class org.apache.accumulo.proxy.thrift.AccumuloProxy$flush_args$_Fields.
 Perhaps you need to compile with debug=true?
[cobertura] WARN  [main] net.sourceforge.cobertura.instrument.ClassInstrumenter - No line
number information found for class org.apache.accumulo.proxy.thrift.AccumuloProxy$closeWriter_result.
 Perhaps you need to compile with debug=true?
[cobertura] WARN  [main] net.sourceforge.cobertura.instrument.ClassInstrumenter - No line
number information found for class org.apache.accumulo.proxy.thrift.AccumuloProxy$getFollowing_result.
 Perhaps you need to compile with debug=true?
[cobertura] WARN  [main] net.sourceforge.cobertura.instrument.ClassInstrumenter - No line
number information found for class org.apache.accumulo.proxy.thrift.AccumuloProxy$getRowRange_args.
 Perhaps you need to compile with debug=true?
[cobertura] WARN  [main] net.sourceforge.cobertura.instrument.ClassInstrumenter - No line
number information found for class org.apache.accumulo.proxy.thrift.AccumuloProxy$getFollowing_result$_Fields.
 Perhaps you need to compile with debug=true?
[cobertura] WARN  [main] net.sourceforge.cobertura.instrument.ClassInstrumenter - No line
number information found for class org.apache.accumulo.proxy.thrift.AccumuloProxy$createWriter_result.
 Perhaps you need to compile with debug=true?
[cobertura] WARN  [main] net.sourceforge.cobertura.instrument.ClassInstrumenter - No line
number information found for class org.apache.accumulo.proxy.thrift.AccumuloProxy$getRowRange_result.
 Perhaps you need to compile with debug=true?
[cobertura] WARN  [main] net.sourceforge.cobertura.instrument.ClassInstrumenter - No line
number information found for class org.apache.accumulo.proxy.thrift.AccumuloProxy$flush_result$_Fields.
 Perhaps you need to compile with debug=true?
[cobertura] WARN  [main] net.sourceforge.cobertura.instrument.ClassInstrumenter - No line
number information found for class org.apache.accumulo.proxy.thrift.AccumuloProxy$closeWriter_args$_Fields.
 Perhaps you need to compile with debug=true?
[cobertura] WARN  [main] net.sourceforge.cobertura.instrument.ClassInstrumenter - No line
number information found for class org.apache.accumulo.proxy.thrift.AccumuloProxy$createWriter_args.
 Perhaps you need to compile with debug=true?
[cobertura] WARN  [main] net.sourceforge.cobertura.instrument.ClassInstrumenter - No line
number information found for class org.apache.accumulo.proxy.thrift.AccumuloProxy$update_args$_Fields.
 Perhaps you need to compile with debug=true?
[cobertura] WARN  [main] net.sourceforge.cobertura.instrument.ClassInstrumenter - No line
number information found for class org.apache.accumulo.proxy.thrift.AccumuloProxy$getRowRange_args$_Fields.
 Perhaps you need to compile with debug=true?
[cobertura] WARN  [main] net.sourceforge.cobertura.instrument.ClassInstrumenter - No line
number information found for class org.apache.accumulo.proxy.thrift.AccumuloProxy$closeWriter_args.
 Perhaps you need to compile with debug=true?
[cobertura] WARN  [main] net.sourceforge.cobertura.instrument.ClassInstrumenter - No line
number information found for class org.apache.accumulo.proxy.thrift.AccumuloProxy$closeWriter_result$_Fields.
 Perhaps you need to compile with debug=true?
[cobertura] WARN  [main] net.sourceforge.cobertura.instrument.ClassInstrumenter - No line
number information found for class org.apache.accumulo.proxy.thrift.AccumuloProxy$createWriter_result$_Fields.
 Perhaps you need to compile with debug=true?
[cobertura] WARN  [main] net.sourceforge.cobertura.instrument.ClassInstrumenter - No line
number information found for class org.apache.accumulo.proxy.thrift.AccumuloProxy$updateAndFlush_result$_Fields.
 Perhaps you need to compile with debug=true?
[cobertura] WARN  [main] net.sourceforge.cobertura.instrument.ClassInstrumenter - No line
number information found for class org.apache.accumulo.proxy.thrift.AccumuloProxy$flush_args.
 Perhaps you need to compile with debug=true?
[cobertura] WARN  [main] net.sourceforge.cobertura.instrument.ClassInstrumenter - No line
number information found for class org.apache.accumulo.proxy.thrift.AccumuloProxy$getFollowing_args$_Fields.
 Perhaps you need to compile with debug=true?
[cobertura] WARN  [main] net.sourceforge.cobertura.instrument.ClassInstrumenter - No line
number information found for class org.apache.accumulo.proxy.thrift.AccumuloProxy$createWriter_args$_Fields.
 Perhaps you need to compile with debug=true?
[cobertura] WARN  [main] net.sourceforge.cobertura.instrument.ClassInstrumenter - No line
number information found for class org.apache.accumulo.proxy.thrift.AccumuloProxy$flush_result.
 Perhaps you need to compile with debug=true?
[cobertura] WARN  [main] net.sourceforge.cobertura.instrument.ClassInstrumenter - No line
number information found for class org.apache.accumulo.proxy.thrift.AccumuloProxy$updateAndFlush_result.
 Perhaps you need to compile with debug=true?
[cobertura] WARN  [main] net.sourceforge.cobertura.instrument.ClassInstrumenter - No line
number information found for class org.apache.accumulo.proxy.thrift.AccumuloProxy$getFollowing_args.
 Perhaps you need to compile with debug=true?
[cobertura] WARN  [main] net.sourceforge.cobertura.instrument.ClassInstrumenter - No line
number information found for class org.apache.accumulo.proxy.thrift.AccumuloProxy$getRowRange_result$_Fields.
 Perhaps you need to compile with debug=true?
Cobertura: Saved information on 492 classes.
Instrument time: 2390ms

[INFO] Instrumentation was successful.
[INFO] NOT adding cobertura ser file to attached artifacts list.
[INFO] [debug] execute contextualize
[INFO] Using 'UTF-8' encoding to copy filtered resources.
[INFO] Copying 1 resource
[INFO] Copying 3 resources
[INFO] Copying 3 resources

[INFO] --- maven-resources-plugin:2.5:testResources (default-testResources) @ accumulo-proxy
---
[INFO] [INFO] Nothing to compile - all classes are up to date

[INFO] --- maven-compiler-plugin:2.3.2:testCompile (default-testCompile) @ accumulo-proxy
---
[INFO] Surefire report directory: <https://builds.apache.org/job/Accumulo-1.4.x/ws/1.4/src/proxy/target/surefire-reports>
[INFO] 
-------------------------------------------------------
 T E S T S
-------------------------------------------------------

[INFO] --- maven-surefire-plugin:2.9:test (default-test) @ accumulo-proxy ---
Running org.apache.accumulo.proxy.TestProxySecurityOperations
Tests run: 5, Failures: 0, Errors: 0, Skipped: 0, Time elapsed: 0.777 sec
Running org.apache.accumulo.proxy.TestProxyTableOperations
Tests run: 5, Failures: 0, Errors: 0, Skipped: 0, Time elapsed: 0.19 sec
Running org.apache.accumulo.proxy.SimpleTest
org.apache.thrift.protocol.TBinaryProtocol$Factory
Tests run: 8, Failures: 0, Errors: 0, Skipped: 0, Time elapsed: 27.816 sec
Running org.apache.accumulo.proxy.TestProxyReadWrite
Tests run: 8, Failures: 0, Errors: 0, Skipped: 0, Time elapsed: 15.807 sec
Running org.apache.accumulo.proxy.TestProxyInstanceOperations
Tests run: 2, Failures: 0, Errors: 0, Skipped: 0, Time elapsed: 0.026 sec
Flushing results...
Flushing results done
Cobertura: Loaded information on 492 classes.
Cobertura: Saved information on 492 classes.

Results :

Tests run: 28, Failures: 0, Errors: 0, Skipped: 0

[INFO] ------------------------------------------------------------------------
[INFO] Reactor Summary:
[INFO] 
[INFO] accumulo .......................................... SUCCESS [40.336s]
[INFO] cloudtrace ........................................ SUCCESS [19.669s]
[INFO] accumulo-start .................................... SUCCESS [42.712s]
[INFO] accumulo-core ..................................... SUCCESS [1:51.287s]
[INFO] accumulo-server ................................... SUCCESS [52.670s]
[INFO] accumulo-examples ................................. SUCCESS [1.695s]
[INFO] examples-simple ................................... SUCCESS [12.379s]
[INFO] accumulo-wikisearch ............................... SUCCESS [3.650s]
[INFO] wikisearch-ingest ................................. SUCCESS [12.062s]
[INFO] wikisearch-query .................................. SUCCESS [14.569s]
[INFO] wikisearch-query-war .............................. SUCCESS [3.870s]
[INFO] accumulo-minicluster .............................. SUCCESS [21.192s]
[INFO] Proxy ............................................. FAILURE [1:37.973s]
[INFO] ------------------------------------------------------------------------
[INFO] BUILD FAILURE
[INFO] ------------------------------------------------------------------------
[INFO] Total time: 7:19.867s
[INFO] Finished at: Thu May 30 15:09:19 UTC 2013
[INFO] Final Memory: 119M/303M
[INFO] ------------------------------------------------------------------------
[JENKINS] Archiving <https://builds.apache.org/job/Accumulo-1.4.x/ws/1.4/src/examples/wikisearch/ingest/pom.xml>
to /home/hudson/hudson/jobs/Accumulo-1.4.x/modules/org.apache.accumulo$wikisearch-ingest/builds/2013-05-30_15-01-45/archive/org.apache.accumulo/wikisearch-ingest/1.4.4-SNAPSHOT/wikisearch-ingest-1.4.4-SNAPSHOT.pom
[JENKINS] Archiving <https://builds.apache.org/job/Accumulo-1.4.x/ws/1.4/src/examples/wikisearch/ingest/lib/wikisearch-ingest-1.4.4-SNAPSHOT.jar>
to /home/hudson/hudson/jobs/Accumulo-1.4.x/modules/org.apache.accumulo$wikisearch-ingest/builds/2013-05-30_15-01-45/archive/org.apache.accumulo/wikisearch-ingest/1.4.4-SNAPSHOT/wikisearch-ingest-1.4.4-SNAPSHOT.jar
[JENKINS] Archiving <https://builds.apache.org/job/Accumulo-1.4.x/ws/1.4/src/server/pom.xml>
to /home/hudson/hudson/jobs/Accumulo-1.4.x/modules/org.apache.accumulo$accumulo-server/builds/2013-05-30_15-01-43/archive/org.apache.accumulo/accumulo-server/1.4.4-SNAPSHOT/accumulo-server-1.4.4-SNAPSHOT.pom
[JENKINS] Archiving <https://builds.apache.org/job/Accumulo-1.4.x/ws/1.4/lib/accumulo-server-1.4.4-SNAPSHOT.jar>
to /home/hudson/hudson/jobs/Accumulo-1.4.x/modules/org.apache.accumulo$accumulo-server/builds/2013-05-30_15-01-43/archive/org.apache.accumulo/accumulo-server/1.4.4-SNAPSHOT/accumulo-server-1.4.4-SNAPSHOT.jar
[JENKINS] Archiving <https://builds.apache.org/job/Accumulo-1.4.x/ws/1.4/src/trace/pom.xml>
to /home/hudson/hudson/jobs/Accumulo-1.4.x/modules/org.apache.accumulo$cloudtrace/builds/2013-05-30_15-01-42/archive/org.apache.accumulo/cloudtrace/1.4.4-SNAPSHOT/cloudtrace-1.4.4-SNAPSHOT.pom
[JENKINS] Archiving <https://builds.apache.org/job/Accumulo-1.4.x/ws/1.4/lib/cloudtrace-1.4.4-SNAPSHOT.jar>
to /home/hudson/hudson/jobs/Accumulo-1.4.x/modules/org.apache.accumulo$cloudtrace/builds/2013-05-30_15-01-42/archive/org.apache.accumulo/cloudtrace/1.4.4-SNAPSHOT/cloudtrace-1.4.4-SNAPSHOT.jar
[JENKINS] Archiving <https://builds.apache.org/job/Accumulo-1.4.x/ws/1.4/src/minicluster/pom.xml>
to /home/hudson/hudson/jobs/Accumulo-1.4.x/modules/org.apache.accumulo$accumulo-minicluster/builds/2013-05-30_15-01-45/archive/org.apache.accumulo/accumulo-minicluster/1.4.4-SNAPSHOT/accumulo-minicluster-1.4.4-SNAPSHOT.pom
[JENKINS] Archiving <https://builds.apache.org/job/Accumulo-1.4.x/ws/1.4/lib/accumulo-minicluster-1.4.4-SNAPSHOT.jar>
to /home/hudson/hudson/jobs/Accumulo-1.4.x/modules/org.apache.accumulo$accumulo-minicluster/builds/2013-05-30_15-01-45/archive/org.apache.accumulo/accumulo-minicluster/1.4.4-SNAPSHOT/accumulo-minicluster-1.4.4-SNAPSHOT.jar
[JENKINS] Archiving <https://builds.apache.org/job/Accumulo-1.4.x/ws/1.4/src/proxy/pom.xml>
to /home/hudson/hudson/jobs/Accumulo-1.4.x/modules/org.apache.accumulo$accumulo-proxy/builds/2013-05-30_15-01-45/archive/org.apache.accumulo/accumulo-proxy/1.4.4-SNAPSHOT/accumulo-proxy-1.4.4-SNAPSHOT.pom
[JENKINS] Archiving <https://builds.apache.org/job/Accumulo-1.4.x/ws/1.4/lib/accumulo-proxy-1.4.4-SNAPSHOT.jar>
to /home/hudson/hudson/jobs/Accumulo-1.4.x/modules/org.apache.accumulo$accumulo-proxy/builds/2013-05-30_15-01-45/archive/org.apache.accumulo/accumulo-proxy/1.4.4-SNAPSHOT/accumulo-proxy-1.4.4-SNAPSHOT.jar
[JENKINS] Archiving <https://builds.apache.org/job/Accumulo-1.4.x/ws/1.4/src/examples/pom.xml>
to /home/hudson/hudson/jobs/Accumulo-1.4.x/modules/org.apache.accumulo$accumulo-examples/builds/2013-05-30_15-01-44/archive/org.apache.accumulo/accumulo-examples/1.4.4-SNAPSHOT/accumulo-examples-1.4.4-SNAPSHOT.pom
[JENKINS] Archiving <https://builds.apache.org/job/Accumulo-1.4.x/ws/1.4/src/examples/wikisearch/query/pom.xml>
to /home/hudson/hudson/jobs/Accumulo-1.4.x/modules/org.apache.accumulo$wikisearch-query/builds/2013-05-30_15-01-45/archive/org.apache.accumulo/wikisearch-query/1.4.4-SNAPSHOT/wikisearch-query-1.4.4-SNAPSHOT.pom
[JENKINS] Archiving <https://builds.apache.org/job/Accumulo-1.4.x/ws/1.4/src/examples/wikisearch/query/target/wikisearch-query-1.4.4-SNAPSHOT.jar>
to /home/hudson/hudson/jobs/Accumulo-1.4.x/modules/org.apache.accumulo$wikisearch-query/builds/2013-05-30_15-01-45/archive/org.apache.accumulo/wikisearch-query/1.4.4-SNAPSHOT/wikisearch-query-1.4.4-SNAPSHOT.jar
[JENKINS] Archiving <https://builds.apache.org/job/Accumulo-1.4.x/ws/1.4/src/examples/simple/pom.xml>
to /home/hudson/hudson/jobs/Accumulo-1.4.x/modules/org.apache.accumulo$examples-simple/builds/2013-05-30_15-01-44/archive/org.apache.accumulo/examples-simple/1.4.4-SNAPSHOT/examples-simple-1.4.4-SNAPSHOT.pom
[JENKINS] Archiving <https://builds.apache.org/job/Accumulo-1.4.x/ws/1.4/lib/examples-simple-1.4.4-SNAPSHOT.jar>
to /home/hudson/hudson/jobs/Accumulo-1.4.x/modules/org.apache.accumulo$examples-simple/builds/2013-05-30_15-01-44/archive/org.apache.accumulo/examples-simple/1.4.4-SNAPSHOT/examples-simple-1.4.4-SNAPSHOT.jar
[JENKINS] Archiving <https://builds.apache.org/job/Accumulo-1.4.x/ws/1.4/pom.xml> to
/home/hudson/hudson/jobs/Accumulo-1.4.x/modules/org.apache.accumulo$accumulo/builds/2013-05-30_15-01-42/archive/org.apache.accumulo/accumulo/1.4.4-SNAPSHOT/accumulo-1.4.4-SNAPSHOT.pom
[JENKINS] Archiving <https://builds.apache.org/job/Accumulo-1.4.x/ws/1.4/src/start/pom.xml>
to /home/hudson/hudson/jobs/Accumulo-1.4.x/modules/org.apache.accumulo$accumulo-start/builds/2013-05-30_15-01-44/archive/org.apache.accumulo/accumulo-start/1.4.4-SNAPSHOT/accumulo-start-1.4.4-SNAPSHOT.pom
[JENKINS] Archiving <https://builds.apache.org/job/Accumulo-1.4.x/ws/1.4/lib/accumulo-start-1.4.4-SNAPSHOT.jar>
to /home/hudson/hudson/jobs/Accumulo-1.4.x/modules/org.apache.accumulo$accumulo-start/builds/2013-05-30_15-01-44/archive/org.apache.accumulo/accumulo-start/1.4.4-SNAPSHOT/accumulo-start-1.4.4-SNAPSHOT.jar
[JENKINS] Archiving <https://builds.apache.org/job/Accumulo-1.4.x/ws/1.4/src/examples/wikisearch/pom.xml>
to /home/hudson/hudson/jobs/Accumulo-1.4.x/modules/org.apache.accumulo$accumulo-wikisearch/builds/2013-05-30_15-01-45/archive/org.apache.accumulo/accumulo-wikisearch/1.4.4-SNAPSHOT/accumulo-wikisearch-1.4.4-SNAPSHOT.pom
[JENKINS] Archiving <https://builds.apache.org/job/Accumulo-1.4.x/ws/1.4/src/examples/wikisearch/query-war/pom.xml>
to /home/hudson/hudson/jobs/Accumulo-1.4.x/modules/org.apache.accumulo$wikisearch-query-war/builds/2013-05-30_15-01-45/archive/org.apache.accumulo/wikisearch-query-war/1.4.4-SNAPSHOT/wikisearch-query-war-1.4.4-SNAPSHOT.pom
[JENKINS] Archiving <https://builds.apache.org/job/Accumulo-1.4.x/ws/1.4/src/examples/wikisearch/query-war/target/wikisearch-query-war-1.4.4-SNAPSHOT.war>
to /home/hudson/hudson/jobs/Accumulo-1.4.x/modules/org.apache.accumulo$wikisearch-query-war/builds/2013-05-30_15-01-45/archive/org.apache.accumulo/wikisearch-query-war/1.4.4-SNAPSHOT/wikisearch-query-war-1.4.4-SNAPSHOT.war
[JENKINS] Archiving <https://builds.apache.org/job/Accumulo-1.4.x/ws/1.4/src/core/pom.xml>
to /home/hudson/hudson/jobs/Accumulo-1.4.x/modules/org.apache.accumulo$accumulo-core/builds/2013-05-30_15-01-43/archive/org.apache.accumulo/accumulo-core/1.4.4-SNAPSHOT/accumulo-core-1.4.4-SNAPSHOT.pom
[JENKINS] Archiving <https://builds.apache.org/job/Accumulo-1.4.x/ws/1.4/lib/accumulo-core-1.4.4-SNAPSHOT.jar>
to /home/hudson/hudson/jobs/Accumulo-1.4.x/modules/org.apache.accumulo$accumulo-core/builds/2013-05-30_15-01-43/archive/org.apache.accumulo/accumulo-core/1.4.4-SNAPSHOT/accumulo-core-1.4.4-SNAPSHOT.jar
Waiting for Jenkins to finish collecting data
mavenExecutionResult exceptions not empty
message : Internal error: java.lang.reflect.UndeclaredThrowableException
cause : null
Stack trace : 
org.apache.maven.InternalErrorException: Internal error: java.lang.reflect.UndeclaredThrowableException
	at org.apache.maven.lifecycle.internal.BuilderCommon.handleBuildError(BuilderCommon.java:128)
	at org.apache.maven.lifecycle.internal.LifecycleModuleBuilder.buildProject(LifecycleModuleBuilder.java:95)
	at org.apache.maven.lifecycle.internal.LifecycleModuleBuilder.buildProject(LifecycleModuleBuilder.java:59)
	at org.apache.maven.lifecycle.internal.LifecycleStarter.singleThreadedBuild(LifecycleStarter.java:183)
	at org.apache.maven.lifecycle.internal.LifecycleStarter.execute(LifecycleStarter.java:161)
	at org.apache.maven.DefaultMaven.doExecute(DefaultMaven.java:320)
	at org.apache.maven.DefaultMaven.execute(DefaultMaven.java:156)
	at org.jvnet.hudson.maven3.launcher.Maven3Launcher.main(Maven3Launcher.java:79)
	at sun.reflect.NativeMethodAccessorImpl.invoke0(Native Method)
	at sun.reflect.NativeMethodAccessorImpl.invoke(NativeMethodAccessorImpl.java:39)
	at sun.reflect.DelegatingMethodAccessorImpl.invoke(DelegatingMethodAccessorImpl.java:25)
	at java.lang.reflect.Method.invoke(Method.java:597)
	at org.codehaus.plexus.classworlds.launcher.Launcher.launchStandard(Launcher.java:329)
	at org.codehaus.plexus.classworlds.launcher.Launcher.launch(Launcher.java:239)
	at org.jvnet.hudson.maven3.agent.Maven3Main.launch(Maven3Main.java:158)
	at hudson.maven.Maven3Builder.call(Maven3Builder.java:100)
	at hudson.maven.Maven3Builder.call(Maven3Builder.java:66)
	at hudson.remoting.UserRequest.perform(UserRequest.java:118)
	at hudson.remoting.UserRequest.perform(UserRequest.java:48)
	at hudson.remoting.Request$2.run(Request.java:326)
	at hudson.remoting.InterceptingExecutorService$1.call(InterceptingExecutorService.java:72)
	at java.util.concurrent.FutureTask$Sync.innerRun(FutureTask.java:303)
	at java.util.concurrent.FutureTask.run(FutureTask.java:138)
	at java.util.concurrent.ThreadPoolExecutor$Worker.runTask(ThreadPoolExecutor.java:895)
	at java.util.concurrent.ThreadPoolExecutor$Worker.run(ThreadPoolExecutor.java:918)
	at java.lang.Thread.run(Thread.java:662)
Caused by: java.lang.reflect.UndeclaredThrowableException
	at com.sun.proxy.$Proxy2.setExecutedMojos(Unknown Source)
	at hudson.maven.MavenBuildProxy$Filter.setExecutedMojos(MavenBuildProxy.java:243)
	at hudson.maven.Maven3Builder$MavenExecutionListener.recordMojoEnded(Maven3Builder.java:439)
	at hudson.maven.Maven3Builder$MavenExecutionListener.mojoSucceeded(Maven3Builder.java:425)
	at org.apache.maven.lifecycle.internal.DefaultExecutionEventCatapult.fire(DefaultExecutionEventCatapult.java:87)
	at org.apache.maven.lifecycle.internal.DefaultExecutionEventCatapult.fire(DefaultExecutionEventCatapult.java:42)
	at org.apache.maven.lifecycle.internal.MojoExecutor.execute(MojoExecutor.java:228)
	at org.apache.maven.lifecycle.internal.MojoExecutor.execute(MojoExecutor.java:153)
	at org.apache.maven.lifecycle.internal.MojoExecutor.execute(MojoExecutor.java:145)
	at org.apache.maven.lifecycle.internal.MojoExecutor.executeForkedExecutions(MojoExecutor.java:365)
	at org.apache.maven.lifecycle.internal.MojoExecutor.execute(MojoExecutor.java:199)
	at org.apache.maven.lifecycle.internal.MojoExecutor.execute(MojoExecutor.java:153)
	at org.apache.maven.lifecycle.internal.MojoExecutor.execute(MojoExecutor.java:145)
	at org.apache.maven.lifecycle.internal.LifecycleModuleBuilder.buildProject(LifecycleModuleBuilder.java:84)
	... 24 more
Caused by: java.io.StreamCorruptedException: invalid handle value: 007E0098
	at java.io.ObjectInputStream.readHandle(ObjectInputStream.java:1451)
	at java.io.ObjectInputStream.readClassDesc(ObjectInputStream.java:1508)
	at java.io.ObjectInputStream.readOrdinaryObject(ObjectInputStream.java:1750)
	at java.io.ObjectInputStream.readObject0(ObjectInputStream.java:1347)
	at java.io.ObjectInputStream.readArray(ObjectInputStream.java:1685)
	at java.io.ObjectInputStream.readObject0(ObjectInputStream.java:1341)
	at java.io.ObjectInputStream.defaultReadFields(ObjectInputStream.java:1970)
	at java.io.ObjectInputStream.defaultReadObject(ObjectInputStream.java:498)
	at java.lang.Throwable.readObject(Throwable.java:913)
	at sun.reflect.GeneratedMethodAccessor121.invoke(Unknown Source)
	at sun.reflect.DelegatingMethodAccessorImpl.invoke(DelegatingMethodAccessorImpl.java:43)
	at java.lang.reflect.Method.invoke(Method.java:601)
	at java.io.ObjectStreamClass.invokeReadObject(ObjectStreamClass.java:1004)
	at java.io.ObjectInputStream.readSerialData(ObjectInputStream.java:1872)
	at java.io.ObjectInputStream.readOrdinaryObject(ObjectInputStream.java:1777)
	at java.io.ObjectInputStream.readObject0(ObjectInputStream.java:1347)
	at java.io.ObjectInputStream.defaultReadFields(ObjectInputStream.java:1970)
	at java.io.ObjectInputStream.readSerialData(ObjectInputStream.java:1894)
	at java.io.ObjectInputStream.readOrdinaryObject(ObjectInputStream.java:1777)
	at java.io.ObjectInputStream.readObject0(ObjectInputStream.java:1347)
	at java.io.ObjectInputStream.readObject(ObjectInputStream.java:369)
	at hudson.remoting.UserRequest.deserialize(UserRequest.java:182)
	at hudson.remoting.UserRequest.perform(UserRequest.java:98)
	at hudson.remoting.UserRequest.perform(UserRequest.java:48)
	at hudson.remoting.Request$2.run(Request.java:326)
	at hudson.remoting.InterceptingExecutorService$1.call(InterceptingExecutorService.java:72)
	at java.util.concurrent.FutureTask$Sync.innerRun(FutureTask.java:334)
	at java.util.concurrent.FutureTask.run(FutureTask.java:166)
	at java.util.concurrent.ThreadPoolExecutor.runWorker(ThreadPoolExecutor.java:1145)
	at java.util.concurrent.ThreadPoolExecutor$Worker.run(ThreadPoolExecutor.java:615)
	at java.lang.Thread.run(Thread.java:722)
Sending e-mails to: notifications@accumulo.apache.org
channel stopped

Mime
View raw message