accumulo-notifications mailing list archives

Site index · List index
Message view « Date » · « Thread »
Top « Date » · « Thread »
From Apache Jenkins Server <jenk...@builds.apache.org>
Subject Build failed in Jenkins: Accumulo-1.5 #125
Date Sun, 19 May 2013 02:18:53 GMT
See <https://builds.apache.org/job/Accumulo-1.5/125/changes>

Changes:

[ctubbsii] ACCUMULO-1404,ACCUMULO-1423 include missing files in binary tarball; fix some permissions

------------------------------------------
[...truncated 2448 lines...]
Running org.apache.accumulo.core.client.mock.MockTableOperationsTest
Tests run: 6, Failures: 0, Errors: 0, Skipped: 0, Time elapsed: 0.173 sec
Running org.apache.accumulo.core.client.mapred.AccumuloOutputFormatTest
Tests run: 2, Failures: 0, Errors: 0, Skipped: 0, Time elapsed: 4.197 sec
Running org.apache.accumulo.core.client.mapred.AccumuloFileOutputFormatTest
Tests run: 4, Failures: 0, Errors: 0, Skipped: 0, Time elapsed: 12.164 sec
Running org.apache.accumulo.core.client.mapred.AccumuloRowInputFormatTest
Tests run: 1, Failures: 0, Errors: 0, Skipped: 0, Time elapsed: 4.029 sec
Running org.apache.accumulo.core.client.mapred.AccumuloInputFormatTest
Tests run: 6, Failures: 0, Errors: 0, Skipped: 0, Time elapsed: 4.087 sec
Running org.apache.accumulo.core.client.ClientSideIteratorTest
Tests run: 2, Failures: 0, Errors: 0, Skipped: 0, Time elapsed: 0.083 sec
Running org.apache.accumulo.core.client.mapreduce.AccumuloOutputFormatTest
Tests run: 2, Failures: 0, Errors: 0, Skipped: 0, Time elapsed: 3.979 sec
Running org.apache.accumulo.core.client.mapreduce.AccumuloFileOutputFormatTest
Tests run: 4, Failures: 0, Errors: 0, Skipped: 0, Time elapsed: 12.103 sec
Running org.apache.accumulo.core.client.mapreduce.AccumuloRowInputFormatTest
Tests run: 1, Failures: 0, Errors: 0, Skipped: 0, Time elapsed: 4.022 sec
Running org.apache.accumulo.core.client.mapreduce.AccumuloInputFormatTest
Tests run: 9, Failures: 0, Errors: 0, Skipped: 0, Time elapsed: 4.072 sec
Running org.apache.accumulo.core.client.mapreduce.lib.partition.RangePartitionerTest
Tests run: 2, Failures: 0, Errors: 0, Skipped: 0, Time elapsed: 0.344 sec
Running org.apache.accumulo.core.client.RowIteratorTest
Tests run: 2, Failures: 0, Errors: 0, Skipped: 0, Time elapsed: 0 sec
Running org.apache.accumulo.core.security.VisibilityEvaluatorTest
Tests run: 4, Failures: 0, Errors: 0, Skipped: 0, Time elapsed: 0.005 sec
Running org.apache.accumulo.core.security.ColumnVisibilityTest
Tests run: 12, Failures: 0, Errors: 0, Skipped: 0, Time elapsed: 0.005 sec
Running org.apache.accumulo.core.security.AuthorizationsTest
Tests run: 2, Failures: 0, Errors: 0, Skipped: 0, Time elapsed: 0.001 sec
Running org.apache.accumulo.core.data.MutationTest
Tests run: 13, Failures: 0, Errors: 0, Skipped: 0, Time elapsed: 0.059 sec
Running org.apache.accumulo.core.data.KeyExtentTest
Tests run: 3, Failures: 0, Errors: 0, Skipped: 0, Time elapsed: 0.005 sec
Running org.apache.accumulo.core.data.KeyTest
Tests run: 5, Failures: 0, Errors: 0, Skipped: 0, Time elapsed: 0.002 sec
Running org.apache.accumulo.core.data.ColumnTest
Tests run: 3, Failures: 0, Errors: 0, Skipped: 0, Time elapsed: 0.001 sec
Running org.apache.accumulo.core.data.RangeTest
Tests run: 43, Failures: 0, Errors: 0, Skipped: 0, Time elapsed: 0.019 sec
Running org.apache.accumulo.core.conf.PropertyTest
Tests run: 3, Failures: 0, Errors: 0, Skipped: 0, Time elapsed: 0.001 sec
Running org.apache.accumulo.core.file.rfile.RelativeKeyTest
Tests run: 6, Failures: 0, Errors: 0, Skipped: 0, Time elapsed: 0.034 sec
Running org.apache.accumulo.core.file.rfile.MultiLevelIndexTest
Tests run: 1, Failures: 0, Errors: 0, Skipped: 0, Time elapsed: 0.917 sec
Running org.apache.accumulo.core.file.rfile.BlockIndexTest
Tests run: 2, Failures: 0, Errors: 0, Skipped: 0, Time elapsed: 0.056 sec
Running org.apache.accumulo.core.file.rfile.RFileTest
Tests run: 21, Failures: 0, Errors: 0, Skipped: 0, Time elapsed: 2.809 sec
Running org.apache.accumulo.core.file.blockfile.cache.TestCachedBlockQueue
Tests run: 2, Failures: 0, Errors: 0, Skipped: 0, Time elapsed: 0.002 sec
Running org.apache.accumulo.core.file.blockfile.cache.TestLruBlockCache
Tests run: 7, Failures: 0, Errors: 0, Skipped: 0, Time elapsed: 1.028 sec
Running org.apache.accumulo.core.iterators.IterUtilTest
Tests run: 5, Failures: 0, Errors: 0, Skipped: 0, Time elapsed: 0.064 sec
Running org.apache.accumulo.core.iterators.aggregation.NumSummationTest
Tests run: 5, Failures: 0, Errors: 0, Skipped: 0, Time elapsed: 0.002 sec
Running org.apache.accumulo.core.iterators.aggregation.conf.AggregatorConfigurationTest
Tests run: 2, Failures: 0, Errors: 0, Skipped: 0, Time elapsed: 0.005 sec
Running org.apache.accumulo.core.iterators.user.RowDeletingIteratorTest
Tests run: 4, Failures: 0, Errors: 0, Skipped: 0, Time elapsed: 0.003 sec
Running org.apache.accumulo.core.iterators.user.IndexedDocIteratorTest
Tests run: 5, Failures: 0, Errors: 0, Skipped: 0, Time elapsed: 0.623 sec
Running org.apache.accumulo.core.iterators.user.CombinerTest
Tests run: 14, Failures: 0, Errors: 0, Skipped: 0, Time elapsed: 0.01 sec
Running org.apache.accumulo.core.iterators.user.FilterTest
Tests run: 11, Failures: 0, Errors: 0, Skipped: 0, Time elapsed: 0.101 sec
Running org.apache.accumulo.core.iterators.user.GrepIteratorTest
Tests run: 1, Failures: 0, Errors: 0, Skipped: 0, Time elapsed: 0.001 sec
Running org.apache.accumulo.core.iterators.user.IntersectingIteratorTest
Tests run: 6, Failures: 0, Errors: 0, Skipped: 0, Time elapsed: 0.741 sec
Running org.apache.accumulo.core.iterators.user.RegExFilterTest
Tests run: 1, Failures: 0, Errors: 0, Skipped: 0, Time elapsed: 0.002 sec
Running org.apache.accumulo.core.iterators.user.VisibilityFilterTest
Tests run: 9, Failures: 0, Errors: 0, Skipped: 0, Time elapsed: 0.065 sec
Running org.apache.accumulo.core.iterators.user.VersioningIteratorTest
Tests run: 6, Failures: 0, Errors: 0, Skipped: 0, Time elapsed: 0.004 sec
Running org.apache.accumulo.core.iterators.user.WholeRowIteratorTest
Tests run: 3, Failures: 0, Errors: 0, Skipped: 0, Time elapsed: 0.002 sec
Running org.apache.accumulo.core.iterators.user.RowFilterTest
Tests run: 1, Failures: 0, Errors: 0, Skipped: 0, Time elapsed: 0.006 sec
Running org.apache.accumulo.core.iterators.user.LargeRowFilterTest
Tests run: 5, Failures: 0, Errors: 0, Skipped: 0, Time elapsed: 0.062 sec
Running org.apache.accumulo.core.iterators.user.TransformingIteratorTest
Tests run: 16, Failures: 0, Errors: 0, Skipped: 0, Time elapsed: 0.068 sec
Running org.apache.accumulo.core.iterators.FirstEntryInRowIteratorTest
Tests run: 1, Failures: 0, Errors: 0, Skipped: 0, Time elapsed: 0 sec
Running org.apache.accumulo.core.iterators.FirstEntryInRowTest
Tests run: 2, Failures: 0, Errors: 0, Skipped: 0, Time elapsed: 0.016 sec
Running org.apache.accumulo.core.iterators.system.MultiIteratorTest
Tests run: 7, Failures: 0, Errors: 0, Skipped: 0, Time elapsed: 0.159 sec
Running org.apache.accumulo.core.iterators.system.ColumnFamilySkippingIteratorTest
Tests run: 3, Failures: 0, Errors: 0, Skipped: 0, Time elapsed: 0.702 sec
Running org.apache.accumulo.core.iterators.system.ColumnFilterTest
Tests run: 3, Failures: 0, Errors: 0, Skipped: 0, Time elapsed: 0 sec
Running org.apache.accumulo.core.iterators.system.VisibilityFilterTest
Tests run: 1, Failures: 0, Errors: 0, Skipped: 0, Time elapsed: 0.001 sec
Running org.apache.accumulo.core.iterators.system.TimeSettingIteratorTest
Tests run: 1, Failures: 0, Errors: 0, Skipped: 0, Time elapsed: 0.001 sec
Running org.apache.accumulo.core.iterators.system.DeletingIteratorTest
Tests run: 4, Failures: 0, Errors: 0, Skipped: 0, Time elapsed: 0.001 sec
Running org.apache.accumulo.core.iterators.system.SourceSwitchingIteratorTest
Tests run: 5, Failures: 0, Errors: 0, Skipped: 0, Time elapsed: 0.002 sec
Running org.apache.accumulo.core.iterators.AggregatingIteratorTest
Tests run: 7, Failures: 0, Errors: 0, Skipped: 0, Time elapsed: 0.004 sec
Running org.apache.accumulo.core.util.LocalityGroupUtilTest
Tests run: 2, Failures: 0, Errors: 0, Skipped: 0, Time elapsed: 0.004 sec
Running org.apache.accumulo.core.util.TextUtilTest
Tests run: 1, Failures: 0, Errors: 0, Skipped: 0, Time elapsed: 0 sec
Running org.apache.accumulo.core.util.AddressUtilTest
Tests run: 2, Failures: 0, Errors: 0, Skipped: 0, Time elapsed: 0.003 sec
Running org.apache.accumulo.core.util.TestVersion
Tests run: 1, Failures: 0, Errors: 0, Skipped: 0, Time elapsed: 0 sec
Running org.apache.accumulo.core.util.shell.ShellTest
Tests run: 10, Failures: 0, Errors: 0, Skipped: 0, Time elapsed: 0.15 sec
Running org.apache.accumulo.core.util.shell.command.FormatterCommandTest
Tests run: 1, Failures: 0, Errors: 0, Skipped: 0, Time elapsed: 0.011 sec
Running org.apache.accumulo.core.util.shell.TableDiskUsageTest
Tests run: 1, Failures: 0, Errors: 0, Skipped: 0, Time elapsed: 0 sec
Running org.apache.accumulo.core.util.MetadataTableTest
Tests run: 1, Failures: 0, Errors: 0, Skipped: 0, Time elapsed: 0.002 sec
Running org.apache.accumulo.core.util.MergeTest
Tests run: 1, Failures: 0, Errors: 0, Skipped: 0, Time elapsed: 0.003 sec
Running org.apache.accumulo.core.util.TestStringUtil
Tests run: 1, Failures: 0, Errors: 0, Skipped: 0, Time elapsed: 0 sec
Running org.apache.accumulo.core.cli.TestClientOpts
Tests run: 1, Failures: 0, Errors: 0, Skipped: 0, Time elapsed: 0.039 sec

Results :

Tests run: 363, Failures: 0, Errors: 0, Skipped: 0

[INFO] ------------------------------------------------------------------------
[INFO] Reactor Summary:
[INFO] 
[INFO] Apache Accumulo Project ........................... SUCCESS [25.543s]
[INFO] Trace ............................................. SUCCESS [7.423s]
[INFO] Fate .............................................. SUCCESS [2.826s]
[INFO] Start ............................................. SUCCESS [35.146s]
[INFO] Core .............................................. FAILURE [1:10.116s]
[INFO] Server ............................................ SKIPPED
[INFO] Examples .......................................... SKIPPED
[INFO] Simple Examples ................................... SKIPPED
[INFO] Testing ........................................... SKIPPED
[INFO] Proxy ............................................. SKIPPED
[INFO] Assemblies ........................................ SKIPPED
[INFO] ------------------------------------------------------------------------
[INFO] BUILD FAILURE
[INFO] ------------------------------------------------------------------------
[INFO] Total time: 2:24.078s
[INFO] Finished at: Sun May 19 02:18:22 UTC 2013
[INFO] Final Memory: 31M/187M
[INFO] ------------------------------------------------------------------------
[JENKINS] Archiving <https://builds.apache.org/job/Accumulo-1.5/ws/accumulo-1.5/pom.xml>
to /home/hudson/hudson/jobs/Accumulo-1.5/modules/org.apache.accumulo$accumulo-project/builds/2013-05-19_02-15-42/archive/org.apache.accumulo/accumulo-project/1.5.0-SNAPSHOT/accumulo-project-1.5.0-SNAPSHOT.pom
[JENKINS] Archiving <https://builds.apache.org/job/Accumulo-1.5/ws/accumulo-1.5/target/accumulo-project-1.5.0-SNAPSHOT-site.xml>
to /home/hudson/hudson/jobs/Accumulo-1.5/modules/org.apache.accumulo$accumulo-project/builds/2013-05-19_02-15-42/archive/org.apache.accumulo/accumulo-project/1.5.0-SNAPSHOT/accumulo-project-1.5.0-SNAPSHOT-site.xml
[JENKINS] Archiving <https://builds.apache.org/job/Accumulo-1.5/ws/accumulo-1.5/server/pom.xml>
to /home/hudson/hudson/jobs/Accumulo-1.5/modules/org.apache.accumulo$accumulo-server/builds/2013-05-19_02-15-43/archive/org.apache.accumulo/accumulo-server/1.5.0-SNAPSHOT/accumulo-server-1.5.0-SNAPSHOT.pom
[JENKINS] Archiving <https://builds.apache.org/job/Accumulo-1.5/ws/accumulo-1.5/examples/simple/pom.xml>
to /home/hudson/hudson/jobs/Accumulo-1.5/modules/org.apache.accumulo$accumulo-examples-simple/builds/2013-05-19_02-15-43/archive/org.apache.accumulo/accumulo-examples-simple/1.5.0-SNAPSHOT/accumulo-examples-simple-1.5.0-SNAPSHOT.pom
[JENKINS] Archiving <https://builds.apache.org/job/Accumulo-1.5/ws/accumulo-1.5/proxy/pom.xml>
to /home/hudson/hudson/jobs/Accumulo-1.5/modules/org.apache.accumulo$accumulo-proxy/builds/2013-05-19_02-15-44/archive/org.apache.accumulo/accumulo-proxy/1.5.0-SNAPSHOT/accumulo-proxy-1.5.0-SNAPSHOT.pom
[JENKINS] Archiving <https://builds.apache.org/job/Accumulo-1.5/ws/accumulo-1.5/examples/pom.xml>
to /home/hudson/hudson/jobs/Accumulo-1.5/modules/org.apache.accumulo$accumulo-examples/builds/2013-05-19_02-15-43/archive/org.apache.accumulo/accumulo-examples/1.5.0-SNAPSHOT/accumulo-examples-1.5.0-SNAPSHOT.pom
[JENKINS] Archiving <https://builds.apache.org/job/Accumulo-1.5/ws/accumulo-1.5/assemble/pom.xml>
to /home/hudson/hudson/jobs/Accumulo-1.5/modules/org.apache.accumulo$accumulo/builds/2013-05-19_02-15-44/archive/org.apache.accumulo/accumulo/1.5.0-SNAPSHOT/accumulo-1.5.0-SNAPSHOT.pom
[JENKINS] Archiving <https://builds.apache.org/job/Accumulo-1.5/ws/accumulo-1.5/test/pom.xml>
to /home/hudson/hudson/jobs/Accumulo-1.5/modules/org.apache.accumulo$accumulo-test/builds/2013-05-19_02-15-44/archive/org.apache.accumulo/accumulo-test/1.5.0-SNAPSHOT/accumulo-test-1.5.0-SNAPSHOT.pom
[JENKINS] Archiving <https://builds.apache.org/job/Accumulo-1.5/ws/accumulo-1.5/start/pom.xml>
to /home/hudson/hudson/jobs/Accumulo-1.5/modules/org.apache.accumulo$accumulo-start/builds/2013-05-19_02-15-43/archive/org.apache.accumulo/accumulo-start/1.5.0-SNAPSHOT/accumulo-start-1.5.0-SNAPSHOT.pom
[JENKINS] Archiving <https://builds.apache.org/job/Accumulo-1.5/ws/accumulo-1.5/start/target/accumulo-start-1.5.0-SNAPSHOT.jar>
to /home/hudson/hudson/jobs/Accumulo-1.5/modules/org.apache.accumulo$accumulo-start/builds/2013-05-19_02-15-43/archive/org.apache.accumulo/accumulo-start/1.5.0-SNAPSHOT/accumulo-start-1.5.0-SNAPSHOT.jar
[JENKINS] Archiving <https://builds.apache.org/job/Accumulo-1.5/ws/accumulo-1.5/fate/pom.xml>
to /home/hudson/hudson/jobs/Accumulo-1.5/modules/org.apache.accumulo$accumulo-fate/builds/2013-05-19_02-15-43/archive/org.apache.accumulo/accumulo-fate/1.5.0-SNAPSHOT/accumulo-fate-1.5.0-SNAPSHOT.pom
[JENKINS] Archiving <https://builds.apache.org/job/Accumulo-1.5/ws/accumulo-1.5/fate/target/accumulo-fate-1.5.0-SNAPSHOT.jar>
to /home/hudson/hudson/jobs/Accumulo-1.5/modules/org.apache.accumulo$accumulo-fate/builds/2013-05-19_02-15-43/archive/org.apache.accumulo/accumulo-fate/1.5.0-SNAPSHOT/accumulo-fate-1.5.0-SNAPSHOT.jar
[JENKINS] Archiving <https://builds.apache.org/job/Accumulo-1.5/ws/accumulo-1.5/core/pom.xml>
to /home/hudson/hudson/jobs/Accumulo-1.5/modules/org.apache.accumulo$accumulo-core/builds/2013-05-19_02-15-43/archive/org.apache.accumulo/accumulo-core/1.5.0-SNAPSHOT/accumulo-core-1.5.0-SNAPSHOT.pom
[JENKINS] Archiving <https://builds.apache.org/job/Accumulo-1.5/ws/accumulo-1.5/trace/pom.xml>
to /home/hudson/hudson/jobs/Accumulo-1.5/modules/org.apache.accumulo$accumulo-trace/builds/2013-05-19_02-15-42/archive/org.apache.accumulo/accumulo-trace/1.5.0-SNAPSHOT/accumulo-trace-1.5.0-SNAPSHOT.pom
[JENKINS] Archiving <https://builds.apache.org/job/Accumulo-1.5/ws/accumulo-1.5/trace/target/accumulo-trace-1.5.0-SNAPSHOT.jar>
to /home/hudson/hudson/jobs/Accumulo-1.5/modules/org.apache.accumulo$accumulo-trace/builds/2013-05-19_02-15-42/archive/org.apache.accumulo/accumulo-trace/1.5.0-SNAPSHOT/accumulo-trace-1.5.0-SNAPSHOT.jar
Waiting for Jenkins to finish collecting data
mavenExecutionResult exceptions not empty
message : Internal error: java.lang.reflect.UndeclaredThrowableException
cause : null
Stack trace : 
org.apache.maven.InternalErrorException: Internal error: java.lang.reflect.UndeclaredThrowableException
	at org.apache.maven.lifecycle.internal.BuilderCommon.handleBuildError(BuilderCommon.java:128)
	at org.apache.maven.lifecycle.internal.LifecycleModuleBuilder.buildProject(LifecycleModuleBuilder.java:95)
	at org.apache.maven.lifecycle.internal.LifecycleModuleBuilder.buildProject(LifecycleModuleBuilder.java:59)
	at org.apache.maven.lifecycle.internal.LifecycleStarter.singleThreadedBuild(LifecycleStarter.java:183)
	at org.apache.maven.lifecycle.internal.LifecycleStarter.execute(LifecycleStarter.java:161)
	at org.apache.maven.DefaultMaven.doExecute(DefaultMaven.java:320)
	at org.apache.maven.DefaultMaven.execute(DefaultMaven.java:156)
	at org.jvnet.hudson.maven3.launcher.Maven3Launcher.main(Maven3Launcher.java:79)
	at sun.reflect.NativeMethodAccessorImpl.invoke0(Native Method)
	at sun.reflect.NativeMethodAccessorImpl.invoke(NativeMethodAccessorImpl.java:39)
	at sun.reflect.DelegatingMethodAccessorImpl.invoke(DelegatingMethodAccessorImpl.java:25)
	at java.lang.reflect.Method.invoke(Method.java:597)
	at org.codehaus.plexus.classworlds.launcher.Launcher.launchStandard(Launcher.java:329)
	at org.codehaus.plexus.classworlds.launcher.Launcher.launch(Launcher.java:239)
	at org.jvnet.hudson.maven3.agent.Maven3Main.launch(Maven3Main.java:158)
	at hudson.maven.Maven3Builder.call(Maven3Builder.java:100)
	at hudson.maven.Maven3Builder.call(Maven3Builder.java:66)
	at hudson.remoting.UserRequest.perform(UserRequest.java:118)
	at hudson.remoting.UserRequest.perform(UserRequest.java:48)
	at hudson.remoting.Request$2.run(Request.java:326)
	at hudson.remoting.InterceptingExecutorService$1.call(InterceptingExecutorService.java:72)
	at java.util.concurrent.FutureTask$Sync.innerRun(FutureTask.java:303)
	at java.util.concurrent.FutureTask.run(FutureTask.java:138)
	at java.util.concurrent.ThreadPoolExecutor$Worker.runTask(ThreadPoolExecutor.java:895)
	at java.util.concurrent.ThreadPoolExecutor$Worker.run(ThreadPoolExecutor.java:918)
	at java.lang.Thread.run(Thread.java:662)
Caused by: java.lang.reflect.UndeclaredThrowableException
	at com.sun.proxy.$Proxy2.setExecutedMojos(Unknown Source)
	at hudson.maven.MavenBuildProxy$Filter.setExecutedMojos(MavenBuildProxy.java:243)
	at hudson.maven.Maven3Builder$MavenExecutionListener.recordMojoEnded(Maven3Builder.java:439)
	at hudson.maven.Maven3Builder$MavenExecutionListener.mojoSucceeded(Maven3Builder.java:425)
	at org.apache.maven.lifecycle.internal.DefaultExecutionEventCatapult.fire(DefaultExecutionEventCatapult.java:87)
	at org.apache.maven.lifecycle.internal.DefaultExecutionEventCatapult.fire(DefaultExecutionEventCatapult.java:42)
	at org.apache.maven.lifecycle.internal.MojoExecutor.execute(MojoExecutor.java:228)
	at org.apache.maven.lifecycle.internal.MojoExecutor.execute(MojoExecutor.java:153)
	at org.apache.maven.lifecycle.internal.MojoExecutor.execute(MojoExecutor.java:145)
	at org.apache.maven.lifecycle.internal.LifecycleModuleBuilder.buildProject(LifecycleModuleBuilder.java:84)
	... 24 more
Caused by: java.io.StreamCorruptedException: invalid type code: 05
	at java.io.ObjectInputStream.readObject0(ObjectInputStream.java:1374)
	at java.io.ObjectInputStream.defaultReadFields(ObjectInputStream.java:1970)
	at java.io.ObjectInputStream.readSerialData(ObjectInputStream.java:1894)
	at java.io.ObjectInputStream.readOrdinaryObject(ObjectInputStream.java:1777)
	at java.io.ObjectInputStream.readObject0(ObjectInputStream.java:1347)
	at java.io.ObjectInputStream.readObject(ObjectInputStream.java:369)
	at java.util.concurrent.CopyOnWriteArrayList.readObject(CopyOnWriteArrayList.java:879)
	at sun.reflect.GeneratedMethodAccessor7878.invoke(Unknown Source)
	at sun.reflect.DelegatingMethodAccessorImpl.invoke(DelegatingMethodAccessorImpl.java:43)
	at java.lang.reflect.Method.invoke(Method.java:601)
	at java.io.ObjectStreamClass.invokeReadObject(ObjectStreamClass.java:1004)
	at java.io.ObjectInputStream.readSerialData(ObjectInputStream.java:1872)
	at java.io.ObjectInputStream.readOrdinaryObject(ObjectInputStream.java:1777)
	at java.io.ObjectInputStream.readObject0(ObjectInputStream.java:1347)
	at java.io.ObjectInputStream.readArray(ObjectInputStream.java:1685)
	at java.io.ObjectInputStream.readObject0(ObjectInputStream.java:1341)
	at java.io.ObjectInputStream.defaultReadFields(ObjectInputStream.java:1970)
	at java.io.ObjectInputStream.readSerialData(ObjectInputStream.java:1894)
	at java.io.ObjectInputStream.readOrdinaryObject(ObjectInputStream.java:1777)
	at java.io.ObjectInputStream.readObject0(ObjectInputStream.java:1347)
	at java.io.ObjectInputStream.readObject(ObjectInputStream.java:369)
	at hudson.remoting.UserRequest.deserialize(UserRequest.java:182)
	at hudson.remoting.UserRequest.perform(UserRequest.java:98)
	at hudson.remoting.UserRequest.perform(UserRequest.java:48)
	at hudson.remoting.Request$2.run(Request.java:326)
	at hudson.remoting.InterceptingExecutorService$1.call(InterceptingExecutorService.java:72)
	at java.util.concurrent.FutureTask$Sync.innerRun(FutureTask.java:334)
	at java.util.concurrent.FutureTask.run(FutureTask.java:166)
	at java.util.concurrent.ThreadPoolExecutor.runWorker(ThreadPoolExecutor.java:1145)
	at java.util.concurrent.ThreadPoolExecutor$Worker.run(ThreadPoolExecutor.java:615)
	at java.lang.Thread.run(Thread.java:722)
Sending e-mails to: notifications@accumulo.apache.org
channel stopped
Updating ACCUMULO-1423
Updating ACCUMULO-1404

Mime
View raw message