accumulo-notifications mailing list archives

Site index · List index
Message view « Date » · « Thread »
Top « Date » · « Thread »
From Apache Jenkins Server <jenk...@builds.apache.org>
Subject Build failed in Jenkins: Accumulo-1.5 #84
Date Thu, 18 Apr 2013 07:52:15 GMT
See <https://builds.apache.org/job/Accumulo-1.5/84/changes>

Changes:

[elserj] ACCUMULO-1317 Remove the '*' mask from user's input of the Accumulo root username

------------------------------------------
[...truncated 3217 lines...]
	at sun.reflect.NativeMethodAccessorImpl.invoke(NativeMethodAccessorImpl.java:39)
	at sun.reflect.DelegatingMethodAccessorImpl.invoke(DelegatingMethodAccessorImpl.java:25)
	at java.lang.reflect.Method.invoke(Method.java:597)
	at org.junit.runners.model.FrameworkMethod$1.runReflectiveCall(FrameworkMethod.java:47)
	at org.junit.internal.runners.model.ReflectiveCallable.run(ReflectiveCallable.java:12)
	at org.junit.runners.model.FrameworkMethod.invokeExplosively(FrameworkMethod.java:44)
	at org.junit.internal.runners.statements.InvokeMethod.evaluate(InvokeMethod.java:17)
	at org.junit.internal.runners.statements.FailOnTimeout$StatementThread.run(FailOnTimeout.java:74)

merge(org.apache.accumulo.test.ShellServerTest)  Time elapsed: 0.117 sec  <<< FAILURE!
java.lang.AssertionError: expected:<12> but was:<0>
	at org.junit.Assert.fail(Assert.java:88)
	at org.junit.Assert.failNotEquals(Assert.java:743)
	at org.junit.Assert.assertEquals(Assert.java:118)
	at org.junit.Assert.assertEquals(Assert.java:555)
	at org.junit.Assert.assertEquals(Assert.java:542)
	at org.apache.accumulo.test.ShellServerTest.assertGoodExit(ShellServerTest.java:114)
	at org.apache.accumulo.test.ShellServerTest.exec(ShellServerTest.java:106)
	at org.apache.accumulo.test.ShellServerTest.merge(ShellServerTest.java:624)
	at sun.reflect.NativeMethodAccessorImpl.invoke0(Native Method)
	at sun.reflect.NativeMethodAccessorImpl.invoke(NativeMethodAccessorImpl.java:39)
	at sun.reflect.DelegatingMethodAccessorImpl.invoke(DelegatingMethodAccessorImpl.java:25)
	at java.lang.reflect.Method.invoke(Method.java:597)
	at org.junit.runners.model.FrameworkMethod$1.runReflectiveCall(FrameworkMethod.java:47)
	at org.junit.internal.runners.model.ReflectiveCallable.run(ReflectiveCallable.java:12)
	at org.junit.runners.model.FrameworkMethod.invokeExplosively(FrameworkMethod.java:44)
	at org.junit.internal.runners.statements.InvokeMethod.evaluate(InvokeMethod.java:17)
	at org.junit.internal.runners.statements.FailOnTimeout$StatementThread.run(FailOnTimeout.java:74)

sleep(org.apache.accumulo.test.ShellServerTest)  Time elapsed: 0.204 sec  <<< FAILURE!
java.lang.AssertionError: expected:<12> but was:<0>
	at org.junit.Assert.fail(Assert.java:88)
	at org.junit.Assert.failNotEquals(Assert.java:743)
	at org.junit.Assert.assertEquals(Assert.java:118)
	at org.junit.Assert.assertEquals(Assert.java:555)
	at org.junit.Assert.assertEquals(Assert.java:542)
	at org.apache.accumulo.test.ShellServerTest.assertGoodExit(ShellServerTest.java:114)
	at org.apache.accumulo.test.ShellServerTest.exec(ShellServerTest.java:93)
	at org.apache.accumulo.test.ShellServerTest.sleep(ShellServerTest.java:349)
	at sun.reflect.NativeMethodAccessorImpl.invoke0(Native Method)
	at sun.reflect.NativeMethodAccessorImpl.invoke(NativeMethodAccessorImpl.java:39)
	at sun.reflect.DelegatingMethodAccessorImpl.invoke(DelegatingMethodAccessorImpl.java:25)
	at java.lang.reflect.Method.invoke(Method.java:597)
	at org.junit.runners.model.FrameworkMethod$1.runReflectiveCall(FrameworkMethod.java:47)
	at org.junit.internal.runners.model.ReflectiveCallable.run(ReflectiveCallable.java:12)
	at org.junit.runners.model.FrameworkMethod.invokeExplosively(FrameworkMethod.java:44)
	at org.junit.internal.runners.statements.InvokeMethod.evaluate(InvokeMethod.java:17)
	at org.junit.internal.runners.statements.FailOnTimeout$StatementThread.run(FailOnTimeout.java:74)

trace(org.apache.accumulo.test.ShellServerTest)  Time elapsed: 0.008 sec  <<< FAILURE!
java.lang.AssertionError: expected:<12> but was:<0>
	at org.junit.Assert.fail(Assert.java:88)
	at org.junit.Assert.failNotEquals(Assert.java:743)
	at org.junit.Assert.assertEquals(Assert.java:118)
	at org.junit.Assert.assertEquals(Assert.java:555)
	at org.junit.Assert.assertEquals(Assert.java:542)
	at org.apache.accumulo.test.ShellServerTest.assertGoodExit(ShellServerTest.java:114)
	at org.apache.accumulo.test.ShellServerTest.exec(ShellServerTest.java:93)
	at org.apache.accumulo.test.ShellServerTest.trace(ShellServerTest.java:703)
	at sun.reflect.NativeMethodAccessorImpl.invoke0(Native Method)
	at sun.reflect.NativeMethodAccessorImpl.invoke(NativeMethodAccessorImpl.java:39)
	at sun.reflect.DelegatingMethodAccessorImpl.invoke(DelegatingMethodAccessorImpl.java:25)
	at java.lang.reflect.Method.invoke(Method.java:597)
	at org.junit.runners.model.FrameworkMethod$1.runReflectiveCall(FrameworkMethod.java:47)
	at org.junit.internal.runners.model.ReflectiveCallable.run(ReflectiveCallable.java:12)
	at org.junit.runners.model.FrameworkMethod.invokeExplosively(FrameworkMethod.java:44)
	at org.junit.internal.runners.statements.InvokeMethod.evaluate(InvokeMethod.java:17)
	at org.junit.internal.runners.statements.FailOnTimeout$StatementThread.run(FailOnTimeout.java:74)

setscaniterDeletescaniter(org.apache.accumulo.test.ShellServerTest)  Time elapsed: 0.081 sec
 <<< FAILURE!
java.lang.AssertionError: expected:<13> but was:<0>
	at org.junit.Assert.fail(Assert.java:88)
	at org.junit.Assert.failNotEquals(Assert.java:743)
	at org.junit.Assert.assertEquals(Assert.java:118)
	at org.junit.Assert.assertEquals(Assert.java:555)
	at org.junit.Assert.assertEquals(Assert.java:542)
	at org.apache.accumulo.test.ShellServerTest.assertGoodExit(ShellServerTest.java:114)
	at org.apache.accumulo.test.ShellServerTest.exec(ShellServerTest.java:93)
	at org.apache.accumulo.test.ShellServerTest.setscaniterDeletescaniter(ShellServerTest.java:206)
	at sun.reflect.NativeMethodAccessorImpl.invoke0(Native Method)
	at sun.reflect.NativeMethodAccessorImpl.invoke(NativeMethodAccessorImpl.java:39)
	at sun.reflect.DelegatingMethodAccessorImpl.invoke(DelegatingMethodAccessorImpl.java:25)
	at java.lang.reflect.Method.invoke(Method.java:597)
	at org.junit.runners.model.FrameworkMethod$1.runReflectiveCall(FrameworkMethod.java:47)
	at org.junit.internal.runners.model.ReflectiveCallable.run(ReflectiveCallable.java:12)
	at org.junit.runners.model.FrameworkMethod.invokeExplosively(FrameworkMethod.java:44)
	at org.junit.internal.runners.statements.InvokeMethod.evaluate(InvokeMethod.java:17)
	at org.junit.internal.runners.statements.FailOnTimeout$StatementThread.run(FailOnTimeout.java:74)

clearCls(org.apache.accumulo.test.ShellServerTest)  Time elapsed: 0.003 sec  <<<
FAILURE!
java.lang.AssertionError: expected:<13> but was:<0>
	at org.junit.Assert.fail(Assert.java:88)
	at org.junit.Assert.failNotEquals(Assert.java:743)
	at org.junit.Assert.assertEquals(Assert.java:118)
	at org.junit.Assert.assertEquals(Assert.java:555)
	at org.junit.Assert.assertEquals(Assert.java:542)
	at org.apache.accumulo.test.ShellServerTest.assertGoodExit(ShellServerTest.java:114)
	at org.apache.accumulo.test.ShellServerTest.exec(ShellServerTest.java:106)
	at org.apache.accumulo.test.ShellServerTest.exec(ShellServerTest.java:100)
	at org.apache.accumulo.test.ShellServerTest.clearCls(ShellServerTest.java:389)
	at sun.reflect.NativeMethodAccessorImpl.invoke0(Native Method)
	at sun.reflect.NativeMethodAccessorImpl.invoke(NativeMethodAccessorImpl.java:39)
	at sun.reflect.DelegatingMethodAccessorImpl.invoke(DelegatingMethodAccessorImpl.java:25)
	at java.lang.reflect.Method.invoke(Method.java:597)
	at org.junit.runners.model.FrameworkMethod$1.runReflectiveCall(FrameworkMethod.java:47)
	at org.junit.internal.runners.model.ReflectiveCallable.run(ReflectiveCallable.java:12)
	at org.junit.runners.model.FrameworkMethod.invokeExplosively(FrameworkMethod.java:44)
	at org.junit.internal.runners.statements.InvokeMethod.evaluate(InvokeMethod.java:17)
	at org.junit.internal.runners.statements.FailOnTimeout$StatementThread.run(FailOnTimeout.java:74)

deletemany(org.apache.accumulo.test.ShellServerTest)  Time elapsed: 0.097 sec  <<<
FAILURE!
java.lang.AssertionError: expected:<10> but was:<1>
	at org.junit.Assert.fail(Assert.java:88)
	at org.junit.Assert.failNotEquals(Assert.java:743)
	at org.junit.Assert.assertEquals(Assert.java:118)
	at org.junit.Assert.assertEquals(Assert.java:555)
	at org.junit.Assert.assertEquals(Assert.java:542)
	at org.apache.accumulo.test.ShellServerTest.deletemany(ShellServerTest.java:454)
	at sun.reflect.NativeMethodAccessorImpl.invoke0(Native Method)
	at sun.reflect.NativeMethodAccessorImpl.invoke(NativeMethodAccessorImpl.java:39)
	at sun.reflect.DelegatingMethodAccessorImpl.invoke(DelegatingMethodAccessorImpl.java:25)
	at java.lang.reflect.Method.invoke(Method.java:597)
	at org.junit.runners.model.FrameworkMethod$1.runReflectiveCall(FrameworkMethod.java:47)
	at org.junit.internal.runners.model.ReflectiveCallable.run(ReflectiveCallable.java:12)
	at org.junit.runners.model.FrameworkMethod.invokeExplosively(FrameworkMethod.java:44)
	at org.junit.internal.runners.statements.InvokeMethod.evaluate(InvokeMethod.java:17)
	at org.junit.internal.runners.statements.FailOnTimeout$StatementThread.run(FailOnTimeout.java:74)

deleterows(org.apache.accumulo.test.ShellServerTest)  Time elapsed: 0.288 sec  <<<
FAILURE!
java.lang.AssertionError
	at org.junit.Assert.fail(Assert.java:86)
	at org.junit.Assert.assertTrue(Assert.java:41)
	at org.junit.Assert.assertTrue(Assert.java:52)
	at org.apache.accumulo.test.ShellServerTest.deleterows(ShellServerTest.java:484)
	at sun.reflect.NativeMethodAccessorImpl.invoke0(Native Method)
	at sun.reflect.NativeMethodAccessorImpl.invoke(NativeMethodAccessorImpl.java:39)
	at sun.reflect.DelegatingMethodAccessorImpl.invoke(DelegatingMethodAccessorImpl.java:25)
	at java.lang.reflect.Method.invoke(Method.java:597)
	at org.junit.runners.model.FrameworkMethod$1.runReflectiveCall(FrameworkMethod.java:47)
	at org.junit.internal.runners.model.ReflectiveCallable.run(ReflectiveCallable.java:12)
	at org.junit.runners.model.FrameworkMethod.invokeExplosively(FrameworkMethod.java:44)
	at org.junit.internal.runners.statements.InvokeMethod.evaluate(InvokeMethod.java:17)
	at org.junit.internal.runners.statements.FailOnTimeout$StatementThread.run(FailOnTimeout.java:74)

execfile(org.apache.accumulo.test.ShellServerTest)  Time elapsed: 0.03 sec  <<< FAILURE!
java.lang.AssertionError: expected:<18> but was:<0>
	at org.junit.Assert.fail(Assert.java:88)
	at org.junit.Assert.failNotEquals(Assert.java:743)
	at org.junit.Assert.assertEquals(Assert.java:118)
	at org.junit.Assert.assertEquals(Assert.java:555)
	at org.junit.Assert.assertEquals(Assert.java:542)
	at org.apache.accumulo.test.ShellServerTest.assertGoodExit(ShellServerTest.java:114)
	at org.apache.accumulo.test.ShellServerTest.exec(ShellServerTest.java:106)
	at org.apache.accumulo.test.ShellServerTest.execfile(ShellServerTest.java:221)
	at sun.reflect.NativeMethodAccessorImpl.invoke0(Native Method)
	at sun.reflect.NativeMethodAccessorImpl.invoke(NativeMethodAccessorImpl.java:39)
	at sun.reflect.DelegatingMethodAccessorImpl.invoke(DelegatingMethodAccessorImpl.java:25)
	at java.lang.reflect.Method.invoke(Method.java:597)
	at org.junit.runners.model.FrameworkMethod$1.runReflectiveCall(FrameworkMethod.java:47)
	at org.junit.internal.runners.model.ReflectiveCallable.run(ReflectiveCallable.java:12)
	at org.junit.runners.model.FrameworkMethod.invokeExplosively(FrameworkMethod.java:44)
	at org.junit.internal.runners.statements.InvokeMethod.evaluate(InvokeMethod.java:17)
	at org.junit.internal.runners.statements.FailOnTimeout$StatementThread.run(FailOnTimeout.java:74)

clonetable(org.apache.accumulo.test.ShellServerTest)  Time elapsed: 2.081 sec  <<<
FAILURE!
java.lang.AssertionError: expected:<18> but was:<0>
	at org.junit.Assert.fail(Assert.java:88)
	at org.junit.Assert.failNotEquals(Assert.java:743)
	at org.junit.Assert.assertEquals(Assert.java:118)
	at org.junit.Assert.assertEquals(Assert.java:555)
	at org.junit.Assert.assertEquals(Assert.java:542)
	at org.apache.accumulo.test.ShellServerTest.assertGoodExit(ShellServerTest.java:114)
	at org.apache.accumulo.test.ShellServerTest.exec(ShellServerTest.java:93)
	at org.apache.accumulo.test.ShellServerTest.clonetable(ShellServerTest.java:397)
	at sun.reflect.NativeMethodAccessorImpl.invoke0(Native Method)
	at sun.reflect.NativeMethodAccessorImpl.invoke(NativeMethodAccessorImpl.java:39)
	at sun.reflect.DelegatingMethodAccessorImpl.invoke(DelegatingMethodAccessorImpl.java:25)
	at java.lang.reflect.Method.invoke(Method.java:597)
	at org.junit.runners.model.FrameworkMethod$1.runReflectiveCall(FrameworkMethod.java:47)
	at org.junit.internal.runners.model.ReflectiveCallable.run(ReflectiveCallable.java:12)
	at org.junit.runners.model.FrameworkMethod.invokeExplosively(FrameworkMethod.java:44)
	at org.junit.internal.runners.statements.InvokeMethod.evaluate(InvokeMethod.java:17)
	at org.junit.internal.runners.statements.FailOnTimeout$StatementThread.run(FailOnTimeout.java:74)

notable(org.apache.accumulo.test.ShellServerTest)  Time elapsed: 0.002 sec  <<< FAILURE!
java.lang.AssertionError: expected:<19> but was:<0>
	at org.junit.Assert.fail(Assert.java:88)
	at org.junit.Assert.failNotEquals(Assert.java:743)
	at org.junit.Assert.assertEquals(Assert.java:118)
	at org.junit.Assert.assertEquals(Assert.java:555)
	at org.junit.Assert.assertEquals(Assert.java:542)
	at org.apache.accumulo.test.ShellServerTest.assertGoodExit(ShellServerTest.java:114)
	at org.apache.accumulo.test.ShellServerTest.exec(ShellServerTest.java:93)
	at org.apache.accumulo.test.ShellServerTest.notable(ShellServerTest.java:336)
	at sun.reflect.NativeMethodAccessorImpl.invoke0(Native Method)
	at sun.reflect.NativeMethodAccessorImpl.invoke(NativeMethodAccessorImpl.java:39)
	at sun.reflect.DelegatingMethodAccessorImpl.invoke(DelegatingMethodAccessorImpl.java:25)
	at java.lang.reflect.Method.invoke(Method.java:597)
	at org.junit.runners.model.FrameworkMethod$1.runReflectiveCall(FrameworkMethod.java:47)
	at org.junit.internal.runners.model.ReflectiveCallable.run(ReflectiveCallable.java:12)
	at org.junit.runners.model.FrameworkMethod.invokeExplosively(FrameworkMethod.java:44)
	at org.junit.internal.runners.statements.InvokeMethod.evaluate(InvokeMethod.java:17)
	at org.junit.internal.runners.statements.FailOnTimeout$StatementThread.run(FailOnTimeout.java:74)

Running org.apache.accumulo.test.TestAccumuloSplitRecovery
Tests run: 1, Failures: 0, Errors: 0, Skipped: 0, Time elapsed: 17.868 sec
Running org.apache.accumulo.fate.zookeeper.ZooLockTest
Tests run: 6, Failures: 0, Errors: 0, Skipped: 0, Time elapsed: 5.615 sec

Results :

Failed tests:   interpreter(org.apache.accumulo.test.ShellServerTest): HexScan present in
root@miniInstance t> interpreter -l(..)
  exporttableImporttable(org.apache.accumulo.test.ShellServerTest): expected:<1> but
was:<0>
  groups(org.apache.accumulo.test.ShellServerTest): expected:<2> but was:<0>
  addauths(org.apache.accumulo.test.ShellServerTest): expected:<2> but was:<0>
  listscans(org.apache.accumulo.test.ShellServerTest): expected:<3> but was:<0>
  maxrow(org.apache.accumulo.test.ShellServerTest): expected:<4> but was:<0>
  importDirectory(org.apache.accumulo.test.ShellServerTest): expected:<5> but was:<0>
  constraint(org.apache.accumulo.test.ShellServerTest): expected:<5> but was:<0>
  renametable(org.apache.accumulo.test.ShellServerTest): expected:<6> but was:<0>
  listcompactions(org.apache.accumulo.test.ShellServerTest): expected:<7> but was:<0>
  classpath(org.apache.accumulo.test.ShellServerTest): expected:<7> but was:<0>
  du(org.apache.accumulo.test.ShellServerTest): expected:<8> but was:<0>
  grep(org.apache.accumulo.test.ShellServerTest): expected:<9> but was:<0>
  help(org.apache.accumulo.test.ShellServerTest): expected:<9> but was:<0>
  info(org.apache.accumulo.test.ShellServerTest): expected:<9> but was:<0>
  iter(org.apache.accumulo.test.ShellServerTest): expected:<10> but was:<0>
  ping(org.apache.accumulo.test.ShellServerTest): expected:<10> but was:<0>
  user(org.apache.accumulo.test.ShellServerTest): expected:<10> but was:<0>
  debug(org.apache.accumulo.test.ShellServerTest): expected:<10> but was:<0>
  egrep(org.apache.accumulo.test.ShellServerTest): expected:<11> but was:<0>
  merge(org.apache.accumulo.test.ShellServerTest): expected:<12> but was:<0>
  sleep(org.apache.accumulo.test.ShellServerTest): expected:<12> but was:<0>
  trace(org.apache.accumulo.test.ShellServerTest): expected:<12> but was:<0>
  setscaniterDeletescaniter(org.apache.accumulo.test.ShellServerTest): expected:<13>
but was:<0>
  clearCls(org.apache.accumulo.test.ShellServerTest): expected:<13> but was:<0>
  deletemany(org.apache.accumulo.test.ShellServerTest): expected:<10> but was:<1>
  deleterows(org.apache.accumulo.test.ShellServerTest)
  execfile(org.apache.accumulo.test.ShellServerTest): expected:<18> but was:<0>
  clonetable(org.apache.accumulo.test.ShellServerTest): expected:<18> but was:<0>
  notable(org.apache.accumulo.test.ShellServerTest): expected:<19> but was:<0>

Tests run: 47, Failures: 30, Errors: 0, Skipped: 0

[ERROR] There are test failures.

Please refer to <https://builds.apache.org/job/Accumulo-1.5/ws/accumulo-1.5/test/target/surefire-reports>
for the individual test results.
ERROR: Maven JVM terminated unexpectedly with exit code 143
Updating ACCUMULO-1317

Mime
View raw message