accumulo-notifications mailing list archives

Site index · List index
Message view « Date » · « Thread »
Top « Date » · « Thread »
From Apache Jenkins Server <jenk...@builds.apache.org>
Subject Build failed in Jenkins: Accumulo-1.4.x #296
Date Wed, 24 Apr 2013 07:37:26 GMT
See <https://builds.apache.org/job/Accumulo-1.4.x/296/changes>

Changes:

[kturner] ACCUMULO-1200 ACCUMULO-1305 shortened proxy property names and added option for
running against mini accumulo

------------------------------------------
[...truncated 652 lines...]
Tests run: 1, Failures: 0, Errors: 0, Skipped: 0, Time elapsed: 0.018 sec
Running org.apache.accumulo.core.client.mapreduce.AccumuloInputFormatTest
Tests run: 12, Failures: 0, Errors: 0, Skipped: 0, Time elapsed: 0.173 sec
Running org.apache.accumulo.core.client.mapreduce.lib.partition.RangePartitionerTest
Tests run: 2, Failures: 0, Errors: 0, Skipped: 0, Time elapsed: 0.356 sec
Running org.apache.accumulo.core.client.RowIteratorTest
Tests run: 2, Failures: 0, Errors: 0, Skipped: 0, Time elapsed: 0.001 sec
Running org.apache.accumulo.core.security.VisibilityEvaluatorTest
Tests run: 1, Failures: 0, Errors: 0, Skipped: 0, Time elapsed: 0.005 sec
Running org.apache.accumulo.core.security.ColumnVisibilityTest
Tests run: 10, Failures: 0, Errors: 0, Skipped: 0, Time elapsed: 0.007 sec
Running org.apache.accumulo.core.security.AuthorizationsTest
Tests run: 3, Failures: 0, Errors: 0, Skipped: 0, Time elapsed: 0.001 sec
Running org.apache.accumulo.core.data.MutationTest
Tests run: 8, Failures: 0, Errors: 0, Skipped: 0, Time elapsed: 0.045 sec
Running org.apache.accumulo.core.data.KeyExtentTest
Tests run: 3, Failures: 0, Errors: 0, Skipped: 0, Time elapsed: 0.012 sec
Running org.apache.accumulo.core.data.KeyTest
Tests run: 4, Failures: 0, Errors: 0, Skipped: 0, Time elapsed: 0.002 sec
Running org.apache.accumulo.core.data.ColumnTest
Tests run: 3, Failures: 0, Errors: 0, Skipped: 0, Time elapsed: 0.001 sec
Running org.apache.accumulo.core.data.RangeTest
Tests run: 43, Failures: 0, Errors: 0, Skipped: 0, Time elapsed: 0.037 sec
Running org.apache.accumulo.core.data.MapFileTest
13/04/24 07:35:51 INFO compress.CodecPool: Got brand-new decompressor
13/04/24 07:35:51 INFO compress.CodecPool: Got brand-new decompressor
13/04/24 07:35:51 INFO compress.CodecPool: Got brand-new decompressor
13/04/24 07:35:51 INFO compress.CodecPool: Got brand-new decompressor
Tests run: 3, Failures: 0, Errors: 0, Skipped: 0, Time elapsed: 1.565 sec
Running org.apache.accumulo.core.conf.PropertyTest
Tests run: 3, Failures: 0, Errors: 0, Skipped: 0, Time elapsed: 0.002 sec
Running org.apache.accumulo.core.file.rfile.MultiLevelIndexTest
13/04/24 07:35:52 INFO compress.CodecPool: Got brand-new decompressor
13/04/24 07:35:53 INFO compress.CodecPool: Got brand-new decompressor
13/04/24 07:35:54 INFO compress.CodecPool: Got brand-new decompressor
Tests run: 1, Failures: 0, Errors: 0, Skipped: 0, Time elapsed: 1.859 sec
Running org.apache.accumulo.core.file.rfile.RFileTest
Tests run: 19, Failures: 0, Errors: 0, Skipped: 0, Time elapsed: 16.109 sec
Running org.apache.accumulo.core.file.blockfile.cache.TestCachedBlockQueue
Tests run: 2, Failures: 0, Errors: 0, Skipped: 0, Time elapsed: 0.036 sec
Running org.apache.accumulo.core.file.blockfile.cache.TestLruBlockCache
Tests run: 7, Failures: 0, Errors: 0, Skipped: 0, Time elapsed: 1.042 sec
Running org.apache.accumulo.core.iterators.IterUtilTest
Tests run: 5, Failures: 0, Errors: 0, Skipped: 0, Time elapsed: 0.024 sec
Running org.apache.accumulo.core.iterators.aggregation.NumSummationTest
Tests run: 5, Failures: 0, Errors: 0, Skipped: 0, Time elapsed: 0.005 sec
Running org.apache.accumulo.core.iterators.aggregation.conf.AggregatorConfigurationTest
Tests run: 2, Failures: 0, Errors: 0, Skipped: 0, Time elapsed: 0.01 sec
Running org.apache.accumulo.core.iterators.filter.ColumnFilterTest
Tests run: 3, Failures: 0, Errors: 0, Skipped: 0, Time elapsed: 0.003 sec
Running org.apache.accumulo.core.iterators.RegExIteratorTest
Tests run: 2, Failures: 0, Errors: 0, Skipped: 0, Time elapsed: 0.009 sec
Running org.apache.accumulo.core.iterators.user.RowDeletingIteratorTest
Tests run: 4, Failures: 0, Errors: 0, Skipped: 0, Time elapsed: 0.007 sec
Running org.apache.accumulo.core.iterators.user.IndexedDocIteratorTest
Tests run: 5, Failures: 0, Errors: 0, Skipped: 0, Time elapsed: 3.03 sec
Running org.apache.accumulo.core.iterators.user.CombinerTest
Tests run: 14, Failures: 0, Errors: 0, Skipped: 0, Time elapsed: 0.019 sec
Running org.apache.accumulo.core.iterators.user.FilterTest
Tests run: 11, Failures: 0, Errors: 0, Skipped: 0, Time elapsed: 0.36 sec
Running org.apache.accumulo.core.iterators.user.GrepIteratorTest
Tests run: 1, Failures: 0, Errors: 0, Skipped: 0, Time elapsed: 0.002 sec
Running org.apache.accumulo.core.iterators.user.IntersectingIteratorTest
Tests run: 6, Failures: 0, Errors: 0, Skipped: 0, Time elapsed: 9.079 sec
Running org.apache.accumulo.core.iterators.user.RegExFilterTest
Tests run: 1, Failures: 0, Errors: 0, Skipped: 0, Time elapsed: 0.002 sec
Running org.apache.accumulo.core.iterators.user.VersioningIteratorTest
Tests run: 6, Failures: 0, Errors: 0, Skipped: 0, Time elapsed: 0.036 sec
Running org.apache.accumulo.core.iterators.user.WholeRowIteratorTest
Tests run: 3, Failures: 0, Errors: 0, Skipped: 0, Time elapsed: 0.005 sec
Running org.apache.accumulo.core.iterators.user.RowFilterTest
Tests run: 1, Failures: 0, Errors: 0, Skipped: 0, Time elapsed: 0.046 sec
Running org.apache.accumulo.core.iterators.user.LargeRowFilterTest
Tests run: 5, Failures: 0, Errors: 0, Skipped: 0, Time elapsed: 0.302 sec
Running org.apache.accumulo.core.iterators.FirstEntryInRowIteratorTest
Tests run: 1, Failures: 0, Errors: 0, Skipped: 0, Time elapsed: 0.003 sec
Running org.apache.accumulo.core.iterators.FilteringIteratorTest
Tests run: 6, Failures: 0, Errors: 0, Skipped: 0, Time elapsed: 0.243 sec
Running org.apache.accumulo.core.iterators.FirstEntryInRowTest
Tests run: 2, Failures: 0, Errors: 0, Skipped: 0, Time elapsed: 0.045 sec
Running org.apache.accumulo.core.iterators.system.MultiIteratorTest
Tests run: 7, Failures: 0, Errors: 0, Skipped: 0, Time elapsed: 0.511 sec
Running org.apache.accumulo.core.iterators.system.ColumnFamilySkippingIteratorTest
Tests run: 3, Failures: 0, Errors: 0, Skipped: 0, Time elapsed: 6.231 sec
Running org.apache.accumulo.core.iterators.system.ColumnFilterTest
Tests run: 3, Failures: 0, Errors: 0, Skipped: 0, Time elapsed: 0.001 sec
Running org.apache.accumulo.core.iterators.system.VisibilityFilterTest
Tests run: 1, Failures: 0, Errors: 0, Skipped: 0, Time elapsed: 0 sec
Running org.apache.accumulo.core.iterators.system.TimeSettingIteratorTest
Tests run: 1, Failures: 0, Errors: 0, Skipped: 0, Time elapsed: 0.001 sec
Running org.apache.accumulo.core.iterators.system.DeletingIteratorTest
Tests run: 4, Failures: 0, Errors: 0, Skipped: 0, Time elapsed: 0.003 sec
Running org.apache.accumulo.core.iterators.system.SourceSwitchingIteratorTest
Tests run: 5, Failures: 0, Errors: 0, Skipped: 0, Time elapsed: 0.004 sec
Running org.apache.accumulo.core.iterators.AggregatingIteratorTest
Tests run: 7, Failures: 0, Errors: 0, Skipped: 0, Time elapsed: 0.006 sec
Running org.apache.accumulo.core.util.EscapeTokenizerTest
Tests run: 11, Failures: 0, Errors: 0, Skipped: 0, Time elapsed: 0.002 sec
Running org.apache.accumulo.core.util.LocalityGroupUtilTest
Tests run: 2, Failures: 0, Errors: 0, Skipped: 0, Time elapsed: 0.008 sec
Running org.apache.accumulo.core.util.TextUtilTest
Tests run: 1, Failures: 0, Errors: 0, Skipped: 0, Time elapsed: 0 sec
Running org.apache.accumulo.core.util.AddressUtilTest
Tests run: 2, Failures: 0, Errors: 0, Skipped: 0, Time elapsed: 0.013 sec
Running org.apache.accumulo.core.util.TestVersion
Tests run: 1, Failures: 0, Errors: 0, Skipped: 0, Time elapsed: 0.002 sec
Running org.apache.accumulo.core.util.MetadataTableTest
Tests run: 1, Failures: 0, Errors: 0, Skipped: 0, Time elapsed: 0.002 sec
Running org.apache.accumulo.core.util.MergeTest
Tests run: 1, Failures: 0, Errors: 0, Skipped: 0, Time elapsed: 0.005 sec
Running org.apache.accumulo.core.util.TestStringUtil
Tests run: 1, Failures: 0, Errors: 0, Skipped: 0, Time elapsed: 0 sec
Flushing results...
Flushing results done
Cobertura: Loaded information on 1264 classes.
Cobertura: Saved information on 1264 classes.

Results :

Tests run: 303, Failures: 0, Errors: 0, Skipped: 0

[INFO] ------------------------------------------------------------------------
[INFO] Reactor Summary:
[INFO] 
[INFO] accumulo .......................................... SUCCESS [48.200s]
[INFO] cloudtrace ........................................ SUCCESS [21.345s]
[INFO] accumulo-start .................................... SUCCESS [43.016s]
[INFO] accumulo-core ..................................... FAILURE [1:43.534s]
[INFO] accumulo-server ................................... SKIPPED
[INFO] accumulo-examples ................................. SKIPPED
[INFO] examples-simple ................................... SKIPPED
[INFO] accumulo-wikisearch ............................... SKIPPED
[INFO] wikisearch-ingest ................................. SKIPPED
[INFO] wikisearch-query .................................. SKIPPED
[INFO] wikisearch-query-war .............................. SKIPPED
[INFO] accumulo-test ..................................... SKIPPED
[INFO] Proxy ............................................. SKIPPED
[INFO] ------------------------------------------------------------------------
[INFO] BUILD FAILURE
[INFO] ------------------------------------------------------------------------
[INFO] Total time: 3:41.816s
[INFO] Finished at: Wed Apr 24 07:36:33 UTC 2013
[INFO] Final Memory: 44M/180M
[INFO] ------------------------------------------------------------------------
[JENKINS] Archiving <https://builds.apache.org/job/Accumulo-1.4.x/ws/1.4/src/examples/wikisearch/ingest/pom.xml>
to /home/hudson/hudson/jobs/Accumulo-1.4.x/modules/org.apache.accumulo$wikisearch-ingest/builds/2013-04-24_07-32-35/archive/org.apache.accumulo/wikisearch-ingest/1.4.4-SNAPSHOT/wikisearch-ingest-1.4.4-SNAPSHOT.pom
[JENKINS] Archiving <https://builds.apache.org/job/Accumulo-1.4.x/ws/1.4/src/server/pom.xml>
to /home/hudson/hudson/jobs/Accumulo-1.4.x/modules/org.apache.accumulo$accumulo-server/builds/2013-04-24_07-32-35/archive/org.apache.accumulo/accumulo-server/1.4.4-SNAPSHOT/accumulo-server-1.4.4-SNAPSHOT.pom
[JENKINS] Archiving <https://builds.apache.org/job/Accumulo-1.4.x/ws/1.4/src/trace/pom.xml>
to /home/hudson/hudson/jobs/Accumulo-1.4.x/modules/org.apache.accumulo$cloudtrace/builds/2013-04-24_07-32-35/archive/org.apache.accumulo/cloudtrace/1.4.4-SNAPSHOT/cloudtrace-1.4.4-SNAPSHOT.pom
[JENKINS] Archiving <https://builds.apache.org/job/Accumulo-1.4.x/ws/1.4/lib/cloudtrace-1.4.4-SNAPSHOT.jar>
to /home/hudson/hudson/jobs/Accumulo-1.4.x/modules/org.apache.accumulo$cloudtrace/builds/2013-04-24_07-32-35/archive/org.apache.accumulo/cloudtrace/1.4.4-SNAPSHOT/cloudtrace-1.4.4-SNAPSHOT.jar
[JENKINS] Archiving <https://builds.apache.org/job/Accumulo-1.4.x/ws/1.4/src/proxy/pom.xml>
to /home/hudson/hudson/jobs/Accumulo-1.4.x/modules/org.apache.accumulo$accumulo-proxy/builds/2013-04-24_07-32-35/archive/org.apache.accumulo/accumulo-proxy/1.4.4-SNAPSHOT/accumulo-proxy-1.4.4-SNAPSHOT.pom
[JENKINS] Archiving <https://builds.apache.org/job/Accumulo-1.4.x/ws/1.4/src/examples/pom.xml>
to /home/hudson/hudson/jobs/Accumulo-1.4.x/modules/org.apache.accumulo$accumulo-examples/builds/2013-04-24_07-32-35/archive/org.apache.accumulo/accumulo-examples/1.4.4-SNAPSHOT/accumulo-examples-1.4.4-SNAPSHOT.pom
[JENKINS] Archiving <https://builds.apache.org/job/Accumulo-1.4.x/ws/1.4/src/examples/wikisearch/query/pom.xml>
to /home/hudson/hudson/jobs/Accumulo-1.4.x/modules/org.apache.accumulo$wikisearch-query/builds/2013-04-24_07-32-35/archive/org.apache.accumulo/wikisearch-query/1.4.4-SNAPSHOT/wikisearch-query-1.4.4-SNAPSHOT.pom
[JENKINS] Archiving <https://builds.apache.org/job/Accumulo-1.4.x/ws/1.4/src/examples/simple/pom.xml>
to /home/hudson/hudson/jobs/Accumulo-1.4.x/modules/org.apache.accumulo$examples-simple/builds/2013-04-24_07-32-35/archive/org.apache.accumulo/examples-simple/1.4.4-SNAPSHOT/examples-simple-1.4.4-SNAPSHOT.pom
[JENKINS] Archiving <https://builds.apache.org/job/Accumulo-1.4.x/ws/1.4/pom.xml> to
/home/hudson/hudson/jobs/Accumulo-1.4.x/modules/org.apache.accumulo$accumulo/builds/2013-04-24_07-32-35/archive/org.apache.accumulo/accumulo/1.4.4-SNAPSHOT/accumulo-1.4.4-SNAPSHOT.pom
[JENKINS] Archiving <https://builds.apache.org/job/Accumulo-1.4.x/ws/1.4/src/test/pom.xml>
to /home/hudson/hudson/jobs/Accumulo-1.4.x/modules/org.apache.accumulo$accumulo-test/builds/2013-04-24_07-32-35/archive/org.apache.accumulo/accumulo-test/1.4.4-SNAPSHOT/accumulo-test-1.4.4-SNAPSHOT.pom
[JENKINS] Archiving <https://builds.apache.org/job/Accumulo-1.4.x/ws/1.4/src/start/pom.xml>
to /home/hudson/hudson/jobs/Accumulo-1.4.x/modules/org.apache.accumulo$accumulo-start/builds/2013-04-24_07-32-35/archive/org.apache.accumulo/accumulo-start/1.4.4-SNAPSHOT/accumulo-start-1.4.4-SNAPSHOT.pom
[JENKINS] Archiving <https://builds.apache.org/job/Accumulo-1.4.x/ws/1.4/lib/accumulo-start-1.4.4-SNAPSHOT.jar>
to /home/hudson/hudson/jobs/Accumulo-1.4.x/modules/org.apache.accumulo$accumulo-start/builds/2013-04-24_07-32-35/archive/org.apache.accumulo/accumulo-start/1.4.4-SNAPSHOT/accumulo-start-1.4.4-SNAPSHOT.jar
[JENKINS] Archiving <https://builds.apache.org/job/Accumulo-1.4.x/ws/1.4/src/examples/wikisearch/pom.xml>
to /home/hudson/hudson/jobs/Accumulo-1.4.x/modules/org.apache.accumulo$accumulo-wikisearch/builds/2013-04-24_07-32-35/archive/org.apache.accumulo/accumulo-wikisearch/1.4.4-SNAPSHOT/accumulo-wikisearch-1.4.4-SNAPSHOT.pom
[JENKINS] Archiving <https://builds.apache.org/job/Accumulo-1.4.x/ws/1.4/src/examples/wikisearch/query-war/pom.xml>
to /home/hudson/hudson/jobs/Accumulo-1.4.x/modules/org.apache.accumulo$wikisearch-query-war/builds/2013-04-24_07-32-35/archive/org.apache.accumulo/wikisearch-query-war/1.4.4-SNAPSHOT/wikisearch-query-war-1.4.4-SNAPSHOT.pom
[JENKINS] Archiving <https://builds.apache.org/job/Accumulo-1.4.x/ws/1.4/src/core/pom.xml>
to /home/hudson/hudson/jobs/Accumulo-1.4.x/modules/org.apache.accumulo$accumulo-core/builds/2013-04-24_07-32-35/archive/org.apache.accumulo/accumulo-core/1.4.4-SNAPSHOT/accumulo-core-1.4.4-SNAPSHOT.pom
[JENKINS] Archiving <https://builds.apache.org/job/Accumulo-1.4.x/ws/1.4/lib/accumulo-core-1.4.4-SNAPSHOT.jar>
to /home/hudson/hudson/jobs/Accumulo-1.4.x/modules/org.apache.accumulo$accumulo-core/builds/2013-04-24_07-32-35/archive/org.apache.accumulo/accumulo-core/1.4.4-SNAPSHOT/accumulo-core-1.4.4-SNAPSHOT.jar
Waiting for Jenkins to finish collecting data
mavenExecutionResult exceptions not empty
message : Internal error: java.lang.reflect.UndeclaredThrowableException
cause : null
Stack trace : 
org.apache.maven.InternalErrorException: Internal error: java.lang.reflect.UndeclaredThrowableException
	at org.apache.maven.lifecycle.internal.BuilderCommon.handleBuildError(BuilderCommon.java:128)
	at org.apache.maven.lifecycle.internal.LifecycleModuleBuilder.buildProject(LifecycleModuleBuilder.java:95)
	at org.apache.maven.lifecycle.internal.LifecycleModuleBuilder.buildProject(LifecycleModuleBuilder.java:59)
	at org.apache.maven.lifecycle.internal.LifecycleStarter.singleThreadedBuild(LifecycleStarter.java:183)
	at org.apache.maven.lifecycle.internal.LifecycleStarter.execute(LifecycleStarter.java:161)
	at org.apache.maven.DefaultMaven.doExecute(DefaultMaven.java:320)
	at org.apache.maven.DefaultMaven.execute(DefaultMaven.java:156)
	at org.jvnet.hudson.maven3.launcher.Maven3Launcher.main(Maven3Launcher.java:79)
	at sun.reflect.NativeMethodAccessorImpl.invoke0(Native Method)
	at sun.reflect.NativeMethodAccessorImpl.invoke(NativeMethodAccessorImpl.java:39)
	at sun.reflect.DelegatingMethodAccessorImpl.invoke(DelegatingMethodAccessorImpl.java:25)
	at java.lang.reflect.Method.invoke(Method.java:597)
	at org.codehaus.plexus.classworlds.launcher.Launcher.launchStandard(Launcher.java:329)
	at org.codehaus.plexus.classworlds.launcher.Launcher.launch(Launcher.java:239)
	at org.jvnet.hudson.maven3.agent.Maven3Main.launch(Maven3Main.java:158)
	at hudson.maven.Maven3Builder.call(Maven3Builder.java:100)
	at hudson.maven.Maven3Builder.call(Maven3Builder.java:66)
	at hudson.remoting.UserRequest.perform(UserRequest.java:118)
	at hudson.remoting.UserRequest.perform(UserRequest.java:48)
	at hudson.remoting.Request$2.run(Request.java:326)
	at hudson.remoting.InterceptingExecutorService$1.call(InterceptingExecutorService.java:72)
	at java.util.concurrent.FutureTask$Sync.innerRun(FutureTask.java:303)
	at java.util.concurrent.FutureTask.run(FutureTask.java:138)
	at java.util.concurrent.ThreadPoolExecutor$Worker.runTask(ThreadPoolExecutor.java:886)
	at java.util.concurrent.ThreadPoolExecutor$Worker.run(ThreadPoolExecutor.java:908)
	at java.lang.Thread.run(Thread.java:662)
Caused by: java.lang.reflect.UndeclaredThrowableException
	at $Proxy2.setExecutedMojos(Unknown Source)
	at hudson.maven.MavenBuildProxy$Filter.setExecutedMojos(MavenBuildProxy.java:243)
	at hudson.maven.Maven3Builder$MavenExecutionListener.recordMojoEnded(Maven3Builder.java:439)
	at hudson.maven.Maven3Builder$MavenExecutionListener.mojoSucceeded(Maven3Builder.java:425)
	at org.apache.maven.lifecycle.internal.DefaultExecutionEventCatapult.fire(DefaultExecutionEventCatapult.java:87)
	at org.apache.maven.lifecycle.internal.DefaultExecutionEventCatapult.fire(DefaultExecutionEventCatapult.java:42)
	at org.apache.maven.lifecycle.internal.MojoExecutor.execute(MojoExecutor.java:228)
	at org.apache.maven.lifecycle.internal.MojoExecutor.execute(MojoExecutor.java:153)
	at org.apache.maven.lifecycle.internal.MojoExecutor.execute(MojoExecutor.java:145)
	at org.apache.maven.lifecycle.internal.MojoExecutor.executeForkedExecutions(MojoExecutor.java:365)
	at org.apache.maven.lifecycle.internal.MojoExecutor.execute(MojoExecutor.java:199)
	at org.apache.maven.lifecycle.internal.MojoExecutor.execute(MojoExecutor.java:153)
	at org.apache.maven.lifecycle.internal.MojoExecutor.execute(MojoExecutor.java:145)
	at org.apache.maven.lifecycle.internal.LifecycleModuleBuilder.buildProject(LifecycleModuleBuilder.java:84)
	... 24 more
Caused by: java.io.UTFDataFormatException
	at java.io.ObjectInputStream$BlockDataInputStream.readUTFSpan(ObjectInputStream.java:3105)
	at java.io.ObjectInputStream$BlockDataInputStream.readUTFBody(ObjectInputStream.java:3030)
	at java.io.ObjectInputStream$BlockDataInputStream.readUTF(ObjectInputStream.java:2843)
	at java.io.ObjectInputStream.readString(ObjectInputStream.java:1617)
	at java.io.ObjectInputStream.readObject0(ObjectInputStream.java:1338)
	at java.io.ObjectInputStream.defaultReadFields(ObjectInputStream.java:1970)
	at java.io.ObjectInputStream.readSerialData(ObjectInputStream.java:1894)
	at java.io.ObjectInputStream.readOrdinaryObject(ObjectInputStream.java:1777)
	at java.io.ObjectInputStream.readObject0(ObjectInputStream.java:1347)
	at java.io.ObjectInputStream.readArray(ObjectInputStream.java:1685)
	at java.io.ObjectInputStream.readObject0(ObjectInputStream.java:1341)
	at java.io.ObjectInputStream.defaultReadFields(ObjectInputStream.java:1970)
	at java.io.ObjectInputStream.defaultReadObject(ObjectInputStream.java:498)
	at java.lang.Throwable.readObject(Throwable.java:913)
	at sun.reflect.GeneratedMethodAccessor103627.invoke(Unknown Source)
	at sun.reflect.DelegatingMethodAccessorImpl.invoke(DelegatingMethodAccessorImpl.java:43)
	at java.lang.reflect.Method.invoke(Method.java:601)
	at java.io.ObjectStreamClass.invokeReadObject(ObjectStreamClass.java:1004)
	at java.io.ObjectInputStream.readSerialData(ObjectInputStream.java:1872)
	at java.io.ObjectInputStream.readOrdinaryObject(ObjectInputStream.java:1777)
	at java.io.ObjectInputStream.readObject0(ObjectInputStream.java:1347)
	at java.io.ObjectInputStream.defaultReadFields(ObjectInputStream.java:1970)
	at java.io.ObjectInputStream.readSerialData(ObjectInputStream.java:1894)
	at java.io.ObjectInputStream.readOrdinaryObject(ObjectInputStream.java:1777)
	at java.io.ObjectInputStream.readObject0(ObjectInputStream.java:1347)
	at java.io.ObjectInputStream.readObject(ObjectInputStream.java:369)
	at hudson.remoting.UserRequest.deserialize(UserRequest.java:182)
	at hudson.remoting.UserRequest.perform(UserRequest.java:98)
	at hudson.remoting.UserRequest.perform(UserRequest.java:48)
	at hudson.remoting.Request$2.run(Request.java:326)
	at hudson.remoting.InterceptingExecutorService$1.call(InterceptingExecutorService.java:72)
	at java.util.concurrent.FutureTask$Sync.innerRun(FutureTask.java:334)
	at java.util.concurrent.FutureTask.run(FutureTask.java:166)
	at java.util.concurrent.ThreadPoolExecutor.runWorker(ThreadPoolExecutor.java:1145)
	at java.util.concurrent.ThreadPoolExecutor$Worker.run(ThreadPoolExecutor.java:615)
	at java.lang.Thread.run(Thread.java:722)
Sending e-mails to: notifications@accumulo.apache.org
channel stopped
Updating ACCUMULO-1200
Updating ACCUMULO-1305

Mime
View raw message