accumulo-notifications mailing list archives

Site index · List index
Message view « Date » · « Thread »
Top « Date » · « Thread »
From Apache Jenkins Server <jenk...@builds.apache.org>
Subject Build failed in Jenkins: Accumulo-1.5-Hadoop-2.0 #86
Date Tue, 23 Apr 2013 00:59:33 GMT
See <https://builds.apache.org/job/Accumulo-1.5-Hadoop-2.0/86/changes>

Changes:

[kturner] ACCUMULO-1243 made accumulo more responsive to failed splits

[kturner] ACCUMULO-765 make getAuthorizationFailures() public like it was in 1.4

[ecn] ACCUMULO-578 don't log a message for every time a sorted WALOG disappears

[ecn] ACCUMULO-1227 fix LargeRowTest

[ecn] ACCUMULO-1211 new format breaks functional test

[ecn] ACCUMULO-1211 new format breaks functional test

[ecn] ACCUMULO-1044 fix functional test to handle new constraint

[ctubbsii] ACCUMULO-1315 remove useless configuration option; if we want this to do something
intelligent for a multi-module build, we're going to have to be stricter about matching JIRA
components to maven modules, so we can customize the display report per module

[ctubbsii] ACCUMULO-1315 Fix changes plugin, so it correctly queries the report at the command
line and during site building

[ecn] ACCUMULO-1319 fix functional tests

[kturner] ACCUMULO-1235 added timeout to split recovery unit test

------------------------------------------
[...truncated 2625 lines...]
Running org.apache.accumulo.server.master.state.MergeInfoTest
Tests run: 2, Failures: 0, Errors: 0, Skipped: 0, Time elapsed: 0.005 sec
Running org.apache.accumulo.server.master.TestMergeState
Tests run: 1, Failures: 0, Errors: 0, Skipped: 0, Time elapsed: 0.079 sec
Running org.apache.accumulo.server.constraints.MetadataConstraintsTest
Tests run: 2, Failures: 0, Errors: 0, Skipped: 0, Time elapsed: 0.007 sec
Running org.apache.accumulo.server.logger.LogFileTest
Tests run: 2, Failures: 0, Errors: 0, Skipped: 0, Time elapsed: 0.004 sec
Running org.apache.accumulo.server.client.BulkImporterTest
Tests run: 1, Failures: 0, Errors: 0, Skipped: 0, Time elapsed: 0.131 sec
Running org.apache.accumulo.server.tabletserver.CheckTabletMetadataTest
Tests run: 1, Failures: 0, Errors: 0, Skipped: 0, Time elapsed: 0.013 sec
Running org.apache.accumulo.server.tabletserver.InMemoryMapTest
Tests run: 8, Failures: 0, Errors: 0, Skipped: 0, Time elapsed: 0.091 sec
Running org.apache.accumulo.server.tabletserver.log.SortedLogRecoveryTest
Tests run: 18, Failures: 0, Errors: 0, Skipped: 0, Time elapsed: 0.573 sec
Running org.apache.accumulo.server.tabletserver.log.MultiReaderTest
Tests run: 1, Failures: 0, Errors: 0, Skipped: 0, Time elapsed: 0.169 sec
Running org.apache.accumulo.server.security.handler.ZKAuthenticatorTest
Tests run: 5, Failures: 0, Errors: 0, Skipped: 0, Time elapsed: 0.006 sec
Running org.apache.accumulo.server.data.ServerMutationTest
Tests run: 1, Failures: 0, Errors: 0, Skipped: 0, Time elapsed: 0 sec
Running org.apache.accumulo.server.gc.TestConfirmDeletes
Tests run: 1, Failures: 0, Errors: 0, Skipped: 0, Time elapsed: 0.04 sec
Running org.apache.accumulo.server.iterators.MetadataBulkLoadFilterTest
Tests run: 1, Failures: 0, Errors: 0, Skipped: 0, Time elapsed: 0.004 sec
Running org.apache.accumulo.server.util.DefaultMapTest
Tests run: 1, Failures: 0, Errors: 0, Skipped: 0, Time elapsed: 0 sec
Running org.apache.accumulo.server.util.TabletIteratorTest
Tests run: 1, Failures: 0, Errors: 0, Skipped: 0, Time elapsed: 0.003 sec
Running org.apache.accumulo.server.util.CloneTest
Tests run: 7, Failures: 0, Errors: 0, Skipped: 0, Time elapsed: 0.048 sec
Running org.apache.accumulo.server.util.time.BaseRelativeTimeTest
Tests run: 3, Failures: 0, Errors: 0, Skipped: 0, Time elapsed: 0.001 sec
Running org.apache.accumulo.server.monitor.ZooKeeperStatusTest
Tests run: 1, Failures: 0, Errors: 0, Skipped: 0, Time elapsed: 0.001 sec
Running org.apache.accumulo.server.monitor.ShowTraceLinkTypeTest
Tests run: 1, Failures: 0, Errors: 0, Skipped: 0, Time elapsed: 0.004 sec

Results :

Tests run: 67, Failures: 0, Errors: 0, Skipped: 0

[JENKINS] Recording test results
[INFO] [INFO] Copying gson-2.2.2.jar to <https://builds.apache.org/job/Accumulo-1.5-Hadoop-2.0/ws/accumulo-1.5/lib/gson-2.2.2.jar>
[INFO] libthrift-0.9.0.jar already exists in destination.
[INFO] jline-1.0.jar already exists in destination.
[INFO] jcommander-1.30.jar already exists in destination.

[INFO] --- maven-dependency-plugin:2.7:copy-dependencies (copy-dependencies) @ accumulo-server
---
[INFO] 
[INFO] --- maven-jar-plugin:2.4:jar (default-jar) @ accumulo-server ---
[INFO] Building jar: <https://builds.apache.org/job/Accumulo-1.5-Hadoop-2.0/ws/accumulo-1.5/server/target/accumulo-server-1.5.0-SNAPSHOT.jar>
[INFO] 
[INFO] --- maven-site-plugin:3.2:attach-descriptor (attach-descriptor) @ accumulo-server ---
[INFO] 
[INFO] --- maven-failsafe-plugin:2.12.4:integration-test (run-integration-tests) @ accumulo-server
---
[INFO] Failsafe report directory: <https://builds.apache.org/job/Accumulo-1.5-Hadoop-2.0/ws/accumulo-1.5/server/target/failsafe-reports>
[INFO] 
[INFO] --- maven-failsafe-plugin:2.12.4:verify (verify-integration-tests) @ accumulo-server
---
[JENKINS] Recording test results
[INFO] [INFO] Exclude: src/main/resources/web/flot/**/*.js

[INFO] --- apache-rat-plugin:0.8:check (default) @ accumulo-server ---
[INFO] [INFO] Deleting <https://builds.apache.org/job/Accumulo-1.5-Hadoop-2.0/ws/accumulo-1.5/examples>
(includes = [**/*.pyc], excludes = [])
                                                                        
[INFO] ------------------------------------------------------------------------
[INFO] Building Examples 1.5.0-SNAPSHOT
[INFO] ------------------------------------------------------------------------
[INFO] 
[INFO] --- maven-clean-plugin:2.5:clean (default-clean) @ accumulo-examples ---
[INFO] Verifying file <https://builds.apache.org/job/Accumulo-1.5-Hadoop-2.0/ws/accumulo-1.5/examples/pom.xml>
[INFO] 
[INFO] --- maven-sortpom-plugin:2.1.0:verify (verify-sorted-pom) @ accumulo-examples ---
[INFO] 
[INFO] --- maven-enforcer-plugin:1.0.1:enforce (enforce-mvn) @ accumulo-examples ---
[INFO] 
[INFO] --- maven-remote-resources-plugin:1.4:process (default) @ accumulo-examples ---
[INFO] 
[INFO] --- maven-dependency-plugin:2.7:copy-dependencies (copy-dependencies) @ accumulo-examples
---
[INFO] 
[INFO] --- maven-site-plugin:3.2:attach-descriptor (attach-descriptor) @ accumulo-examples
---
[INFO] [INFO] No tests to run.

[INFO] --- maven-failsafe-plugin:2.12.4:integration-test (run-integration-tests) @ accumulo-examples
---
[INFO] No tests to run.
[INFO] 
[INFO] --- maven-failsafe-plugin:2.12.4:verify (verify-integration-tests) @ accumulo-examples
---
[JENKINS] Recording test results
[INFO] [INFO] No excludes

[INFO] --- apache-rat-plugin:0.8:check (default) @ accumulo-examples ---
[INFO]                                                                         
[INFO] ------------------------------------------------------------------------[INFO] Deleting
<https://builds.apache.org/job/Accumulo-1.5-Hadoop-2.0/ws/accumulo-1.5/examples/simple>
(includes = [**/*.pyc], excludes = [])

[INFO] Building Simple Examples 1.5.0-SNAPSHOT
[INFO] ------------------------------------------------------------------------
[INFO] 
[INFO] --- maven-clean-plugin:2.5:clean (default-clean) @ accumulo-examples-simple ---
[INFO] [INFO] Verifying file <https://builds.apache.org/job/Accumulo-1.5-Hadoop-2.0/ws/accumulo-1.5/examples/simple/pom.xml>

[INFO] --- maven-sortpom-plugin:2.1.0:verify (verify-sorted-pom) @ accumulo-examples-simple
---
[INFO] 
[INFO] --- maven-enforcer-plugin:1.0.1:enforce (enforce-mvn) @ accumulo-examples-simple ---
[INFO] 
[INFO] --- maven-remote-resources-plugin:1.4:process (default) @ accumulo-examples-simple
---
[INFO] [INFO] Using 'UTF-8' encoding to copy filtered resources.
[INFO] skip non existing resourceDirectory <https://builds.apache.org/job/Accumulo-1.5-Hadoop-2.0/ws/accumulo-1.5/examples/simple/src/main/resources>
[INFO] Copying 3 resources

[INFO] --- maven-resources-plugin:2.6:resources (default-resources) @ accumulo-examples-simple
---
[INFO] [INFO] Compiling 39 source files to <https://builds.apache.org/job/Accumulo-1.5-Hadoop-2.0/ws/accumulo-1.5/examples/simple/target/classes>

[INFO] --- maven-compiler-plugin:2.5.1:compile (default-compile) @ accumulo-examples-simple
---
[INFO] [INFO] Using 'UTF-8' encoding to copy filtered resources.
[INFO] Copying 1 resource
[INFO] Copying 3 resources

[INFO] --- maven-resources-plugin:2.6:testResources (default-testResources) @ accumulo-examples-simple
---
[INFO] [INFO] Compiling 5 source files to <https://builds.apache.org/job/Accumulo-1.5-Hadoop-2.0/ws/accumulo-1.5/examples/simple/target/test-classes>

[INFO] --- maven-compiler-plugin:2.5.1:testCompile (default-testCompile) @ accumulo-examples-simple
---
[INFO] [INFO] Surefire report directory: <https://builds.apache.org/job/Accumulo-1.5-Hadoop-2.0/ws/accumulo-1.5/examples/simple/target/surefire-reports>

-------------------------------------------------------
 T E S T S
-------------------------------------------------------

[INFO] --- maven-surefire-plugin:2.12.4:test (default-test) @ accumulo-examples-simple ---
Running org.apache.accumulo.examples.simple.filedata.ChunkCombinerTest
Tests run: 1, Failures: 0, Errors: 0, Skipped: 0, Time elapsed: 0.121 sec
Running org.apache.accumulo.examples.simple.filedata.ChunkInputFormatTest
Tests run: 3, Failures: 0, Errors: 0, Skipped: 0, Time elapsed: 4.42 sec
Running org.apache.accumulo.examples.simple.filedata.KeyUtilTest
Tests run: 1, Failures: 0, Errors: 0, Skipped: 0, Time elapsed: 0.001 sec
Running org.apache.accumulo.examples.simple.filedata.ChunkInputStreamTest
Tests run: 9, Failures: 0, Errors: 0, Skipped: 0, Time elapsed: 0.052 sec
Running org.apache.accumulo.examples.simple.dirlist.CountTest
Tests run: 1, Failures: 0, Errors: 0, Skipped: 0, Time elapsed: 0.023 sec

Results :

Tests run: 15, Failures: 0, Errors: 0, Skipped: 0

[JENKINS] Recording test results
[INFO] [INFO] Copying jcommander-1.30.jar to <https://builds.apache.org/job/Accumulo-1.5-Hadoop-2.0/ws/accumulo-1.5/examples/lib/jcommander-1.30.jar>

[INFO] --- maven-dependency-plugin:2.7:copy-dependencies (copy-dependencies) @ accumulo-examples-simple
---
[INFO] 
[INFO] --- maven-jar-plugin:2.4:jar (default-jar) @ accumulo-examples-simple ---[INFO] Building
jar: <https://builds.apache.org/job/Accumulo-1.5-Hadoop-2.0/ws/accumulo-1.5/examples/simple/target/accumulo-examples-simple-1.5.0-SNAPSHOT.jar>

[INFO] 
[INFO] --- maven-site-plugin:3.2:attach-descriptor (attach-descriptor) @ accumulo-examples-simple
---
[INFO] 
[INFO] --- maven-failsafe-plugin:2.12.4:integration-test (run-integration-tests) @ accumulo-examples-simple
---
[INFO] [INFO] Failsafe report directory: <https://builds.apache.org/job/Accumulo-1.5-Hadoop-2.0/ws/accumulo-1.5/examples/simple/target/failsafe-reports>

[INFO] --- maven-failsafe-plugin:2.12.4:verify (verify-integration-tests) @ accumulo-examples-simple
---
[JENKINS] Recording test results
[INFO] [INFO] No excludes

[INFO] --- apache-rat-plugin:0.8:check (default) @ accumulo-examples-simple ---
[INFO]                                                                         
[INFO] ------------------------------------------------------------------------
[INFO] Building Testing 1.5.0-SNAPSHOT
[INFO] ------------------------------------------------------------------------
[INFO] [INFO] Deleting <https://builds.apache.org/job/Accumulo-1.5-Hadoop-2.0/ws/accumulo-1.5/test>
(includes = [**/*.pyc], excludes = [])

[INFO] --- maven-clean-plugin:2.5:clean (default-clean) @ accumulo-test ---
[INFO] [INFO] Verifying file <https://builds.apache.org/job/Accumulo-1.5-Hadoop-2.0/ws/accumulo-1.5/test/pom.xml>

[INFO] --- maven-sortpom-plugin:2.1.0:verify (verify-sorted-pom) @ accumulo-test ---
[INFO] 
[INFO] --- maven-enforcer-plugin:1.0.1:enforce (enforce-mvn) @ accumulo-test ---
[INFO] 
[INFO] --- maven-remote-resources-plugin:1.4:process (default) @ accumulo-test ---
[INFO] [INFO] Using 'UTF-8' encoding to copy filtered resources.
[INFO] Copying 1 resource
[INFO] Copying 3 resources

[INFO] --- maven-resources-plugin:2.6:resources (default-resources) @ accumulo-test ---
[INFO] [INFO] Compiling 182 source files to <https://builds.apache.org/job/Accumulo-1.5-Hadoop-2.0/ws/accumulo-1.5/test/target/classes>

[INFO] --- maven-compiler-plugin:2.5.1:compile (default-compile) @ accumulo-test ---
[INFO] Using 'UTF-8' encoding to copy filtered resources.
[INFO] [INFO] Copying 3 resources
[INFO] Copying 3 resources

[INFO] --- maven-resources-plugin:2.6:testResources (default-testResources) @ accumulo-test
---
[INFO] [INFO] Compiling 7 source files to <https://builds.apache.org/job/Accumulo-1.5-Hadoop-2.0/ws/accumulo-1.5/test/target/test-classes>

[INFO] --- maven-compiler-plugin:2.5.1:testCompile (default-testCompile) @ accumulo-test ---
[INFO] [INFO] Surefire report directory: <https://builds.apache.org/job/Accumulo-1.5-Hadoop-2.0/ws/accumulo-1.5/test/target/surefire-reports>

-------------------------------------------------------
 T E S T S
-------------------------------------------------------

[INFO] --- maven-surefire-plugin:2.12.4:test (default-test) @ accumulo-test ---
Running org.apache.accumulo.test.TestAccumuloSplitRecovery
Tests run: 1, Failures: 0, Errors: 0, Skipped: 0, Time elapsed: 12.165 sec
Running org.apache.accumulo.test.randomwalk.FrameworkTest
Tests run: 4, Failures: 0, Errors: 0, Skipped: 0, Time elapsed: 0.032 sec
Running org.apache.accumulo.test.iterator.RegExTest
Tests run: 1, Failures: 0, Errors: 0, Skipped: 0, Time elapsed: 1.907 sec
Running org.apache.accumulo.test.MiniAccumuloClusterTest
Tests run: 2, Failures: 0, Errors: 0, Skipped: 0, Time elapsed: 11.662 sec
Running org.apache.accumulo.test.MetaSplitTest
Tests run: 1, Failures: 0, Errors: 0, Skipped: 0, Time elapsed: 26.116 sec
Running org.apache.accumulo.test.ShellServerTest
Tests run: 32, Failures: 1, Errors: 0, Skipped: 0, Time elapsed: 90.845 sec <<< FAILURE!
trace(org.apache.accumulo.test.ShellServerTest)  Time elapsed: 19.513 sec  <<< FAILURE!
java.lang.AssertionError
	at org.junit.Assert.fail(Assert.java:86)
	at org.junit.Assert.assertTrue(Assert.java:41)
	at org.junit.Assert.assertTrue(Assert.java:52)
	at org.apache.accumulo.test.ShellServerTest.trace(ShellServerTest.java:710)
	at sun.reflect.NativeMethodAccessorImpl.invoke0(Native Method)
	at sun.reflect.NativeMethodAccessorImpl.invoke(NativeMethodAccessorImpl.java:39)
	at sun.reflect.DelegatingMethodAccessorImpl.invoke(DelegatingMethodAccessorImpl.java:25)
	at java.lang.reflect.Method.invoke(Method.java:597)
	at org.junit.runners.model.FrameworkMethod$1.runReflectiveCall(FrameworkMethod.java:47)
	at org.junit.internal.runners.model.ReflectiveCallable.run(ReflectiveCallable.java:12)
	at org.junit.runners.model.FrameworkMethod.invokeExplosively(FrameworkMethod.java:44)
	at org.junit.internal.runners.statements.InvokeMethod.evaluate(InvokeMethod.java:17)
	at org.junit.internal.runners.statements.FailOnTimeout$StatementThread.run(FailOnTimeout.java:74)

Running org.apache.accumulo.fate.zookeeper.ZooLockTest
Tests run: 6, Failures: 0, Errors: 0, Skipped: 0, Time elapsed: 5.139 sec

Results :

Failed tests:   trace(org.apache.accumulo.test.ShellServerTest)

Tests run: 47, Failures: 1, Errors: 0, Skipped: 0

[ERROR] There are test failures.

Please refer to <https://builds.apache.org/job/Accumulo-1.5-Hadoop-2.0/ws/accumulo-1.5/test/target/surefire-reports>
for the individual test results.
ERROR: Maven JVM terminated unexpectedly with exit code 143
Updating ACCUMULO-1315
Updating ACCUMULO-1235
Updating ACCUMULO-1044
Updating ACCUMULO-765
Updating ACCUMULO-1211
Updating ACCUMULO-578
Updating ACCUMULO-1319
Updating ACCUMULO-1227
Updating ACCUMULO-1243

Mime
View raw message