accumulo-notifications mailing list archives

Site index · List index
Message view « Date » · « Thread »
Top « Date » · « Thread »
From Apache Jenkins Server <jenk...@builds.apache.org>
Subject Build failed in Jenkins: Accumulo-1.4.x #291
Date Fri, 12 Apr 2013 16:09:48 GMT
See <https://builds.apache.org/job/Accumulo-1.4.x/291/>

------------------------------------------
[...truncated 3979 lines...]
Cobertura: Saved information on 61 classes.
Instrument time: 702ms

[INFO] Instrumentation was successful.
[INFO] NOT adding cobertura ser file to attached artifacts list.
[debug] execute contextualize
[INFO] [INFO] Using 'UTF-8' encoding to copy filtered resources.
[INFO] Copying 1 resource
[INFO] Copying 3 resources
[INFO] Copying 3 resources

[INFO] --- maven-resources-plugin:2.5:testResources (default-testResources) @ wikisearch-query
---
[INFO] [INFO] Nothing to compile - all classes are up to date

[INFO] --- maven-compiler-plugin:2.3.2:testCompile (default-testCompile) @ wikisearch-query
---
[INFO] [INFO] Surefire report directory: <https://builds.apache.org/job/Accumulo-1.4.x/ws/1.4/src/examples/wikisearch/query/target/surefire-reports>

-------------------------------------------------------
 T E S T S
-------------------------------------------------------

[INFO] --- maven-surefire-plugin:2.9:test (default-test) @ wikisearch-query ---
Running org.apache.accumulo.examples.wikisearch.logic.TestQueryLogic
Tests run: 1, Failures: 0, Errors: 0, Skipped: 0, Time elapsed: 0.973 sec
Flushing results...
Flushing results done
Cobertura: Loaded information on 61 classes.
Cobertura: Saved information on 61 classes.

Results :

Tests run: 1, Failures: 0, Errors: 0, Skipped: 0

[JENKINS] Recording test results
[INFO] 
[INFO] --- cobertura-maven-plugin:2.5.2:cobertura (default-cli) @ wikisearch-query ---
[INFO] Cobertura 1.9.4.1 - GNU GPL License (NO WARRANTY) - See COPYRIGHT file
Cobertura: Loaded information on 61 classes.
Report time: 2539ms

[INFO] Cobertura Report generation was successful.
[INFO] Downloading: http://repo1.maven.org/maven2/javax/javaee-web-api/6.0/javaee-web-api-6.0.pom
                                                                        
[INFO] ------------------------------------------------------------------------
[INFO] Building wikisearch-query-war 1.4.4-SNAPSHOT
[INFO] ------------------------------------------------------------------------
Downloaded: http://repo1.maven.org/maven2/javax/javaee-web-api/6.0/javaee-web-api-6.0.pom
(4 KB at 61.1 KB/sec)
Downloading: http://repo1.maven.org/maven2/javax/javaee-web-api/6.0/javaee-web-api-6.0.jar
Downloaded: http://repo1.maven.org/maven2/javax/javaee-web-api/6.0/javaee-web-api-6.0.jar
(909 KB at 8821.6 KB/sec)
[INFO] 
[INFO] --- maven-clean-plugin:2.4.1:clean (default-clean) @ wikisearch-query-war ---
[INFO] 
[INFO] --- maven-enforcer-plugin:1.0.1:enforce (enforce-mvn) @ wikisearch-query-war ---
[INFO] 
[INFO] --- maven-remote-resources-plugin:1.2.1:process (default) @ wikisearch-query-war ---
[debug] execute contextualize
[INFO] [INFO] Using 'UTF-8' encoding to copy filtered resources.
[INFO] skip non existing resourceDirectory <https://builds.apache.org/job/Accumulo-1.4.x/ws/1.4/src/examples/wikisearch/query-war/src/main/resources>
[INFO] Copying 3 resources

[INFO] --- maven-resources-plugin:2.5:resources (default-resources) @ wikisearch-query-war
---
[INFO] [INFO] No sources to compile

[INFO] --- maven-compiler-plugin:2.3.2:compile (default-compile) @ wikisearch-query-war ---
[debug] execute contextualize
[INFO] [INFO] Using 'UTF-8' encoding to copy filtered resources.
[INFO] Copying 1 resource
[INFO] Copying 3 resources

[INFO] --- maven-resources-plugin:2.5:testResources (default-testResources) @ wikisearch-query-war
---
[INFO] [INFO] No sources to compile

[INFO] --- maven-compiler-plugin:2.3.2:testCompile (default-testCompile) @ wikisearch-query-war
---
[INFO] Surefire report directory: <https://builds.apache.org/job/Accumulo-1.4.x/ws/1.4/src/examples/wikisearch/query-war/target/surefire-reports>
[INFO] 
-------------------------------------------------------
 T E S T S
-------------------------------------------------------

[INFO] --- maven-surefire-plugin:2.9:test (default-test) @ wikisearch-query-war ---

Results :

Tests run: 0, Failures: 0, Errors: 0, Skipped: 0

[JENKINS] Recording test results
[INFO] 
[INFO] --- maven-war-plugin:2.1.1:war (default-war) @ wikisearch-query-war ---
[INFO] Packaging webapp
[INFO] Assembling webapp [wikisearch-query-war] in [<https://builds.apache.org/job/Accumulo-1.4.x/ws/1.4/src/examples/wikisearch/query-war/target/wikisearch-query-war-1.4.4-SNAPSHOT]>
[INFO] Processing war project
[INFO] Copying webapp resources [<https://builds.apache.org/job/Accumulo-1.4.x/ws/1.4/src/examples/wikisearch/query-war/src/main/webapp]>
[INFO] Webapp assembled in [33 msecs]
[INFO] Building war: <https://builds.apache.org/job/Accumulo-1.4.x/ws/1.4/src/examples/wikisearch/query-war/target/wikisearch-query-war-1.4.4-SNAPSHOT.war>
[INFO] WEB-INF/web.xml already added, skipping
[INFO] 
[INFO] --- maven-site-plugin:3.0:attach-descriptor (attach-descriptor) @ wikisearch-query-war
---
[INFO] 
[INFO] --- maven-enforcer-plugin:1.0.1:enforce (enforce-mvn) @ wikisearch-query-war ---
[INFO] 
[INFO] --- maven-remote-resources-plugin:1.2.1:process (default) @ wikisearch-query-war ---
[INFO] [debug] execute contextualize
[INFO] Using 'UTF-8' encoding to copy filtered resources.
[INFO] skip non existing resourceDirectory <https://builds.apache.org/job/Accumulo-1.4.x/ws/1.4/src/examples/wikisearch/query-war/src/main/resources>
[INFO] Copying 3 resources
[INFO] Copying 3 resources

[INFO] --- maven-resources-plugin:2.5:resources (default-resources) @ wikisearch-query-war
---
[INFO] No sources to compile
[INFO] 
[INFO] --- maven-compiler-plugin:2.3.2:compile (default-compile) @ wikisearch-query-war ---
[INFO] [WARNING] No files to instrument.
[INFO] NOT adding cobertura ser file to attached artifacts list.

[INFO] --- cobertura-maven-plugin:2.5.2:instrument (default-cli) @ wikisearch-query-war ---
[debug] execute contextualize
[INFO] [INFO] Using 'UTF-8' encoding to copy filtered resources.
[INFO] Copying 1 resource
[INFO] Copying 3 resources
[INFO] Copying 3 resources

[INFO] --- maven-resources-plugin:2.5:testResources (default-testResources) @ wikisearch-query-war
---
[INFO] [INFO] No sources to compile

[INFO] --- maven-compiler-plugin:2.3.2:testCompile (default-testCompile) @ wikisearch-query-war
---
[INFO] Surefire report directory: <https://builds.apache.org/job/Accumulo-1.4.x/ws/1.4/src/examples/wikisearch/query-war/target/surefire-reports>
[INFO] 
-------------------------------------------------------
 T E S T S
-------------------------------------------------------

[INFO] --- maven-surefire-plugin:2.9:test (default-test) @ wikisearch-query-war ---

Results :

Tests run: 0, Failures: 0, Errors: 0, Skipped: 0

[JENKINS] Recording test results
[INFO] 
[INFO] --- cobertura-maven-plugin:2.5.2:cobertura (default-cli) @ wikisearch-query-war ---
[INFO]                                                                         
[INFO] ------------------------------------------------------------------------
[INFO] Building Proxy 1.4.4-SNAPSHOT
[INFO] ------------------------------------------------------------------------
[INFO] Deleting <https://builds.apache.org/job/Accumulo-1.4.x/ws/1.4/src/proxy> (includes
= [**/*.pyc], excludes = [])
[INFO] 
[INFO] --- maven-clean-plugin:2.4.1:clean (default-clean) @ accumulo-proxy ---
[INFO] 
[INFO] --- maven-enforcer-plugin:1.0.1:enforce (enforce-mvn) @ accumulo-proxy ---
[INFO] 
[INFO] --- exec-maven-plugin:1.2:exec (generate-thrift) @ accumulo-proxy ---
[INFO] ------------------------------------------------------------------------
[INFO] Reactor Summary:
[INFO] 
[INFO] accumulo .......................................... SUCCESS [29.387s]
[INFO] cloudtrace ........................................ SUCCESS [23.478s]
[INFO] accumulo-start .................................... SUCCESS [43.883s]
[INFO] accumulo-core ..................................... SUCCESS [1:51.476s]
[INFO] accumulo-server ................................... SUCCESS [57.904s]
[INFO] accumulo-examples ................................. SUCCESS [2.232s]
[INFO] examples-simple ................................... SUCCESS [12.761s]
[INFO] accumulo-wikisearch ............................... SUCCESS [2.088s]
[INFO] wikisearch-ingest ................................. SUCCESS [15.463s]
[INFO] wikisearch-query .................................. SUCCESS [15.169s]
[INFO] wikisearch-query-war .............................. SUCCESS [3.662s]
[INFO] Proxy ............................................. FAILURE [0.831s]
[INFO] ------------------------------------------------------------------------
[INFO] BUILD FAILURE
[INFO] ------------------------------------------------------------------------
[INFO] Total time: 5:27.898s
[INFO] Finished at: Fri Apr 12 16:08:56 UTC 2013
[INFO] Final Memory: 88M/191M
[INFO] ------------------------------------------------------------------------
[JENKINS] Archiving <https://builds.apache.org/job/Accumulo-1.4.x/ws/1.4/src/examples/wikisearch/ingest/pom.xml>
to /home/hudson/hudson/jobs/Accumulo-1.4.x/modules/org.apache.accumulo$wikisearch-ingest/builds/2013-04-12_16-03-07/archive/org.apache.accumulo/wikisearch-ingest/1.4.4-SNAPSHOT/wikisearch-ingest-1.4.4-SNAPSHOT.pom
[JENKINS] Archiving <https://builds.apache.org/job/Accumulo-1.4.x/ws/1.4/src/examples/wikisearch/ingest/lib/wikisearch-ingest-1.4.4-SNAPSHOT.jar>
to /home/hudson/hudson/jobs/Accumulo-1.4.x/modules/org.apache.accumulo$wikisearch-ingest/builds/2013-04-12_16-03-07/archive/org.apache.accumulo/wikisearch-ingest/1.4.4-SNAPSHOT/wikisearch-ingest-1.4.4-SNAPSHOT.jar
[JENKINS] Archiving <https://builds.apache.org/job/Accumulo-1.4.x/ws/1.4/src/server/pom.xml>
to /home/hudson/hudson/jobs/Accumulo-1.4.x/modules/org.apache.accumulo$accumulo-server/builds/2013-04-12_16-03-07/archive/org.apache.accumulo/accumulo-server/1.4.4-SNAPSHOT/accumulo-server-1.4.4-SNAPSHOT.pom
[JENKINS] Archiving <https://builds.apache.org/job/Accumulo-1.4.x/ws/1.4/lib/accumulo-server-1.4.4-SNAPSHOT.jar>
to /home/hudson/hudson/jobs/Accumulo-1.4.x/modules/org.apache.accumulo$accumulo-server/builds/2013-04-12_16-03-07/archive/org.apache.accumulo/accumulo-server/1.4.4-SNAPSHOT/accumulo-server-1.4.4-SNAPSHOT.jar
[JENKINS] Archiving <https://builds.apache.org/job/Accumulo-1.4.x/ws/1.4/src/trace/pom.xml>
to /home/hudson/hudson/jobs/Accumulo-1.4.x/modules/org.apache.accumulo$cloudtrace/builds/2013-04-12_16-03-07/archive/org.apache.accumulo/cloudtrace/1.4.4-SNAPSHOT/cloudtrace-1.4.4-SNAPSHOT.pom
[JENKINS] Archiving <https://builds.apache.org/job/Accumulo-1.4.x/ws/1.4/lib/cloudtrace-1.4.4-SNAPSHOT.jar>
to /home/hudson/hudson/jobs/Accumulo-1.4.x/modules/org.apache.accumulo$cloudtrace/builds/2013-04-12_16-03-07/archive/org.apache.accumulo/cloudtrace/1.4.4-SNAPSHOT/cloudtrace-1.4.4-SNAPSHOT.jar
[JENKINS] Archiving <https://builds.apache.org/job/Accumulo-1.4.x/ws/1.4/src/proxy/pom.xml>
to /home/hudson/hudson/jobs/Accumulo-1.4.x/modules/org.apache.accumulo$accumulo-proxy/builds/2013-04-12_16-03-07/archive/org.apache.accumulo/accumulo-proxy/1.4.4-SNAPSHOT/accumulo-proxy-1.4.4-SNAPSHOT.pom
[JENKINS] Archiving <https://builds.apache.org/job/Accumulo-1.4.x/ws/1.4/src/examples/pom.xml>
to /home/hudson/hudson/jobs/Accumulo-1.4.x/modules/org.apache.accumulo$accumulo-examples/builds/2013-04-12_16-03-07/archive/org.apache.accumulo/accumulo-examples/1.4.4-SNAPSHOT/accumulo-examples-1.4.4-SNAPSHOT.pom
[JENKINS] Archiving <https://builds.apache.org/job/Accumulo-1.4.x/ws/1.4/src/examples/wikisearch/query/pom.xml>
to /home/hudson/hudson/jobs/Accumulo-1.4.x/modules/org.apache.accumulo$wikisearch-query/builds/2013-04-12_16-03-07/archive/org.apache.accumulo/wikisearch-query/1.4.4-SNAPSHOT/wikisearch-query-1.4.4-SNAPSHOT.pom
[JENKINS] Archiving <https://builds.apache.org/job/Accumulo-1.4.x/ws/1.4/src/examples/wikisearch/query/target/wikisearch-query-1.4.4-SNAPSHOT.jar>
to /home/hudson/hudson/jobs/Accumulo-1.4.x/modules/org.apache.accumulo$wikisearch-query/builds/2013-04-12_16-03-07/archive/org.apache.accumulo/wikisearch-query/1.4.4-SNAPSHOT/wikisearch-query-1.4.4-SNAPSHOT.jar
[JENKINS] Archiving <https://builds.apache.org/job/Accumulo-1.4.x/ws/1.4/src/examples/simple/pom.xml>
to /home/hudson/hudson/jobs/Accumulo-1.4.x/modules/org.apache.accumulo$examples-simple/builds/2013-04-12_16-03-07/archive/org.apache.accumulo/examples-simple/1.4.4-SNAPSHOT/examples-simple-1.4.4-SNAPSHOT.pom
[JENKINS] Archiving <https://builds.apache.org/job/Accumulo-1.4.x/ws/1.4/lib/examples-simple-1.4.4-SNAPSHOT.jar>
to /home/hudson/hudson/jobs/Accumulo-1.4.x/modules/org.apache.accumulo$examples-simple/builds/2013-04-12_16-03-07/archive/org.apache.accumulo/examples-simple/1.4.4-SNAPSHOT/examples-simple-1.4.4-SNAPSHOT.jar
[JENKINS] Archiving <https://builds.apache.org/job/Accumulo-1.4.x/ws/1.4/pom.xml> to
/home/hudson/hudson/jobs/Accumulo-1.4.x/modules/org.apache.accumulo$accumulo/builds/2013-04-12_16-03-07/archive/org.apache.accumulo/accumulo/1.4.4-SNAPSHOT/accumulo-1.4.4-SNAPSHOT.pom
[JENKINS] Archiving <https://builds.apache.org/job/Accumulo-1.4.x/ws/1.4/src/start/pom.xml>
to /home/hudson/hudson/jobs/Accumulo-1.4.x/modules/org.apache.accumulo$accumulo-start/builds/2013-04-12_16-03-07/archive/org.apache.accumulo/accumulo-start/1.4.4-SNAPSHOT/accumulo-start-1.4.4-SNAPSHOT.pom
[JENKINS] Archiving <https://builds.apache.org/job/Accumulo-1.4.x/ws/1.4/lib/accumulo-start-1.4.4-SNAPSHOT.jar>
to /home/hudson/hudson/jobs/Accumulo-1.4.x/modules/org.apache.accumulo$accumulo-start/builds/2013-04-12_16-03-07/archive/org.apache.accumulo/accumulo-start/1.4.4-SNAPSHOT/accumulo-start-1.4.4-SNAPSHOT.jar
[JENKINS] Archiving <https://builds.apache.org/job/Accumulo-1.4.x/ws/1.4/src/examples/wikisearch/pom.xml>
to /home/hudson/hudson/jobs/Accumulo-1.4.x/modules/org.apache.accumulo$accumulo-wikisearch/builds/2013-04-12_16-03-07/archive/org.apache.accumulo/accumulo-wikisearch/1.4.4-SNAPSHOT/accumulo-wikisearch-1.4.4-SNAPSHOT.pom
[JENKINS] Archiving <https://builds.apache.org/job/Accumulo-1.4.x/ws/1.4/src/examples/wikisearch/query-war/pom.xml>
to /home/hudson/hudson/jobs/Accumulo-1.4.x/modules/org.apache.accumulo$wikisearch-query-war/builds/2013-04-12_16-03-07/archive/org.apache.accumulo/wikisearch-query-war/1.4.4-SNAPSHOT/wikisearch-query-war-1.4.4-SNAPSHOT.pom
[JENKINS] Archiving <https://builds.apache.org/job/Accumulo-1.4.x/ws/1.4/src/examples/wikisearch/query-war/target/wikisearch-query-war-1.4.4-SNAPSHOT.war>
to /home/hudson/hudson/jobs/Accumulo-1.4.x/modules/org.apache.accumulo$wikisearch-query-war/builds/2013-04-12_16-03-07/archive/org.apache.accumulo/wikisearch-query-war/1.4.4-SNAPSHOT/wikisearch-query-war-1.4.4-SNAPSHOT.war
[JENKINS] Archiving <https://builds.apache.org/job/Accumulo-1.4.x/ws/1.4/src/core/pom.xml>
to /home/hudson/hudson/jobs/Accumulo-1.4.x/modules/org.apache.accumulo$accumulo-core/builds/2013-04-12_16-03-07/archive/org.apache.accumulo/accumulo-core/1.4.4-SNAPSHOT/accumulo-core-1.4.4-SNAPSHOT.pom
[JENKINS] Archiving <https://builds.apache.org/job/Accumulo-1.4.x/ws/1.4/lib/accumulo-core-1.4.4-SNAPSHOT.jar>
to /home/hudson/hudson/jobs/Accumulo-1.4.x/modules/org.apache.accumulo$accumulo-core/builds/2013-04-12_16-03-07/archive/org.apache.accumulo/accumulo-core/1.4.4-SNAPSHOT/accumulo-core-1.4.4-SNAPSHOT.jar
Waiting for Jenkins to finish collecting data
mavenExecutionResult exceptions not empty
message : Failed to execute goal org.codehaus.mojo:exec-maven-plugin:1.2:exec (generate-thrift)
on project accumulo-proxy: Command execution failed.
cause : Command execution failed.
Stack trace : 
org.apache.maven.lifecycle.LifecycleExecutionException: Failed to execute goal org.codehaus.mojo:exec-maven-plugin:1.2:exec
(generate-thrift) on project accumulo-proxy: Command execution failed.
	at org.apache.maven.lifecycle.internal.MojoExecutor.execute(MojoExecutor.java:217)
	at org.apache.maven.lifecycle.internal.MojoExecutor.execute(MojoExecutor.java:153)
	at org.apache.maven.lifecycle.internal.MojoExecutor.execute(MojoExecutor.java:145)
	at org.apache.maven.lifecycle.internal.LifecycleModuleBuilder.buildProject(LifecycleModuleBuilder.java:84)
	at org.apache.maven.lifecycle.internal.LifecycleModuleBuilder.buildProject(LifecycleModuleBuilder.java:59)
	at org.apache.maven.lifecycle.internal.LifecycleStarter.singleThreadedBuild(LifecycleStarter.java:183)
	at org.apache.maven.lifecycle.internal.LifecycleStarter.execute(LifecycleStarter.java:161)
	at org.apache.maven.DefaultMaven.doExecute(DefaultMaven.java:320)
	at org.apache.maven.DefaultMaven.execute(DefaultMaven.java:156)
	at org.jvnet.hudson.maven3.launcher.Maven3Launcher.main(Maven3Launcher.java:79)
	at sun.reflect.NativeMethodAccessorImpl.invoke0(Native Method)
	at sun.reflect.NativeMethodAccessorImpl.invoke(NativeMethodAccessorImpl.java:39)
	at sun.reflect.DelegatingMethodAccessorImpl.invoke(DelegatingMethodAccessorImpl.java:25)
	at java.lang.reflect.Method.invoke(Method.java:597)
	at org.codehaus.plexus.classworlds.launcher.Launcher.launchStandard(Launcher.java:329)
	at org.codehaus.plexus.classworlds.launcher.Launcher.launch(Launcher.java:239)
	at org.jvnet.hudson.maven3.agent.Maven3Main.launch(Maven3Main.java:158)
	at hudson.maven.Maven3Builder.call(Maven3Builder.java:100)
	at hudson.maven.Maven3Builder.call(Maven3Builder.java:66)
	at hudson.remoting.UserRequest.perform(UserRequest.java:118)
	at hudson.remoting.UserRequest.perform(UserRequest.java:48)
	at hudson.remoting.Request$2.run(Request.java:326)
	at hudson.remoting.InterceptingExecutorService$1.call(InterceptingExecutorService.java:72)
	at java.util.concurrent.FutureTask$Sync.innerRun(FutureTask.java:303)
	at java.util.concurrent.FutureTask.run(FutureTask.java:138)
	at java.util.concurrent.ThreadPoolExecutor$Worker.runTask(ThreadPoolExecutor.java:886)
	at java.util.concurrent.ThreadPoolExecutor$Worker.run(ThreadPoolExecutor.java:908)
	at java.lang.Thread.run(Thread.java:662)
Caused by: org.apache.maven.plugin.MojoExecutionException: Command execution failed.
	at org.codehaus.mojo.exec.ExecMojo.execute(ExecMojo.java:350)
	at org.apache.maven.plugin.DefaultBuildPluginManager.executeMojo(DefaultBuildPluginManager.java:101)
	at org.apache.maven.lifecycle.internal.MojoExecutor.execute(MojoExecutor.java:209)
	... 27 more
Caused by: java.io.IOException: Cannot run program "<https://builds.apache.org/job/Accumulo-1.4.x/ws/1.4/src/proxy/src/main/scripts/generate-thrift.sh">
(in directory "<https://builds.apache.org/job/Accumulo-1.4.x/ws/1.4/src/proxy")>: java.io.IOException:
error=13, Permission denied
	at java.lang.ProcessBuilder.start(ProcessBuilder.java:460)
	at java.lang.Runtime.exec(Runtime.java:593)
	at org.apache.commons.exec.launcher.Java13CommandLauncher.exec(Java13CommandLauncher.java:58)
	at org.apache.commons.exec.DefaultExecutor.launch(DefaultExecutor.java:246)
	at org.apache.commons.exec.DefaultExecutor.executeInternal(DefaultExecutor.java:302)
	at org.apache.commons.exec.DefaultExecutor.execute(DefaultExecutor.java:149)
	at org.codehaus.mojo.exec.ExecMojo.executeCommandLine(ExecMojo.java:589)
	at org.codehaus.mojo.exec.ExecMojo.execute(ExecMojo.java:335)
	... 29 more
Caused by: java.io.IOException: java.io.IOException: error=13, Permission denied
	at java.lang.UNIXProcess.<init>(UNIXProcess.java:148)
	at java.lang.ProcessImpl.start(ProcessImpl.java:65)
	at java.lang.ProcessBuilder.start(ProcessBuilder.java:453)
	... 36 more
Sending e-mails to: notifications@accumulo.apache.org
channel stopped

Mime
View raw message