accumulo-notifications mailing list archives

Site index · List index
Message view « Date » · « Thread »
Top « Date » · « Thread »
From Apache Jenkins Server <jenk...@builds.apache.org>
Subject Build failed in Jenkins: Accumulo-1.5-Hadoop-2.0 #33
Date Sat, 16 Mar 2013 11:21:54 GMT
See <https://builds.apache.org/job/Accumulo-1.5-Hadoop-2.0/33/changes>

Changes:

[kturner] ACCUMULO-892 made stopAll flush tables

------------------------------------------
[...truncated 3060 lines...]
[INFO] 
[INFO] --- maven-clean-plugin:2.4.1:clean (default-clean) @ accumulo-examples-instamo ---
[INFO] [debug] execute contextualize
[WARNING] Using platform encoding (ANSI_X3.4-1968 actually) to copy filtered resources, i.e.
build is platform dependent!

[INFO] --- maven-resources-plugin:2.5:resources (default-resources) @ accumulo-examples-instamo
---
[INFO] Copying 1 resource
[INFO] 
[INFO] --- maven-compiler-plugin:2.0.2:compile (default-compile) @ accumulo-examples-instamo
---
[INFO] Compiling 2 source files to <https://builds.apache.org/job/Accumulo-1.5-Hadoop-2.0/ws/accumulo-1.5/examples/instamo/target/classes>
[debug] execute contextualize
[INFO] [WARNING] Using platform encoding (ANSI_X3.4-1968 actually) to copy filtered resources,
i.e. build is platform dependent!
[INFO] skip non existing resourceDirectory <https://builds.apache.org/job/Accumulo-1.5-Hadoop-2.0/ws/accumulo-1.5/examples/instamo/src/test/resources>

[INFO] --- maven-resources-plugin:2.5:testResources (default-testResources) @ accumulo-examples-instamo
---
[INFO] Compiling 1 source file to <https://builds.apache.org/job/Accumulo-1.5-Hadoop-2.0/ws/accumulo-1.5/examples/instamo/target/test-classes>
[INFO] 
[INFO] --- maven-compiler-plugin:2.0.2:testCompile (default-testCompile) @ accumulo-examples-instamo
---
[INFO] 
[INFO] --- maven-surefire-plugin:2.10:test (default-test) @ accumulo-examples-instamo ---
[INFO] Surefire report directory: <https://builds.apache.org/job/Accumulo-1.5-Hadoop-2.0/ws/accumulo-1.5/examples/instamo/target/surefire-reports>

-------------------------------------------------------
 T E S T S
-------------------------------------------------------
Running org.apache.accumulo.instamo.ExampleAccumuloUnitTest
r1 cf1:cq1 [] 1363432771559 false v1
r1 cf1:cq2 [] 1363432771559 false v3
Tests run: 1, Failures: 0, Errors: 0, Skipped: 0, Time elapsed: 14.263 sec

Results :

Tests run: 1, Failures: 0, Errors: 0, Skipped: 0

[JENKINS] Recording test results
[INFO] 
[INFO] --- maven-jar-plugin:2.3.2:jar (default-jar) @ accumulo-examples-instamo ---
[INFO] Building jar: <https://builds.apache.org/job/Accumulo-1.5-Hadoop-2.0/ws/accumulo-1.5/examples/instamo/target/accumulo-examples-instamo-1.5.0-SNAPSHOT.jar>
[INFO]                                                                         
[INFO] ------------------------------------------------------------------------
[INFO] Building Proxy 1.5.0-SNAPSHOT
[INFO] ------------------------------------------------------------------------
[INFO] [INFO] Deleting <https://builds.apache.org/job/Accumulo-1.5-Hadoop-2.0/ws/accumulo-1.5/proxy>
(includes = [**/*.pyc], excludes = [])

[INFO] --- maven-clean-plugin:2.5:clean (default-clean) @ accumulo-proxy ---
[INFO] [INFO] Checking for local modifications: skipped.
[INFO] Updating project files from SCM: skipped.
[INFO] Executing: /bin/sh -c cd <https://builds.apache.org/job/Accumulo-1.5-Hadoop-2.0/ws/accumulo-1.5/proxy>
&& svn --non-interactive info
[INFO] Working directory: <https://builds.apache.org/job/Accumulo-1.5-Hadoop-2.0/ws/accumulo-1.5/proxy>
[INFO] Storing buildNumber: 1457239 at timestamp: 1363432774313
[INFO] Executing: /bin/sh -c cd <https://builds.apache.org/job/Accumulo-1.5-Hadoop-2.0/ws/accumulo-1.5/proxy>
&& svn --non-interactive info
[INFO] Working directory: <https://builds.apache.org/job/Accumulo-1.5-Hadoop-2.0/ws/accumulo-1.5/proxy>
[INFO] Storing buildScmBranch: branches/1.5/proxy

[INFO] --- buildnumber-maven-plugin:1.1:create (default) @ accumulo-proxy ---
[INFO] 
[INFO] --- maven-enforcer-plugin:1.0.1:enforce (enforce-mvn) @ accumulo-proxy ---
[INFO] 
[INFO] --- exec-maven-plugin:1.2.1:exec (generate-thrift) @ accumulo-proxy ---
cp -f target/gen-java/org/apache/accumulo/proxy/thrift/IteratorSetting.java-with-license src/main/java/org/apache/accumulo/proxy/thrift/IteratorSetting.java
[INFO] 
[INFO] --- maven-remote-resources-plugin:1.3:process (default) @ accumulo-proxy ---
[INFO] [debug] execute contextualize
[INFO] Using 'UTF-8' encoding to copy filtered resources.
[INFO] skip non existing resourceDirectory <https://builds.apache.org/job/Accumulo-1.5-Hadoop-2.0/ws/accumulo-1.5/proxy/src/main/resources>
[INFO] Copying 3 resources

[INFO] --- maven-resources-plugin:2.5:resources (default-resources) @ accumulo-proxy ---
[INFO] [INFO] Copying guava-13.0.1.jar to <https://builds.apache.org/job/Accumulo-1.5-Hadoop-2.0/ws/accumulo-1.5/lib/guava-13.0.1.jar>
[INFO] libthrift-0.9.0.jar already exists in destination.
[INFO] jcommander-1.30.jar already exists in destination.

[INFO] --- maven-dependency-plugin:2.3:copy-dependencies (copy-dependencies) @ accumulo-proxy
---
[INFO] [INFO] Compiling 37 source files to <https://builds.apache.org/job/Accumulo-1.5-Hadoop-2.0/ws/accumulo-1.5/proxy/target/classes>

[INFO] --- maven-compiler-plugin:2.3.2:compile (default-compile) @ accumulo-proxy ---
[debug] execute contextualize
[INFO] [INFO] Using 'UTF-8' encoding to copy filtered resources.
[INFO] skip non existing resourceDirectory <https://builds.apache.org/job/Accumulo-1.5-Hadoop-2.0/ws/accumulo-1.5/proxy/src/test/resources>
[INFO] Copying 3 resources

[INFO] --- maven-resources-plugin:2.5:testResources (default-testResources) @ accumulo-proxy
---
[INFO] [INFO] Compiling 5 source files to <https://builds.apache.org/job/Accumulo-1.5-Hadoop-2.0/ws/accumulo-1.5/proxy/target/test-classes>

[INFO] --- maven-compiler-plugin:2.3.2:testCompile (default-testCompile) @ accumulo-proxy
---
[INFO] Surefire report directory: <https://builds.apache.org/job/Accumulo-1.5-Hadoop-2.0/ws/accumulo-1.5/proxy/target/surefire-reports>
[INFO] 
-------------------------------------------------------
 T E S T S
-------------------------------------------------------

[INFO] --- maven-surefire-plugin:2.12:test (default-test) @ accumulo-proxy ---
Running org.apache.accumulo.proxy.TestProxySecurityOperations
Tests run: 5, Failures: 0, Errors: 0, Skipped: 0, Time elapsed: 0.806 sec
Running org.apache.accumulo.proxy.TestProxyTableOperations
Tests run: 6, Failures: 0, Errors: 0, Skipped: 0, Time elapsed: 0.158 sec
Running org.apache.accumulo.proxy.SimpleTest
Tests run: 3, Failures: 0, Errors: 0, Skipped: 0, Time elapsed: 47.733 sec
Running org.apache.accumulo.proxy.TestProxyReadWrite
Tests run: 6, Failures: 0, Errors: 0, Skipped: 0, Time elapsed: 4.038 sec
Running org.apache.accumulo.proxy.TestProxyInstanceOperations
Tests run: 2, Failures: 0, Errors: 0, Skipped: 0, Time elapsed: 0.079 sec

Results :

Tests run: 22, Failures: 0, Errors: 0, Skipped: 0

[INFO] ------------------------------------------------------------------------
[INFO] Reactor Summary:
[INFO] 
[INFO] Apache Accumulo ................................... SUCCESS [26.509s]
[INFO] Trace ............................................. SUCCESS [15.978s]
[INFO] Start ............................................. SUCCESS [36.854s]
[INFO] Fate .............................................. SUCCESS [4.156s]
[INFO] Core .............................................. SUCCESS [51.095s]
[INFO] Server ............................................ SUCCESS [20.561s]
[INFO] Examples .......................................... SUCCESS [1.751s]
[INFO] Simple Examples ................................... SUCCESS [12.195s]
[INFO] Testing ........................................... SUCCESS [54.775s]
[INFO] Instamo Example ................................... SUCCESS [19.887s]
[INFO] Proxy ............................................. FAILURE [1:06.208s]
[INFO] Assemble .......................................... SKIPPED
[INFO] ------------------------------------------------------------------------
[INFO] BUILD FAILURE
[INFO] ------------------------------------------------------------------------
[INFO] Total time: 5:14.394s
[INFO] Finished at: Sat Mar 16 11:20:40 UTC 2013
[INFO] Final Memory: 142M/432M
[INFO] ------------------------------------------------------------------------
[JENKINS] Archiving <https://builds.apache.org/job/Accumulo-1.5-Hadoop-2.0/ws/accumulo-1.5/assemble/pom.xml>
to /home/hudson/hudson/jobs/Accumulo-1.5-Hadoop-2.0/modules/org.apache.accumulo$accumulo-assemble/builds/2013-03-16_11-15-07/archive/org.apache.accumulo/accumulo-assemble/1.5.0-SNAPSHOT/accumulo-assemble-1.5.0-SNAPSHOT.pom
[JENKINS] Archiving <https://builds.apache.org/job/Accumulo-1.5-Hadoop-2.0/ws/accumulo-1.5/server/pom.xml>
to /home/hudson/hudson/jobs/Accumulo-1.5-Hadoop-2.0/modules/org.apache.accumulo$accumulo-server/builds/2013-03-16_11-15-07/archive/org.apache.accumulo/accumulo-server/1.5.0-SNAPSHOT/accumulo-server-1.5.0-SNAPSHOT.pom
[JENKINS] Archiving <https://builds.apache.org/job/Accumulo-1.5-Hadoop-2.0/ws/accumulo-1.5/lib/accumulo-server-1.5.0-SNAPSHOT.jar>
to /home/hudson/hudson/jobs/Accumulo-1.5-Hadoop-2.0/modules/org.apache.accumulo$accumulo-server/builds/2013-03-16_11-15-07/archive/org.apache.accumulo/accumulo-server/1.5.0-SNAPSHOT/accumulo-server-1.5.0-SNAPSHOT.jar
[JENKINS] Archiving <https://builds.apache.org/job/Accumulo-1.5-Hadoop-2.0/ws/accumulo-1.5/lib/accumulo-server-1.5.0-SNAPSHOT-sources.jar>
to /home/hudson/hudson/jobs/Accumulo-1.5-Hadoop-2.0/modules/org.apache.accumulo$accumulo-server/builds/2013-03-16_11-15-07/archive/org.apache.accumulo/accumulo-server/1.5.0-SNAPSHOT/accumulo-server-1.5.0-SNAPSHOT-sources.jar
[JENKINS] Archiving <https://builds.apache.org/job/Accumulo-1.5-Hadoop-2.0/ws/accumulo-1.5/lib/accumulo-server-1.5.0-SNAPSHOT-test-sources.jar>
to /home/hudson/hudson/jobs/Accumulo-1.5-Hadoop-2.0/modules/org.apache.accumulo$accumulo-server/builds/2013-03-16_11-15-07/archive/org.apache.accumulo/accumulo-server/1.5.0-SNAPSHOT/accumulo-server-1.5.0-SNAPSHOT-test-sources.jar
[JENKINS] Archiving <https://builds.apache.org/job/Accumulo-1.5-Hadoop-2.0/ws/accumulo-1.5/examples/simple/pom.xml>
to /home/hudson/hudson/jobs/Accumulo-1.5-Hadoop-2.0/modules/org.apache.accumulo$accumulo-examples-simple/builds/2013-03-16_11-15-07/archive/org.apache.accumulo/accumulo-examples-simple/1.5.0-SNAPSHOT/accumulo-examples-simple-1.5.0-SNAPSHOT.pom
[JENKINS] Archiving <https://builds.apache.org/job/Accumulo-1.5-Hadoop-2.0/ws/accumulo-1.5/lib/accumulo-examples-simple-1.5.0-SNAPSHOT.jar>
to /home/hudson/hudson/jobs/Accumulo-1.5-Hadoop-2.0/modules/org.apache.accumulo$accumulo-examples-simple/builds/2013-03-16_11-15-07/archive/org.apache.accumulo/accumulo-examples-simple/1.5.0-SNAPSHOT/accumulo-examples-simple-1.5.0-SNAPSHOT.jar
[JENKINS] Archiving <https://builds.apache.org/job/Accumulo-1.5-Hadoop-2.0/ws/accumulo-1.5/lib/accumulo-examples-simple-1.5.0-SNAPSHOT-sources.jar>
to /home/hudson/hudson/jobs/Accumulo-1.5-Hadoop-2.0/modules/org.apache.accumulo$accumulo-examples-simple/builds/2013-03-16_11-15-07/archive/org.apache.accumulo/accumulo-examples-simple/1.5.0-SNAPSHOT/accumulo-examples-simple-1.5.0-SNAPSHOT-sources.jar
[JENKINS] Archiving <https://builds.apache.org/job/Accumulo-1.5-Hadoop-2.0/ws/accumulo-1.5/lib/accumulo-examples-simple-1.5.0-SNAPSHOT-test-sources.jar>
to /home/hudson/hudson/jobs/Accumulo-1.5-Hadoop-2.0/modules/org.apache.accumulo$accumulo-examples-simple/builds/2013-03-16_11-15-07/archive/org.apache.accumulo/accumulo-examples-simple/1.5.0-SNAPSHOT/accumulo-examples-simple-1.5.0-SNAPSHOT-test-sources.jar
[JENKINS] Archiving <https://builds.apache.org/job/Accumulo-1.5-Hadoop-2.0/ws/accumulo-1.5/proxy/pom.xml>
to /home/hudson/hudson/jobs/Accumulo-1.5-Hadoop-2.0/modules/org.apache.accumulo$accumulo-proxy/builds/2013-03-16_11-15-07/archive/org.apache.accumulo/accumulo-proxy/1.5.0-SNAPSHOT/accumulo-proxy-1.5.0-SNAPSHOT.pom
[JENKINS] Archiving <https://builds.apache.org/job/Accumulo-1.5-Hadoop-2.0/ws/accumulo-1.5/examples/pom.xml>
to /home/hudson/hudson/jobs/Accumulo-1.5-Hadoop-2.0/modules/org.apache.accumulo$accumulo-examples/builds/2013-03-16_11-15-07/archive/org.apache.accumulo/accumulo-examples/1.5.0-SNAPSHOT/accumulo-examples-1.5.0-SNAPSHOT.pom
[JENKINS] Archiving <https://builds.apache.org/job/Accumulo-1.5-Hadoop-2.0/ws/accumulo-1.5/pom.xml>
to /home/hudson/hudson/jobs/Accumulo-1.5-Hadoop-2.0/modules/org.apache.accumulo$accumulo/builds/2013-03-16_11-15-07/archive/org.apache.accumulo/accumulo/1.5.0-SNAPSHOT/accumulo-1.5.0-SNAPSHOT.pom
[JENKINS] Archiving <https://builds.apache.org/job/Accumulo-1.5-Hadoop-2.0/ws/accumulo-1.5/target/accumulo-1.5.0-SNAPSHOT-site.xml>
to /home/hudson/hudson/jobs/Accumulo-1.5-Hadoop-2.0/modules/org.apache.accumulo$accumulo/builds/2013-03-16_11-15-07/archive/org.apache.accumulo/accumulo/1.5.0-SNAPSHOT/accumulo-1.5.0-SNAPSHOT-site.xml
[JENKINS] Archiving <https://builds.apache.org/job/Accumulo-1.5-Hadoop-2.0/ws/accumulo-1.5/test/pom.xml>
to /home/hudson/hudson/jobs/Accumulo-1.5-Hadoop-2.0/modules/org.apache.accumulo$accumulo-test/builds/2013-03-16_11-15-08/archive/org.apache.accumulo/accumulo-test/1.5.0-SNAPSHOT/accumulo-test-1.5.0-SNAPSHOT.pom
[JENKINS] Archiving <https://builds.apache.org/job/Accumulo-1.5-Hadoop-2.0/ws/accumulo-1.5/lib/accumulo-test-1.5.0-SNAPSHOT.jar>
to /home/hudson/hudson/jobs/Accumulo-1.5-Hadoop-2.0/modules/org.apache.accumulo$accumulo-test/builds/2013-03-16_11-15-08/archive/org.apache.accumulo/accumulo-test/1.5.0-SNAPSHOT/accumulo-test-1.5.0-SNAPSHOT.jar
[JENKINS] Archiving <https://builds.apache.org/job/Accumulo-1.5-Hadoop-2.0/ws/accumulo-1.5/lib/accumulo-test-1.5.0-SNAPSHOT-sources.jar>
to /home/hudson/hudson/jobs/Accumulo-1.5-Hadoop-2.0/modules/org.apache.accumulo$accumulo-test/builds/2013-03-16_11-15-08/archive/org.apache.accumulo/accumulo-test/1.5.0-SNAPSHOT/accumulo-test-1.5.0-SNAPSHOT-sources.jar
[JENKINS] Archiving <https://builds.apache.org/job/Accumulo-1.5-Hadoop-2.0/ws/accumulo-1.5/lib/accumulo-test-1.5.0-SNAPSHOT-test-sources.jar>
to /home/hudson/hudson/jobs/Accumulo-1.5-Hadoop-2.0/modules/org.apache.accumulo$accumulo-test/builds/2013-03-16_11-15-08/archive/org.apache.accumulo/accumulo-test/1.5.0-SNAPSHOT/accumulo-test-1.5.0-SNAPSHOT-test-sources.jar
[JENKINS] Archiving <https://builds.apache.org/job/Accumulo-1.5-Hadoop-2.0/ws/accumulo-1.5/start/pom.xml>
to /home/hudson/hudson/jobs/Accumulo-1.5-Hadoop-2.0/modules/org.apache.accumulo$accumulo-start/builds/2013-03-16_11-15-07/archive/org.apache.accumulo/accumulo-start/1.5.0-SNAPSHOT/accumulo-start-1.5.0-SNAPSHOT.pom
[JENKINS] Archiving <https://builds.apache.org/job/Accumulo-1.5-Hadoop-2.0/ws/accumulo-1.5/lib/accumulo-start-1.5.0-SNAPSHOT.jar>
to /home/hudson/hudson/jobs/Accumulo-1.5-Hadoop-2.0/modules/org.apache.accumulo$accumulo-start/builds/2013-03-16_11-15-07/archive/org.apache.accumulo/accumulo-start/1.5.0-SNAPSHOT/accumulo-start-1.5.0-SNAPSHOT.jar
[JENKINS] Archiving <https://builds.apache.org/job/Accumulo-1.5-Hadoop-2.0/ws/accumulo-1.5/lib/accumulo-start-1.5.0-SNAPSHOT-sources.jar>
to /home/hudson/hudson/jobs/Accumulo-1.5-Hadoop-2.0/modules/org.apache.accumulo$accumulo-start/builds/2013-03-16_11-15-07/archive/org.apache.accumulo/accumulo-start/1.5.0-SNAPSHOT/accumulo-start-1.5.0-SNAPSHOT-sources.jar
[JENKINS] Archiving <https://builds.apache.org/job/Accumulo-1.5-Hadoop-2.0/ws/accumulo-1.5/lib/accumulo-start-1.5.0-SNAPSHOT-test-sources.jar>
to /home/hudson/hudson/jobs/Accumulo-1.5-Hadoop-2.0/modules/org.apache.accumulo$accumulo-start/builds/2013-03-16_11-15-07/archive/org.apache.accumulo/accumulo-start/1.5.0-SNAPSHOT/accumulo-start-1.5.0-SNAPSHOT-test-sources.jar
[JENKINS] Archiving <https://builds.apache.org/job/Accumulo-1.5-Hadoop-2.0/ws/accumulo-1.5/fate/pom.xml>
to /home/hudson/hudson/jobs/Accumulo-1.5-Hadoop-2.0/modules/org.apache.accumulo$accumulo-fate/builds/2013-03-16_11-15-07/archive/org.apache.accumulo/accumulo-fate/1.5.0-SNAPSHOT/accumulo-fate-1.5.0-SNAPSHOT.pom
[JENKINS] Archiving <https://builds.apache.org/job/Accumulo-1.5-Hadoop-2.0/ws/accumulo-1.5/lib/accumulo-fate-1.5.0-SNAPSHOT.jar>
to /home/hudson/hudson/jobs/Accumulo-1.5-Hadoop-2.0/modules/org.apache.accumulo$accumulo-fate/builds/2013-03-16_11-15-07/archive/org.apache.accumulo/accumulo-fate/1.5.0-SNAPSHOT/accumulo-fate-1.5.0-SNAPSHOT.jar
[JENKINS] Archiving <https://builds.apache.org/job/Accumulo-1.5-Hadoop-2.0/ws/accumulo-1.5/lib/accumulo-fate-1.5.0-SNAPSHOT-sources.jar>
to /home/hudson/hudson/jobs/Accumulo-1.5-Hadoop-2.0/modules/org.apache.accumulo$accumulo-fate/builds/2013-03-16_11-15-07/archive/org.apache.accumulo/accumulo-fate/1.5.0-SNAPSHOT/accumulo-fate-1.5.0-SNAPSHOT-sources.jar
[JENKINS] Archiving <https://builds.apache.org/job/Accumulo-1.5-Hadoop-2.0/ws/accumulo-1.5/lib/accumulo-fate-1.5.0-SNAPSHOT-test-sources.jar>
to /home/hudson/hudson/jobs/Accumulo-1.5-Hadoop-2.0/modules/org.apache.accumulo$accumulo-fate/builds/2013-03-16_11-15-07/archive/org.apache.accumulo/accumulo-fate/1.5.0-SNAPSHOT/accumulo-fate-1.5.0-SNAPSHOT-test-sources.jar
[JENKINS] Archiving <https://builds.apache.org/job/Accumulo-1.5-Hadoop-2.0/ws/accumulo-1.5/core/pom.xml>
to /home/hudson/hudson/jobs/Accumulo-1.5-Hadoop-2.0/modules/org.apache.accumulo$accumulo-core/builds/2013-03-16_11-15-07/archive/org.apache.accumulo/accumulo-core/1.5.0-SNAPSHOT/accumulo-core-1.5.0-SNAPSHOT.pom
[JENKINS] Archiving <https://builds.apache.org/job/Accumulo-1.5-Hadoop-2.0/ws/accumulo-1.5/lib/accumulo-core-1.5.0-SNAPSHOT.jar>
to /home/hudson/hudson/jobs/Accumulo-1.5-Hadoop-2.0/modules/org.apache.accumulo$accumulo-core/builds/2013-03-16_11-15-07/archive/org.apache.accumulo/accumulo-core/1.5.0-SNAPSHOT/accumulo-core-1.5.0-SNAPSHOT.jar
[JENKINS] Archiving <https://builds.apache.org/job/Accumulo-1.5-Hadoop-2.0/ws/accumulo-1.5/lib/accumulo-core-1.5.0-SNAPSHOT-sources.jar>
to /home/hudson/hudson/jobs/Accumulo-1.5-Hadoop-2.0/modules/org.apache.accumulo$accumulo-core/builds/2013-03-16_11-15-07/archive/org.apache.accumulo/accumulo-core/1.5.0-SNAPSHOT/accumulo-core-1.5.0-SNAPSHOT-sources.jar
[JENKINS] Archiving <https://builds.apache.org/job/Accumulo-1.5-Hadoop-2.0/ws/accumulo-1.5/lib/accumulo-core-1.5.0-SNAPSHOT-test-sources.jar>
to /home/hudson/hudson/jobs/Accumulo-1.5-Hadoop-2.0/modules/org.apache.accumulo$accumulo-core/builds/2013-03-16_11-15-07/archive/org.apache.accumulo/accumulo-core/1.5.0-SNAPSHOT/accumulo-core-1.5.0-SNAPSHOT-test-sources.jar
[JENKINS] Archiving <https://builds.apache.org/job/Accumulo-1.5-Hadoop-2.0/ws/accumulo-1.5/trace/pom.xml>
to /home/hudson/hudson/jobs/Accumulo-1.5-Hadoop-2.0/modules/org.apache.accumulo$accumulo-trace/builds/2013-03-16_11-15-07/archive/org.apache.accumulo/accumulo-trace/1.5.0-SNAPSHOT/accumulo-trace-1.5.0-SNAPSHOT.pom
[JENKINS] Archiving <https://builds.apache.org/job/Accumulo-1.5-Hadoop-2.0/ws/accumulo-1.5/lib/accumulo-trace-1.5.0-SNAPSHOT.jar>
to /home/hudson/hudson/jobs/Accumulo-1.5-Hadoop-2.0/modules/org.apache.accumulo$accumulo-trace/builds/2013-03-16_11-15-07/archive/org.apache.accumulo/accumulo-trace/1.5.0-SNAPSHOT/accumulo-trace-1.5.0-SNAPSHOT.jar
[JENKINS] Archiving <https://builds.apache.org/job/Accumulo-1.5-Hadoop-2.0/ws/accumulo-1.5/lib/accumulo-trace-1.5.0-SNAPSHOT-sources.jar>
to /home/hudson/hudson/jobs/Accumulo-1.5-Hadoop-2.0/modules/org.apache.accumulo$accumulo-trace/builds/2013-03-16_11-15-07/archive/org.apache.accumulo/accumulo-trace/1.5.0-SNAPSHOT/accumulo-trace-1.5.0-SNAPSHOT-sources.jar
[JENKINS] Archiving <https://builds.apache.org/job/Accumulo-1.5-Hadoop-2.0/ws/accumulo-1.5/lib/accumulo-trace-1.5.0-SNAPSHOT-test-sources.jar>
to /home/hudson/hudson/jobs/Accumulo-1.5-Hadoop-2.0/modules/org.apache.accumulo$accumulo-trace/builds/2013-03-16_11-15-07/archive/org.apache.accumulo/accumulo-trace/1.5.0-SNAPSHOT/accumulo-trace-1.5.0-SNAPSHOT-test-sources.jar
[JENKINS] Archiving <https://builds.apache.org/job/Accumulo-1.5-Hadoop-2.0/ws/accumulo-1.5/examples/instamo/pom.xml>
to /home/hudson/hudson/jobs/Accumulo-1.5-Hadoop-2.0/modules/org.apache.accumulo$accumulo-examples-instamo/builds/2013-03-16_11-15-07/archive/org.apache.accumulo/accumulo-examples-instamo/1.5.0-SNAPSHOT/accumulo-examples-instamo-1.5.0-SNAPSHOT.pom
[JENKINS] Archiving <https://builds.apache.org/job/Accumulo-1.5-Hadoop-2.0/ws/accumulo-1.5/examples/instamo/target/accumulo-examples-instamo-1.5.0-SNAPSHOT.jar>
to /home/hudson/hudson/jobs/Accumulo-1.5-Hadoop-2.0/modules/org.apache.accumulo$accumulo-examples-instamo/builds/2013-03-16_11-15-07/archive/org.apache.accumulo/accumulo-examples-instamo/1.5.0-SNAPSHOT/accumulo-examples-instamo-1.5.0-SNAPSHOT.jar
Waiting for Jenkins to finish collecting data
mavenExecutionResult exceptions not empty
message : Internal error: java.lang.reflect.UndeclaredThrowableException
cause : null
Stack trace : 
org.apache.maven.InternalErrorException: Internal error: java.lang.reflect.UndeclaredThrowableException
	at org.apache.maven.lifecycle.internal.BuilderCommon.handleBuildError(BuilderCommon.java:128)
	at org.apache.maven.lifecycle.internal.LifecycleModuleBuilder.buildProject(LifecycleModuleBuilder.java:95)
	at org.apache.maven.lifecycle.internal.LifecycleModuleBuilder.buildProject(LifecycleModuleBuilder.java:59)
	at org.apache.maven.lifecycle.internal.LifecycleStarter.singleThreadedBuild(LifecycleStarter.java:183)
	at org.apache.maven.lifecycle.internal.LifecycleStarter.execute(LifecycleStarter.java:161)
	at org.apache.maven.DefaultMaven.doExecute(DefaultMaven.java:320)
	at org.apache.maven.DefaultMaven.execute(DefaultMaven.java:156)
	at org.jvnet.hudson.maven3.launcher.Maven3Launcher.main(Maven3Launcher.java:79)
	at sun.reflect.NativeMethodAccessorImpl.invoke0(Native Method)
	at sun.reflect.NativeMethodAccessorImpl.invoke(NativeMethodAccessorImpl.java:39)
	at sun.reflect.DelegatingMethodAccessorImpl.invoke(DelegatingMethodAccessorImpl.java:25)
	at java.lang.reflect.Method.invoke(Method.java:597)
	at org.codehaus.plexus.classworlds.launcher.Launcher.launchStandard(Launcher.java:329)
	at org.codehaus.plexus.classworlds.launcher.Launcher.launch(Launcher.java:239)
	at org.jvnet.hudson.maven3.agent.Maven3Main.launch(Maven3Main.java:158)
	at hudson.maven.Maven3Builder.call(Maven3Builder.java:100)
	at hudson.maven.Maven3Builder.call(Maven3Builder.java:66)
	at hudson.remoting.UserRequest.perform(UserRequest.java:118)
	at hudson.remoting.UserRequest.perform(UserRequest.java:48)
	at hudson.remoting.Request$2.run(Request.java:326)
	at hudson.remoting.InterceptingExecutorService$1.call(InterceptingExecutorService.java:72)
	at java.util.concurrent.FutureTask$Sync.innerRun(FutureTask.java:303)
	at java.util.concurrent.FutureTask.run(FutureTask.java:138)
	at java.util.concurrent.ThreadPoolExecutor$Worker.runTask(ThreadPoolExecutor.java:886)
	at java.util.concurrent.ThreadPoolExecutor$Worker.run(ThreadPoolExecutor.java:908)
	at java.lang.Thread.run(Thread.java:662)
Caused by: java.lang.reflect.UndeclaredThrowableException
	at $Proxy2.setExecutedMojos(Unknown Source)
	at hudson.maven.MavenBuildProxy$Filter.setExecutedMojos(MavenBuildProxy.java:243)
	at hudson.maven.Maven3Builder$MavenExecutionListener.recordMojoEnded(Maven3Builder.java:439)
	at hudson.maven.Maven3Builder$MavenExecutionListener.mojoSucceeded(Maven3Builder.java:425)
	at org.apache.maven.lifecycle.internal.DefaultExecutionEventCatapult.fire(DefaultExecutionEventCatapult.java:87)
	at org.apache.maven.lifecycle.internal.DefaultExecutionEventCatapult.fire(DefaultExecutionEventCatapult.java:42)
	at org.apache.maven.lifecycle.internal.MojoExecutor.execute(MojoExecutor.java:228)
	at org.apache.maven.lifecycle.internal.MojoExecutor.execute(MojoExecutor.java:153)
	at org.apache.maven.lifecycle.internal.MojoExecutor.execute(MojoExecutor.java:145)
	at org.apache.maven.lifecycle.internal.LifecycleModuleBuilder.buildProject(LifecycleModuleBuilder.java:84)
	... 24 more
Caused by: java.io.StreamCorruptedException: invalid handle value: 007E4D2F
	at java.io.ObjectInputStream.readHandle(ObjectInputStream.java:1451)
	at java.io.ObjectInputStream.readTypeString(ObjectInputStream.java:1415)
	at java.io.ObjectStreamClass.readNonProxy(ObjectStreamClass.java:692)
	at java.io.ObjectInputStream.readClassDescriptor(ObjectInputStream.java:827)
	at java.io.ObjectInputStream.readNonProxyDesc(ObjectInputStream.java:1583)
	at java.io.ObjectInputStream.readClassDesc(ObjectInputStream.java:1514)
	at java.io.ObjectInputStream.readOrdinaryObject(ObjectInputStream.java:1750)
	at java.io.ObjectInputStream.readObject0(ObjectInputStream.java:1347)
	at java.io.ObjectInputStream.readObject(ObjectInputStream.java:369)
	at java.util.concurrent.CopyOnWriteArrayList.readObject(CopyOnWriteArrayList.java:879)
	at sun.reflect.GeneratedMethodAccessor11440.invoke(Unknown Source)
	at sun.reflect.DelegatingMethodAccessorImpl.invoke(DelegatingMethodAccessorImpl.java:43)
	at java.lang.reflect.Method.invoke(Method.java:601)
	at java.io.ObjectStreamClass.invokeReadObject(ObjectStreamClass.java:1004)
	at java.io.ObjectInputStream.readSerialData(ObjectInputStream.java:1872)
	at java.io.ObjectInputStream.readOrdinaryObject(ObjectInputStream.java:1777)
	at java.io.ObjectInputStream.readObject0(ObjectInputStream.java:1347)
	at java.io.ObjectInputStream.readArray(ObjectInputStream.java:1685)
	at java.io.ObjectInputStream.readObject0(ObjectInputStream.java:1341)
	at java.io.ObjectInputStream.defaultReadFields(ObjectInputStream.java:1970)
	at java.io.ObjectInputStream.readSerialData(ObjectInputStream.java:1894)
	at java.io.ObjectInputStream.readOrdinaryObject(ObjectInputStream.java:1777)
	at java.io.ObjectInputStream.readObject0(ObjectInputStream.java:1347)
	at java.io.ObjectInputStream.readObject(ObjectInputStream.java:369)
	at hudson.remoting.UserRequest.deserialize(UserRequest.java:182)
	at hudson.remoting.UserRequest.perform(UserRequest.java:98)
	at hudson.remoting.UserRequest.perform(UserRequest.java:48)
	at hudson.remoting.Request$2.run(Request.java:326)
	at hudson.remoting.InterceptingExecutorService$1.call(InterceptingExecutorService.java:72)
	at java.util.concurrent.FutureTask$Sync.innerRun(FutureTask.java:334)
	at java.util.concurrent.FutureTask.run(FutureTask.java:166)
	at java.util.concurrent.ThreadPoolExecutor.runWorker(ThreadPoolExecutor.java:1145)
	at java.util.concurrent.ThreadPoolExecutor$Worker.run(ThreadPoolExecutor.java:615)
	at java.lang.Thread.run(Thread.java:722)
Maven failed with error.
Sending e-mails to: notifications@accumulo.apache.org
Sending e-mails to: notifications@accumulo.apache.org
Sending e-mails to: notifications@accumulo.apache.org
channel stopped
Updating ACCUMULO-892

Mime
View raw message