accumulo-notifications mailing list archives

Site index · List index
Message view « Date » · « Thread »
Top « Date » · « Thread »
From Apache Jenkins Server <jenk...@builds.apache.org>
Subject Build failed in Jenkins: Accumulo-Trunk-Hadoop-2.0 #102
Date Mon, 25 Feb 2013 23:24:25 GMT
See <https://builds.apache.org/job/Accumulo-Trunk-Hadoop-2.0/102/changes>

Changes:

[ecn] ACCUMULO-1105 fix issues with random walk tests

[vines] ACCUMULO-670 ACCUMULO-765 - merging 1449793 to trunk. Plus a little extra, it looks
like?

------------------------------------------
[...truncated 3671 lines...]
[INFO] --- maven-remote-resources-plugin:1.3:process (default) @ accumulo-server ---
[debug] execute contextualize
[INFO] Using 'UTF-8' encoding to copy filtered resources.
[INFO] [INFO] Copying 38 resources
[INFO] Copying 3 resources
[INFO] Copying 3 resources

[INFO] --- maven-resources-plugin:2.5:resources (default-resources) @ accumulo-server ---
[INFO] commons-collections-3.2.jar already exists in destination.
[INFO] [INFO] commons-lang-2.4.jar already exists in destination.
[INFO] commons-io-1.4.jar already exists in destination.
[INFO] libthrift-0.9.0.jar already exists in destination.
[INFO] gson-2.2.2.jar already exists in destination.
[INFO] log4j-1.2.16.jar already exists in destination.
[INFO] commons-configuration-1.5.jar already exists in destination.
[INFO] jline-0.9.94.jar already exists in destination.

[INFO] --- maven-dependency-plugin:2.3:copy-dependencies (copy-dependencies) @ accumulo-server
---
[INFO] 
[INFO] --- maven-compiler-plugin:2.3.2:compile (default-compile) @ accumulo-server ---
[INFO] Compiling 1 source file to <https://builds.apache.org/job/Accumulo-Trunk-Hadoop-2.0/ws/accumulo-trunk/server/target/classes>
[INFO] 
[INFO] --- cobertura-maven-plugin:2.5.2:instrument (default-cli) @ accumulo-server ---
[INFO] Cobertura 1.9.4.1 - GNU GPL License (NO WARRANTY) - See COPYRIGHT file
Instrumenting 572 files to <https://builds.apache.org/job/Accumulo-Trunk-Hadoop-2.0/ws/accumulo-trunk/server/target/generated-classes/cobertura>
[cobertura] WARN  [main] net.sourceforge.cobertura.instrument.ClassInstrumenter - No line
number information found for class org.apache.accumulo.server.monitor.servlets.trace.Summary$1.
 Perhaps you need to compile with debug=true?
[cobertura] WARN  [main] net.sourceforge.cobertura.instrument.ClassInstrumenter - No line
number information found for class org.apache.accumulo.server.monitor.servlets.trace.ListType$1.
 Perhaps you need to compile with debug=true?
[cobertura] WARN  [main] net.sourceforge.cobertura.instrument.ClassInstrumenter - No line
number information found for class org.apache.accumulo.server.monitor.servlets.ShellServlet$1.
 Perhaps you need to compile with debug=true?
[cobertura] WARN  [main] net.sourceforge.cobertura.instrument.ClassInstrumenter - No line
number information found for class org.apache.accumulo.server.monitor.servlets.LogServlet$1.
 Perhaps you need to compile with debug=true?
[cobertura] WARN  [main] net.sourceforge.cobertura.instrument.ClassInstrumenter - No line
number information found for class org.apache.accumulo.server.util.SendLogToChainsaw$1.  Perhaps
you need to compile with debug=true?
[cobertura] WARN  [main] net.sourceforge.cobertura.instrument.ClassInstrumenter - No line
number information found for class org.apache.accumulo.server.metrics.MetricsConfiguration$1.
 Perhaps you need to compile with debug=true?
[cobertura] WARN  [main] net.sourceforge.cobertura.instrument.ClassInstrumenter - No line
number information found for class org.apache.accumulo.server.tabletserver.log.SortedLogRecovery$1.
 Perhaps you need to compile with debug=true?
[cobertura] WARN  [main] net.sourceforge.cobertura.instrument.ClassInstrumenter - No line
number information found for class org.apache.accumulo.server.tabletserver.log.DfsLogger$1.
 Perhaps you need to compile with debug=true?
[cobertura] WARN  [main] net.sourceforge.cobertura.instrument.ClassInstrumenter - No line
number information found for class org.apache.accumulo.server.tabletserver.InMemoryMap$1.
 Perhaps you need to compile with debug=true?
[cobertura] WARN  [main] net.sourceforge.cobertura.instrument.ClassInstrumenter - No line
number information found for class org.apache.accumulo.server.tabletserver.FileManager$1.
 Perhaps you need to compile with debug=true?
[cobertura] WARN  [main] net.sourceforge.cobertura.instrument.ClassInstrumenter - No line
number information found for class org.apache.accumulo.server.metanalysis.LogFileInputFormat$1.
 Perhaps you need to compile with debug=true?
Cobertura: Saved information on 572 classes.
Instrument time: 1614ms

[INFO] Instrumentation was successful.
[INFO] NOT adding cobertura ser file to attached artifacts list.
[debug] execute contextualize
[INFO] [INFO] Using 'UTF-8' encoding to copy filtered resources.
[INFO] skip non existing resourceDirectory <https://builds.apache.org/job/Accumulo-Trunk-Hadoop-2.0/ws/accumulo-trunk/server/src/test/resources>
[INFO] Copying 3 resources
[INFO] Copying 3 resources

[INFO] --- maven-resources-plugin:2.5:testResources (default-testResources) @ accumulo-server
---
[INFO] [INFO] Nothing to compile - all classes are up to date

[INFO] --- maven-compiler-plugin:2.3.2:testCompile (default-testCompile) @ accumulo-server
---
[INFO] [INFO] Surefire report directory: <https://builds.apache.org/job/Accumulo-Trunk-Hadoop-2.0/ws/accumulo-trunk/server/target/surefire-reports>

-------------------------------------------------------
 T E S T S
-------------------------------------------------------

[INFO] --- maven-surefire-plugin:2.12:test (default-test) @ accumulo-server ---
Running org.apache.accumulo.server.security.handler.ZKAuthenticatorTest
Tests run: 5, Failures: 0, Errors: 0, Skipped: 0, Time elapsed: 0.126 sec
Running org.apache.accumulo.server.constraints.MetadataConstraintsTest
Tests run: 1, Failures: 0, Errors: 0, Skipped: 0, Time elapsed: 0.059 sec
Running org.apache.accumulo.server.monitor.ZooKeeperStatusTest
Tests run: 1, Failures: 0, Errors: 0, Skipped: 0, Time elapsed: 0.001 sec
Running org.apache.accumulo.server.data.ServerMutationTest
Tests run: 1, Failures: 0, Errors: 0, Skipped: 0, Time elapsed: 0.119 sec
Running org.apache.accumulo.server.util.TabletIteratorTest
Tests run: 1, Failures: 0, Errors: 0, Skipped: 0, Time elapsed: 0.369 sec
Running org.apache.accumulo.server.util.CloneTest
Tests run: 7, Failures: 0, Errors: 0, Skipped: 0, Time elapsed: 0.079 sec
Running org.apache.accumulo.server.util.DefaultMapTest
Tests run: 1, Failures: 0, Errors: 0, Skipped: 0, Time elapsed: 0.001 sec
Running org.apache.accumulo.server.util.time.BaseRelativeTimeTest
Tests run: 3, Failures: 0, Errors: 0, Skipped: 0, Time elapsed: 0.002 sec
Running org.apache.accumulo.server.client.BulkImporterTest
WARN   warnOnceIfDeprecated, dfs.block.size is deprecated. Instead, use dfs.blocksize
WARN   <clinit>, Unable to load native-hadoop library for your platform... using builtin-java
classes where applicable
Tests run: 1, Failures: 0, Errors: 0, Skipped: 0, Time elapsed: 0.127 sec
Running org.apache.accumulo.server.master.balancer.ChaoticLoadBalancerTest
Tests run: 2, Failures: 0, Errors: 0, Skipped: 0, Time elapsed: 0.017 sec
Running org.apache.accumulo.server.master.balancer.TableLoadBalancerTest
WARN   resolve, ignoring classpath entry file:///lib/ext/[^.].*.jar
Tests run: 1, Failures: 0, Errors: 0, Skipped: 0, Time elapsed: 0.093 sec
Running org.apache.accumulo.server.master.balancer.DefaultLoadBalancerTest
Tests run: 3, Failures: 0, Errors: 0, Skipped: 0, Time elapsed: 0.105 sec
Running org.apache.accumulo.server.master.DefaultMapTest
Tests run: 1, Failures: 0, Errors: 0, Skipped: 0, Time elapsed: 0 sec
Running org.apache.accumulo.server.master.state.RootTabletStateStoreTest
Tests run: 2, Failures: 0, Errors: 0, Skipped: 0, Time elapsed: 0.007 sec
Running org.apache.accumulo.server.master.state.MergeInfoTest
Tests run: 2, Failures: 0, Errors: 0, Skipped: 0, Time elapsed: 0.003 sec
Running org.apache.accumulo.server.master.TestMergeState
WARN   nextMergeState, Unexpected state: chopped tablets should be 3 was 2 merge t;p;e
Tests run: 1, Failures: 0, Errors: 0, Skipped: 0, Time elapsed: 0.046 sec
Running org.apache.accumulo.server.logger.LogFileTest
Tests run: 2, Failures: 0, Errors: 0, Skipped: 0, Time elapsed: 0.004 sec
Running org.apache.accumulo.server.tabletserver.log.SortedLogRecoveryTest
WARN   getXmlConfig, accumulo-site.xml not found on classpath
Tests run: 18, Failures: 0, Errors: 0, Skipped: 0, Time elapsed: 0.615 sec
Running org.apache.accumulo.server.tabletserver.log.MultiReaderTest
Tests run: 1, Failures: 0, Errors: 0, Skipped: 0, Time elapsed: 0.093 sec
Running org.apache.accumulo.server.tabletserver.InMemoryMapTest
Tests run: 9, Failures: 0, Errors: 0, Skipped: 0, Time elapsed: 15.055 sec
Running org.apache.accumulo.server.gc.TestConfirmDeletes
Tests run: 1, Failures: 0, Errors: 0, Skipped: 0, Time elapsed: 0.032 sec
Flushing results...
Flushing results done
Cobertura: Loaded information on 572 classes.
Cobertura: Saved information on 572 classes.

Results :

Tests run: 64, Failures: 0, Errors: 0, Skipped: 0

[INFO] ------------------------------------------------------------------------
[INFO] Reactor Summary:
[INFO] 
[INFO] Apache Accumulo ................................... SUCCESS [23.531s]
[INFO] Trace ............................................. SUCCESS [21.524s]
[INFO] Start ............................................. SUCCESS [1:09.270s]
[INFO] Fate .............................................. SUCCESS [10.714s]
[INFO] Core .............................................. SUCCESS [2:37.622s]
[INFO] Server ............................................ FAILURE [44.157s]
[INFO] Examples .......................................... SKIPPED
[INFO] Simple Examples ................................... SKIPPED
[INFO] Testing ........................................... SKIPPED
[INFO] Instamo Example ................................... SKIPPED
[INFO] Proxy ............................................. SKIPPED
[INFO] Assemble .......................................... SKIPPED
[INFO] ------------------------------------------------------------------------
[INFO] BUILD FAILURE
[INFO] ------------------------------------------------------------------------
[INFO] Total time: 5:31.219s
[INFO] Finished at: Mon Feb 25 23:23:19 UTC 2013
[INFO] Final Memory: 103M/366M
[INFO] ------------------------------------------------------------------------
[JENKINS] Archiving <https://builds.apache.org/job/Accumulo-Trunk-Hadoop-2.0/ws/accumulo-trunk/assemble/pom.xml>
to /home/hudson/hudson/jobs/Accumulo-Trunk-Hadoop-2.0/modules/org.apache.accumulo$accumulo-assemble/builds/2013-02-25_23-17-33/archive/org.apache.accumulo/accumulo-assemble/1.6.0-SNAPSHOT/accumulo-assemble-1.6.0-SNAPSHOT.pom
[JENKINS] Archiving <https://builds.apache.org/job/Accumulo-Trunk-Hadoop-2.0/ws/accumulo-trunk/server/pom.xml>
to /home/hudson/hudson/jobs/Accumulo-Trunk-Hadoop-2.0/modules/org.apache.accumulo$accumulo-server/builds/2013-02-25_23-17-33/archive/org.apache.accumulo/accumulo-server/1.6.0-SNAPSHOT/accumulo-server-1.6.0-SNAPSHOT.pom
[JENKINS] Archiving <https://builds.apache.org/job/Accumulo-Trunk-Hadoop-2.0/ws/accumulo-trunk/lib/accumulo-server-1.6.0-SNAPSHOT.jar>
to /home/hudson/hudson/jobs/Accumulo-Trunk-Hadoop-2.0/modules/org.apache.accumulo$accumulo-server/builds/2013-02-25_23-17-33/archive/org.apache.accumulo/accumulo-server/1.6.0-SNAPSHOT/accumulo-server-1.6.0-SNAPSHOT.jar
[JENKINS] Archiving <https://builds.apache.org/job/Accumulo-Trunk-Hadoop-2.0/ws/accumulo-trunk/lib/accumulo-server-1.6.0-SNAPSHOT-sources.jar>
to /home/hudson/hudson/jobs/Accumulo-Trunk-Hadoop-2.0/modules/org.apache.accumulo$accumulo-server/builds/2013-02-25_23-17-33/archive/org.apache.accumulo/accumulo-server/1.6.0-SNAPSHOT/accumulo-server-1.6.0-SNAPSHOT-sources.jar
[JENKINS] Archiving <https://builds.apache.org/job/Accumulo-Trunk-Hadoop-2.0/ws/accumulo-trunk/lib/accumulo-server-1.6.0-SNAPSHOT-test-sources.jar>
to /home/hudson/hudson/jobs/Accumulo-Trunk-Hadoop-2.0/modules/org.apache.accumulo$accumulo-server/builds/2013-02-25_23-17-33/archive/org.apache.accumulo/accumulo-server/1.6.0-SNAPSHOT/accumulo-server-1.6.0-SNAPSHOT-test-sources.jar
[JENKINS] Archiving <https://builds.apache.org/job/Accumulo-Trunk-Hadoop-2.0/ws/accumulo-trunk/examples/simple/pom.xml>
to /home/hudson/hudson/jobs/Accumulo-Trunk-Hadoop-2.0/modules/org.apache.accumulo$accumulo-examples-simple/builds/2013-02-25_23-17-33/archive/org.apache.accumulo/accumulo-examples-simple/1.6.0-SNAPSHOT/accumulo-examples-simple-1.6.0-SNAPSHOT.pom
[JENKINS] Archiving <https://builds.apache.org/job/Accumulo-Trunk-Hadoop-2.0/ws/accumulo-trunk/proxy/pom.xml>
to /home/hudson/hudson/jobs/Accumulo-Trunk-Hadoop-2.0/modules/org.apache.accumulo$accumulo-proxy/builds/2013-02-25_23-17-33/archive/org.apache.accumulo/accumulo-proxy/1.6.0-SNAPSHOT/accumulo-proxy-1.6.0-SNAPSHOT.pom
[JENKINS] Archiving <https://builds.apache.org/job/Accumulo-Trunk-Hadoop-2.0/ws/accumulo-trunk/examples/pom.xml>
to /home/hudson/hudson/jobs/Accumulo-Trunk-Hadoop-2.0/modules/org.apache.accumulo$accumulo-examples/builds/2013-02-25_23-17-33/archive/org.apache.accumulo/accumulo-examples/1.6.0-SNAPSHOT/accumulo-examples-1.6.0-SNAPSHOT.pom
[JENKINS] Archiving <https://builds.apache.org/job/Accumulo-Trunk-Hadoop-2.0/ws/accumulo-trunk/pom.xml>
to /home/hudson/hudson/jobs/Accumulo-Trunk-Hadoop-2.0/modules/org.apache.accumulo$accumulo/builds/2013-02-25_23-17-32/archive/org.apache.accumulo/accumulo/1.6.0-SNAPSHOT/accumulo-1.6.0-SNAPSHOT.pom
[JENKINS] Archiving <https://builds.apache.org/job/Accumulo-Trunk-Hadoop-2.0/ws/accumulo-trunk/target/accumulo-1.6.0-SNAPSHOT-site.xml>
to /home/hudson/hudson/jobs/Accumulo-Trunk-Hadoop-2.0/modules/org.apache.accumulo$accumulo/builds/2013-02-25_23-17-32/archive/org.apache.accumulo/accumulo/1.6.0-SNAPSHOT/accumulo-1.6.0-SNAPSHOT-site.xml
[JENKINS] Archiving <https://builds.apache.org/job/Accumulo-Trunk-Hadoop-2.0/ws/accumulo-trunk/test/pom.xml>
to /home/hudson/hudson/jobs/Accumulo-Trunk-Hadoop-2.0/modules/org.apache.accumulo$accumulo-test/builds/2013-02-25_23-17-33/archive/org.apache.accumulo/accumulo-test/1.6.0-SNAPSHOT/accumulo-test-1.6.0-SNAPSHOT.pom
[JENKINS] Archiving <https://builds.apache.org/job/Accumulo-Trunk-Hadoop-2.0/ws/accumulo-trunk/start/pom.xml>
to /home/hudson/hudson/jobs/Accumulo-Trunk-Hadoop-2.0/modules/org.apache.accumulo$accumulo-start/builds/2013-02-25_23-17-33/archive/org.apache.accumulo/accumulo-start/1.6.0-SNAPSHOT/accumulo-start-1.6.0-SNAPSHOT.pom
[JENKINS] Archiving <https://builds.apache.org/job/Accumulo-Trunk-Hadoop-2.0/ws/accumulo-trunk/lib/accumulo-start-1.6.0-SNAPSHOT.jar>
to /home/hudson/hudson/jobs/Accumulo-Trunk-Hadoop-2.0/modules/org.apache.accumulo$accumulo-start/builds/2013-02-25_23-17-33/archive/org.apache.accumulo/accumulo-start/1.6.0-SNAPSHOT/accumulo-start-1.6.0-SNAPSHOT.jar
[JENKINS] Archiving <https://builds.apache.org/job/Accumulo-Trunk-Hadoop-2.0/ws/accumulo-trunk/lib/accumulo-start-1.6.0-SNAPSHOT-sources.jar>
to /home/hudson/hudson/jobs/Accumulo-Trunk-Hadoop-2.0/modules/org.apache.accumulo$accumulo-start/builds/2013-02-25_23-17-33/archive/org.apache.accumulo/accumulo-start/1.6.0-SNAPSHOT/accumulo-start-1.6.0-SNAPSHOT-sources.jar
[JENKINS] Archiving <https://builds.apache.org/job/Accumulo-Trunk-Hadoop-2.0/ws/accumulo-trunk/lib/accumulo-start-1.6.0-SNAPSHOT-test-sources.jar>
to /home/hudson/hudson/jobs/Accumulo-Trunk-Hadoop-2.0/modules/org.apache.accumulo$accumulo-start/builds/2013-02-25_23-17-33/archive/org.apache.accumulo/accumulo-start/1.6.0-SNAPSHOT/accumulo-start-1.6.0-SNAPSHOT-test-sources.jar
[JENKINS] Archiving <https://builds.apache.org/job/Accumulo-Trunk-Hadoop-2.0/ws/accumulo-trunk/fate/pom.xml>
to /home/hudson/hudson/jobs/Accumulo-Trunk-Hadoop-2.0/modules/org.apache.accumulo$accumulo-fate/builds/2013-02-25_23-17-33/archive/org.apache.accumulo/accumulo-fate/1.6.0-SNAPSHOT/accumulo-fate-1.6.0-SNAPSHOT.pom
[JENKINS] Archiving <https://builds.apache.org/job/Accumulo-Trunk-Hadoop-2.0/ws/accumulo-trunk/lib/accumulo-fate-1.6.0-SNAPSHOT.jar>
to /home/hudson/hudson/jobs/Accumulo-Trunk-Hadoop-2.0/modules/org.apache.accumulo$accumulo-fate/builds/2013-02-25_23-17-33/archive/org.apache.accumulo/accumulo-fate/1.6.0-SNAPSHOT/accumulo-fate-1.6.0-SNAPSHOT.jar
[JENKINS] Archiving <https://builds.apache.org/job/Accumulo-Trunk-Hadoop-2.0/ws/accumulo-trunk/lib/accumulo-fate-1.6.0-SNAPSHOT-sources.jar>
to /home/hudson/hudson/jobs/Accumulo-Trunk-Hadoop-2.0/modules/org.apache.accumulo$accumulo-fate/builds/2013-02-25_23-17-33/archive/org.apache.accumulo/accumulo-fate/1.6.0-SNAPSHOT/accumulo-fate-1.6.0-SNAPSHOT-sources.jar
[JENKINS] Archiving <https://builds.apache.org/job/Accumulo-Trunk-Hadoop-2.0/ws/accumulo-trunk/lib/accumulo-fate-1.6.0-SNAPSHOT-test-sources.jar>
to /home/hudson/hudson/jobs/Accumulo-Trunk-Hadoop-2.0/modules/org.apache.accumulo$accumulo-fate/builds/2013-02-25_23-17-33/archive/org.apache.accumulo/accumulo-fate/1.6.0-SNAPSHOT/accumulo-fate-1.6.0-SNAPSHOT-test-sources.jar
[JENKINS] Archiving <https://builds.apache.org/job/Accumulo-Trunk-Hadoop-2.0/ws/accumulo-trunk/core/pom.xml>
to /home/hudson/hudson/jobs/Accumulo-Trunk-Hadoop-2.0/modules/org.apache.accumulo$accumulo-core/builds/2013-02-25_23-17-33/archive/org.apache.accumulo/accumulo-core/1.6.0-SNAPSHOT/accumulo-core-1.6.0-SNAPSHOT.pom
[JENKINS] Archiving <https://builds.apache.org/job/Accumulo-Trunk-Hadoop-2.0/ws/accumulo-trunk/lib/accumulo-core-1.6.0-SNAPSHOT.jar>
to /home/hudson/hudson/jobs/Accumulo-Trunk-Hadoop-2.0/modules/org.apache.accumulo$accumulo-core/builds/2013-02-25_23-17-33/archive/org.apache.accumulo/accumulo-core/1.6.0-SNAPSHOT/accumulo-core-1.6.0-SNAPSHOT.jar
[JENKINS] Archiving <https://builds.apache.org/job/Accumulo-Trunk-Hadoop-2.0/ws/accumulo-trunk/lib/accumulo-core-1.6.0-SNAPSHOT-sources.jar>
to /home/hudson/hudson/jobs/Accumulo-Trunk-Hadoop-2.0/modules/org.apache.accumulo$accumulo-core/builds/2013-02-25_23-17-33/archive/org.apache.accumulo/accumulo-core/1.6.0-SNAPSHOT/accumulo-core-1.6.0-SNAPSHOT-sources.jar
[JENKINS] Archiving <https://builds.apache.org/job/Accumulo-Trunk-Hadoop-2.0/ws/accumulo-trunk/lib/accumulo-core-1.6.0-SNAPSHOT-test-sources.jar>
to /home/hudson/hudson/jobs/Accumulo-Trunk-Hadoop-2.0/modules/org.apache.accumulo$accumulo-core/builds/2013-02-25_23-17-33/archive/org.apache.accumulo/accumulo-core/1.6.0-SNAPSHOT/accumulo-core-1.6.0-SNAPSHOT-test-sources.jar
[JENKINS] Archiving <https://builds.apache.org/job/Accumulo-Trunk-Hadoop-2.0/ws/accumulo-trunk/trace/pom.xml>
to /home/hudson/hudson/jobs/Accumulo-Trunk-Hadoop-2.0/modules/org.apache.accumulo$accumulo-trace/builds/2013-02-25_23-17-33/archive/org.apache.accumulo/accumulo-trace/1.6.0-SNAPSHOT/accumulo-trace-1.6.0-SNAPSHOT.pom
[JENKINS] Archiving <https://builds.apache.org/job/Accumulo-Trunk-Hadoop-2.0/ws/accumulo-trunk/lib/accumulo-trace-1.6.0-SNAPSHOT.jar>
to /home/hudson/hudson/jobs/Accumulo-Trunk-Hadoop-2.0/modules/org.apache.accumulo$accumulo-trace/builds/2013-02-25_23-17-33/archive/org.apache.accumulo/accumulo-trace/1.6.0-SNAPSHOT/accumulo-trace-1.6.0-SNAPSHOT.jar
[JENKINS] Archiving <https://builds.apache.org/job/Accumulo-Trunk-Hadoop-2.0/ws/accumulo-trunk/lib/accumulo-trace-1.6.0-SNAPSHOT-sources.jar>
to /home/hudson/hudson/jobs/Accumulo-Trunk-Hadoop-2.0/modules/org.apache.accumulo$accumulo-trace/builds/2013-02-25_23-17-33/archive/org.apache.accumulo/accumulo-trace/1.6.0-SNAPSHOT/accumulo-trace-1.6.0-SNAPSHOT-sources.jar
[JENKINS] Archiving <https://builds.apache.org/job/Accumulo-Trunk-Hadoop-2.0/ws/accumulo-trunk/lib/accumulo-trace-1.6.0-SNAPSHOT-test-sources.jar>
to /home/hudson/hudson/jobs/Accumulo-Trunk-Hadoop-2.0/modules/org.apache.accumulo$accumulo-trace/builds/2013-02-25_23-17-33/archive/org.apache.accumulo/accumulo-trace/1.6.0-SNAPSHOT/accumulo-trace-1.6.0-SNAPSHOT-test-sources.jar
[JENKINS] Archiving <https://builds.apache.org/job/Accumulo-Trunk-Hadoop-2.0/ws/accumulo-trunk/examples/instamo/pom.xml>
to /home/hudson/hudson/jobs/Accumulo-Trunk-Hadoop-2.0/modules/org.apache.accumulo$accumulo-examples-instamo/builds/2013-02-25_23-17-33/archive/org.apache.accumulo/accumulo-examples-instamo/1.6.0-SNAPSHOT/accumulo-examples-instamo-1.6.0-SNAPSHOT.pom
Waiting for Jenkins to finish collecting data
mavenExecutionResult exceptions not empty
message : Internal error: java.lang.reflect.UndeclaredThrowableException
cause : null
Stack trace : 
org.apache.maven.InternalErrorException: Internal error: java.lang.reflect.UndeclaredThrowableException
	at org.apache.maven.lifecycle.internal.BuilderCommon.handleBuildError(BuilderCommon.java:128)
	at org.apache.maven.lifecycle.internal.LifecycleModuleBuilder.buildProject(LifecycleModuleBuilder.java:95)
	at org.apache.maven.lifecycle.internal.LifecycleModuleBuilder.buildProject(LifecycleModuleBuilder.java:59)
	at org.apache.maven.lifecycle.internal.LifecycleStarter.singleThreadedBuild(LifecycleStarter.java:183)
	at org.apache.maven.lifecycle.internal.LifecycleStarter.execute(LifecycleStarter.java:161)
	at org.apache.maven.DefaultMaven.doExecute(DefaultMaven.java:320)
	at org.apache.maven.DefaultMaven.execute(DefaultMaven.java:156)
	at org.jvnet.hudson.maven3.launcher.Maven3Launcher.main(Maven3Launcher.java:79)
	at sun.reflect.NativeMethodAccessorImpl.invoke0(Native Method)
	at sun.reflect.NativeMethodAccessorImpl.invoke(NativeMethodAccessorImpl.java:39)
	at sun.reflect.DelegatingMethodAccessorImpl.invoke(DelegatingMethodAccessorImpl.java:25)
	at java.lang.reflect.Method.invoke(Method.java:597)
	at org.codehaus.plexus.classworlds.launcher.Launcher.launchStandard(Launcher.java:329)
	at org.codehaus.plexus.classworlds.launcher.Launcher.launch(Launcher.java:239)
	at org.jvnet.hudson.maven3.agent.Maven3Main.launch(Maven3Main.java:158)
	at hudson.maven.Maven3Builder.call(Maven3Builder.java:100)
	at hudson.maven.Maven3Builder.call(Maven3Builder.java:66)
	at hudson.remoting.UserRequest.perform(UserRequest.java:118)
	at hudson.remoting.UserRequest.perform(UserRequest.java:48)
	at hudson.remoting.Request$2.run(Request.java:326)
	at hudson.remoting.InterceptingExecutorService$1.call(InterceptingExecutorService.java:72)
	at java.util.concurrent.FutureTask$Sync.innerRun(FutureTask.java:303)
	at java.util.concurrent.FutureTask.run(FutureTask.java:138)
	at java.util.concurrent.ThreadPoolExecutor$Worker.runTask(ThreadPoolExecutor.java:886)
	at java.util.concurrent.ThreadPoolExecutor$Worker.run(ThreadPoolExecutor.java:908)
	at java.lang.Thread.run(Thread.java:662)
Caused by: java.lang.reflect.UndeclaredThrowableException
	at $Proxy2.setExecutedMojos(Unknown Source)
	at hudson.maven.MavenBuildProxy$Filter.setExecutedMojos(MavenBuildProxy.java:243)
	at hudson.maven.Maven3Builder$MavenExecutionListener.recordMojoEnded(Maven3Builder.java:439)
	at hudson.maven.Maven3Builder$MavenExecutionListener.mojoSucceeded(Maven3Builder.java:425)
	at org.apache.maven.lifecycle.internal.DefaultExecutionEventCatapult.fire(DefaultExecutionEventCatapult.java:87)
	at org.apache.maven.lifecycle.internal.DefaultExecutionEventCatapult.fire(DefaultExecutionEventCatapult.java:42)
	at org.apache.maven.lifecycle.internal.MojoExecutor.execute(MojoExecutor.java:228)
	at org.apache.maven.lifecycle.internal.MojoExecutor.execute(MojoExecutor.java:153)
	at org.apache.maven.lifecycle.internal.MojoExecutor.execute(MojoExecutor.java:145)
	at org.apache.maven.lifecycle.internal.MojoExecutor.executeForkedExecutions(MojoExecutor.java:365)
	at org.apache.maven.lifecycle.internal.MojoExecutor.execute(MojoExecutor.java:199)
	at org.apache.maven.lifecycle.internal.MojoExecutor.execute(MojoExecutor.java:153)
	at org.apache.maven.lifecycle.internal.MojoExecutor.execute(MojoExecutor.java:145)
	at org.apache.maven.lifecycle.internal.LifecycleModuleBuilder.buildProject(LifecycleModuleBuilder.java:84)
	... 24 more
Caused by: java.io.StreamCorruptedException: invalid type code: FF
	at java.io.ObjectInputStream.readObject0(ObjectInputStream.java:1374)
	at java.io.ObjectInputStream.defaultReadFields(ObjectInputStream.java:1970)
	at java.io.ObjectInputStream.readSerialData(ObjectInputStream.java:1894)
	at java.io.ObjectInputStream.readOrdinaryObject(ObjectInputStream.java:1777)
	at java.io.ObjectInputStream.readObject0(ObjectInputStream.java:1347)
	at java.io.ObjectInputStream.readObject(ObjectInputStream.java:369)
	at java.util.concurrent.CopyOnWriteArrayList.readObject(CopyOnWriteArrayList.java:879)
	at sun.reflect.GeneratedMethodAccessor30648.invoke(Unknown Source)
	at sun.reflect.DelegatingMethodAccessorImpl.invoke(DelegatingMethodAccessorImpl.java:43)
	at java.lang.reflect.Method.invoke(Method.java:601)
	at java.io.ObjectStreamClass.invokeReadObject(ObjectStreamClass.java:1004)
	at java.io.ObjectInputStream.readSerialData(ObjectInputStream.java:1872)
	at java.io.ObjectInputStream.readOrdinaryObject(ObjectInputStream.java:1777)
	at java.io.ObjectInputStream.readObject0(ObjectInputStream.java:1347)
	at java.io.ObjectInputStream.readArray(ObjectInputStream.java:1685)
	at java.io.ObjectInputStream.readObject0(ObjectInputStream.java:1341)
	at java.io.ObjectInputStream.defaultReadFields(ObjectInputStream.java:1970)
	at java.io.ObjectInputStream.readSerialData(ObjectInputStream.java:1894)
	at java.io.ObjectInputStream.readOrdinaryObject(ObjectInputStream.java:1777)
	at java.io.ObjectInputStream.readObject0(ObjectInputStream.java:1347)
	at java.io.ObjectInputStream.readObject(ObjectInputStream.java:369)
	at hudson.remoting.UserRequest.deserialize(UserRequest.java:182)
	at hudson.remoting.UserRequest.perform(UserRequest.java:98)
	at hudson.remoting.UserRequest.perform(UserRequest.java:48)
	at hudson.remoting.Request$2.run(Request.java:326)
	at hudson.remoting.InterceptingExecutorService$1.call(InterceptingExecutorService.java:72)
	at java.util.concurrent.FutureTask$Sync.innerRun(FutureTask.java:334)
	at java.util.concurrent.FutureTask.run(FutureTask.java:166)
	at java.util.concurrent.ThreadPoolExecutor.runWorker(ThreadPoolExecutor.java:1145)
	at java.util.concurrent.ThreadPoolExecutor$Worker.run(ThreadPoolExecutor.java:615)
	at java.lang.Thread.run(Thread.java:722)
Sending e-mails to: notifications@accumulo.apache.org
channel stopped
Updating ACCUMULO-1105
Updating ACCUMULO-765
Updating ACCUMULO-670

Mime
View raw message