accumulo-notifications mailing list archives

Site index · List index
Message view « Date » · « Thread »
Top « Date » · « Thread »
From Apache Jenkins Server <jenk...@builds.apache.org>
Subject Build failed in Jenkins: Accumulo-Trunk » Core #720
Date Sat, 09 Feb 2013 08:53:02 GMT
See <https://builds.apache.org/job/Accumulo-Trunk/org.apache.accumulo$accumulo-core/720/changes>

Changes:

[vines] ACCUMULO-1041 - Majority of the client interfaces tackled. CLI needs work, as does
proxy. Javadocs are a mess, as are some variable names, but it's functional. Except mapreduce
APIs need DistributedCache code reintegrated as discussed on JIRA

------------------------------------------
[...truncated 65 lines...]
location: interface org.apache.accumulo.core.client.Instance
[ERROR] <https://builds.apache.org/job/Accumulo-Trunk/org.apache.accumulo$accumulo-core/ws/src/main/java/org/apache/accumulo/core/client/admin/SecurityOperations.java>:[26,54]
package org.apache.accumulo.core.security.thrift.tokens does not exist
[ERROR] <https://builds.apache.org/job/Accumulo-Trunk/org.apache.accumulo$accumulo-core/ws/src/main/java/org/apache/accumulo/core/client/admin/SecurityOperations.java>:[63,43]
cannot find symbol
symbol  : class SecurityToken
location: interface org.apache.accumulo.core.client.admin.SecurityOperations
[ERROR] <https://builds.apache.org/job/Accumulo-Trunk/org.apache.accumulo$accumulo-core/ws/src/main/java/org/apache/accumulo/core/client/admin/SecurityOperations.java>:[106,45]
cannot find symbol
symbol  : class SecurityToken
location: interface org.apache.accumulo.core.client.admin.SecurityOperations
[ERROR] <https://builds.apache.org/job/Accumulo-Trunk/org.apache.accumulo$accumulo-core/ws/src/main/java/org/apache/accumulo/core/client/admin/SecurityOperations.java>:[265,41]
cannot find symbol
symbol  : class SecurityToken
location: interface org.apache.accumulo.core.client.admin.SecurityOperations
[ERROR] <https://builds.apache.org/job/Accumulo-Trunk/org.apache.accumulo$accumulo-core/ws/src/main/java/org/apache/accumulo/core/client/mock/MockAccumulo.java>:[32,54]
package org.apache.accumulo.core.security.thrift.tokens does not exist
[ERROR] <https://builds.apache.org/job/Accumulo-Trunk/org.apache.accumulo$accumulo-core/ws/src/main/java/org/apache/accumulo/core/client/mock/MockUser.java>:[23,54]
package org.apache.accumulo.core.security.thrift.tokens does not exist
[ERROR] <https://builds.apache.org/job/Accumulo-Trunk/org.apache.accumulo$accumulo-core/ws/src/main/java/org/apache/accumulo/core/client/mock/MockUser.java>:[28,2]
cannot find symbol
symbol  : class SecurityToken
location: class org.apache.accumulo.core.client.mock.MockUser
[ERROR] <https://builds.apache.org/job/Accumulo-Trunk/org.apache.accumulo$accumulo-core/ws/src/main/java/org/apache/accumulo/core/client/mock/MockUser.java>:[31,29]
cannot find symbol
symbol  : class SecurityToken
location: class org.apache.accumulo.core.client.mock.MockUser
[ERROR] <https://builds.apache.org/job/Accumulo-Trunk/org.apache.accumulo$accumulo-core/ws/src/main/java/org/apache/accumulo/core/util/shell/Shell.java>:[55,40]
cannot find symbol
symbol  : class CredentialHelper
location: package org.apache.accumulo.core.security
[ERROR] <https://builds.apache.org/job/Accumulo-Trunk/org.apache.accumulo$accumulo-core/ws/src/main/java/org/apache/accumulo/core/util/shell/Shell.java>:[57,54]
package org.apache.accumulo.core.security.thrift.tokens does not exist
[ERROR] <https://builds.apache.org/job/Accumulo-Trunk/org.apache.accumulo$accumulo-core/ws/src/main/java/org/apache/accumulo/core/util/shell/commands/UserCommand.java>:[26,40]
cannot find symbol
symbol  : class CredentialHelper
location: package org.apache.accumulo.core.security
[ERROR] <https://builds.apache.org/job/Accumulo-Trunk/org.apache.accumulo$accumulo-core/ws/src/main/java/org/apache/accumulo/core/util/shell/commands/UserCommand.java>:[28,54]
package org.apache.accumulo.core.security.thrift.tokens does not exist
[ERROR] <https://builds.apache.org/job/Accumulo-Trunk/org.apache.accumulo$accumulo-core/ws/src/main/java/org/apache/accumulo/core/client/mock/MockSecurityOperations.java>:[29,54]
package org.apache.accumulo.core.security.thrift.tokens does not exist
[ERROR] <https://builds.apache.org/job/Accumulo-Trunk/org.apache.accumulo$accumulo-core/ws/src/main/java/org/apache/accumulo/core/client/mock/MockSecurityOperations.java>:[30,54]
package org.apache.accumulo.core.security.thrift.tokens does not exist
[ERROR] <https://builds.apache.org/job/Accumulo-Trunk/org.apache.accumulo$accumulo-core/ws/src/main/java/org/apache/accumulo/core/client/mock/MockSecurityOperations.java>:[49,38]
cannot find symbol
symbol  : class SecurityToken
location: class org.apache.accumulo.core.client.mock.MockSecurityOperations
[ERROR] <https://builds.apache.org/job/Accumulo-Trunk/org.apache.accumulo$accumulo-core/ws/src/main/java/org/apache/accumulo/core/client/mock/MockSecurityOperations.java>:[63,47]
cannot find symbol
symbol  : class SecurityToken
location: class org.apache.accumulo.core.client.mock.MockSecurityOperations
[ERROR] <https://builds.apache.org/job/Accumulo-Trunk/org.apache.accumulo$accumulo-core/ws/src/main/java/org/apache/accumulo/core/client/mock/MockSecurityOperations.java>:[71,43]
cannot find symbol
symbol  : class SecurityToken
location: class org.apache.accumulo.core.client.mock.MockSecurityOperations
[ERROR] <https://builds.apache.org/job/Accumulo-Trunk/org.apache.accumulo$accumulo-core/ws/src/main/java/org/apache/accumulo/core/client/mapred/InputFormatBase.java>:[57,40]
cannot find symbol
symbol  : class CredentialHelper
location: package org.apache.accumulo.core.security
[ERROR] <https://builds.apache.org/job/Accumulo-Trunk/org.apache.accumulo$accumulo-core/ws/src/main/java/org/apache/accumulo/core/client/mapred/InputFormatBase.java>:[59,54]
package org.apache.accumulo.core.security.thrift.tokens does not exist
[ERROR] <https://builds.apache.org/job/Accumulo-Trunk/org.apache.accumulo$accumulo-core/ws/src/main/java/org/apache/accumulo/core/client/mapred/InputFormatBase.java>:[104,69]
cannot find symbol
symbol  : class SecurityToken
location: class org.apache.accumulo.core.client.mapred.InputFormatBase<K,V>
[ERROR] <https://builds.apache.org/job/Accumulo-Trunk/org.apache.accumulo$accumulo-core/ws/src/main/java/org/apache/accumulo/core/client/mapreduce/InputFormatBase.java>:[66,40]
cannot find symbol
symbol  : class CredentialHelper
location: package org.apache.accumulo.core.security
[ERROR] <https://builds.apache.org/job/Accumulo-Trunk/org.apache.accumulo$accumulo-core/ws/src/main/java/org/apache/accumulo/core/client/mapreduce/InputFormatBase.java>:[68,54]
package org.apache.accumulo.core.security.thrift.tokens does not exist
[ERROR] <https://builds.apache.org/job/Accumulo-Trunk/org.apache.accumulo$accumulo-core/ws/src/main/java/org/apache/accumulo/core/client/mapreduce/InputFormatBase.java>:[69,54]
package org.apache.accumulo.core.security.thrift.tokens does not exist
[ERROR] <https://builds.apache.org/job/Accumulo-Trunk/org.apache.accumulo$accumulo-core/ws/src/main/java/org/apache/accumulo/core/client/mapreduce/InputFormatBase.java>:[117,65]
cannot find symbol
symbol  : class SecurityToken
location: class org.apache.accumulo.core.client.mapreduce.InputFormatBase<K,V>
[ERROR] <https://builds.apache.org/job/Accumulo-Trunk/org.apache.accumulo$accumulo-core/ws/src/main/java/org/apache/accumulo/core/cli/ClientOpts.java>:[39,40]
cannot find symbol
symbol  : class CredentialHelper
location: package org.apache.accumulo.core.security
[ERROR] <https://builds.apache.org/job/Accumulo-Trunk/org.apache.accumulo$accumulo-core/ws/src/main/java/org/apache/accumulo/core/cli/ClientOpts.java>:[41,54]
package org.apache.accumulo.core.security.thrift.tokens does not exist
[ERROR] <https://builds.apache.org/job/Accumulo-Trunk/org.apache.accumulo$accumulo-core/ws/src/main/java/org/apache/accumulo/core/cli/ClientOpts.java>:[42,54]
package org.apache.accumulo.core.security.thrift.tokens does not exist
[ERROR] <https://builds.apache.org/job/Accumulo-Trunk/org.apache.accumulo$accumulo-core/ws/src/main/java/org/apache/accumulo/core/cli/ClientOpts.java>:[112,9]
cannot find symbol
symbol  : class SecurityToken
location: class org.apache.accumulo.core.cli.ClientOpts
[ERROR] <https://builds.apache.org/job/Accumulo-Trunk/org.apache.accumulo$accumulo-core/ws/src/main/java/org/apache/accumulo/core/client/admin/SecurityOperationsImpl.java>:[31,40]
cannot find symbol
symbol  : class CredentialHelper
location: package org.apache.accumulo.core.security
[ERROR] <https://builds.apache.org/job/Accumulo-Trunk/org.apache.accumulo$accumulo-core/ws/src/main/java/org/apache/accumulo/core/client/admin/SecurityOperationsImpl.java>:[37,54]
package org.apache.accumulo.core.security.thrift.tokens does not exist
[ERROR] <https://builds.apache.org/job/Accumulo-Trunk/org.apache.accumulo$accumulo-core/ws/src/main/java/org/apache/accumulo/core/client/admin/SecurityOperationsImpl.java>:[38,54]
package org.apache.accumulo.core.security.thrift.tokens does not exist
[ERROR] <https://builds.apache.org/job/Accumulo-Trunk/org.apache.accumulo$accumulo-core/ws/src/main/java/org/apache/accumulo/core/client/admin/SecurityOperationsImpl.java>:[114,55]
cannot find symbol
symbol  : class SecurityToken
location: class org.apache.accumulo.core.client.admin.SecurityOperationsImpl
[ERROR] <https://builds.apache.org/job/Accumulo-Trunk/org.apache.accumulo$accumulo-core/ws/src/main/java/org/apache/accumulo/core/client/admin/SecurityOperationsImpl.java>:[119,44]
cannot find symbol
symbol  : class SecurityToken
location: class org.apache.accumulo.core.client.admin.SecurityOperationsImpl
[ERROR] <https://builds.apache.org/job/Accumulo-Trunk/org.apache.accumulo$accumulo-core/ws/src/main/java/org/apache/accumulo/core/client/admin/SecurityOperationsImpl.java>:[172,64]
cannot find symbol
symbol  : class SecurityToken
location: class org.apache.accumulo.core.client.admin.SecurityOperationsImpl
[ERROR] <https://builds.apache.org/job/Accumulo-Trunk/org.apache.accumulo$accumulo-core/ws/src/main/java/org/apache/accumulo/core/client/admin/SecurityOperationsImpl.java>:[203,54]
cannot find symbol
symbol  : class SecurityToken
location: class org.apache.accumulo.core.client.admin.SecurityOperationsImpl
[ERROR] <https://builds.apache.org/job/Accumulo-Trunk/org.apache.accumulo$accumulo-core/ws/src/main/java/org/apache/accumulo/core/client/ZooKeeperInstance.java>:[32,40]
cannot find symbol
symbol  : class CredentialHelper
location: package org.apache.accumulo.core.security
[ERROR] <https://builds.apache.org/job/Accumulo-Trunk/org.apache.accumulo$accumulo-core/ws/src/main/java/org/apache/accumulo/core/client/ZooKeeperInstance.java>:[36,54]
package org.apache.accumulo.core.security.thrift.tokens does not exist
[ERROR] <https://builds.apache.org/job/Accumulo-Trunk/org.apache.accumulo$accumulo-core/ws/src/main/java/org/apache/accumulo/core/client/ZooKeeperInstance.java>:[37,54]
package org.apache.accumulo.core.security.thrift.tokens does not exist
[ERROR] <https://builds.apache.org/job/Accumulo-Trunk/org.apache.accumulo$accumulo-core/ws/src/main/java/org/apache/accumulo/core/client/ZooKeeperInstance.java>:[226,50]
cannot find symbol
symbol  : class SecurityToken
location: class org.apache.accumulo.core.client.ZooKeeperInstance
[ERROR] <https://builds.apache.org/job/Accumulo-Trunk/org.apache.accumulo$accumulo-core/ws/src/main/java/org/apache/accumulo/core/client/mock/MockInstance.java>:[31,40]
cannot find symbol
symbol  : class CredentialHelper
location: package org.apache.accumulo.core.security
[ERROR] <https://builds.apache.org/job/Accumulo-Trunk/org.apache.accumulo$accumulo-core/ws/src/main/java/org/apache/accumulo/core/client/mock/MockInstance.java>:[32,48]
package org.apache.accumulo.core.security.handler does not exist
[ERROR] <https://builds.apache.org/job/Accumulo-Trunk/org.apache.accumulo$accumulo-core/ws/src/main/java/org/apache/accumulo/core/client/mock/MockInstance.java>:[36,54]
package org.apache.accumulo.core.security.thrift.tokens does not exist
[ERROR] <https://builds.apache.org/job/Accumulo-Trunk/org.apache.accumulo$accumulo-core/ws/src/main/java/org/apache/accumulo/core/client/mock/MockInstance.java>:[37,54]
package org.apache.accumulo.core.security.thrift.tokens does not exist
[ERROR] <https://builds.apache.org/job/Accumulo-Trunk/org.apache.accumulo$accumulo-core/ws/src/main/java/org/apache/accumulo/core/client/mock/MockInstance.java>:[159,50]
cannot find symbol
symbol  : class SecurityToken
location: class org.apache.accumulo.core.client.mock.MockInstance
[ERROR] <https://builds.apache.org/job/Accumulo-Trunk/org.apache.accumulo$accumulo-core/ws/src/main/java/org/apache/accumulo/core/client/admin/TableOperationsImpl.java>:[77,40]
cannot find symbol
symbol  : class CredentialHelper
location: package org.apache.accumulo.core.security
[ERROR] <https://builds.apache.org/job/Accumulo-Trunk/org.apache.accumulo$accumulo-core/ws/src/main/java/org/apache/accumulo/core/client/mapreduce/lib/util/ConfiguratorBase.java>:[26,40]
cannot find symbol
symbol  : class CredentialHelper
location: package org.apache.accumulo.core.security
[ERROR] <https://builds.apache.org/job/Accumulo-Trunk/org.apache.accumulo$accumulo-core/ws/src/main/java/org/apache/accumulo/core/client/mapreduce/lib/util/ConfiguratorBase.java>:[27,54]
package org.apache.accumulo.core.security.thrift.tokens does not exist
[ERROR] <https://builds.apache.org/job/Accumulo-Trunk/org.apache.accumulo$accumulo-core/ws/src/main/java/org/apache/accumulo/core/client/mapreduce/lib/util/ConfiguratorBase.java>:[101,104]
cannot find symbol
symbol  : class SecurityToken
location: class org.apache.accumulo.core.client.mapreduce.lib.util.ConfiguratorBase
[ERROR] <https://builds.apache.org/job/Accumulo-Trunk/org.apache.accumulo$accumulo-core/ws/src/main/java/org/apache/accumulo/core/client/mapreduce/lib/util/InputConfigurator.java>:[49,40]
cannot find symbol
symbol  : class CredentialHelper
location: package org.apache.accumulo.core.security
[ERROR] <https://builds.apache.org/job/Accumulo-Trunk/org.apache.accumulo$accumulo-core/ws/src/main/java/org/apache/accumulo/core/client/mapreduce/AccumuloOutputFormat.java>:[43,40]
cannot find symbol
symbol  : class CredentialHelper
location: package org.apache.accumulo.core.security
[ERROR] <https://builds.apache.org/job/Accumulo-Trunk/org.apache.accumulo$accumulo-core/ws/src/main/java/org/apache/accumulo/core/client/mapreduce/AccumuloOutputFormat.java>:[45,54]
package org.apache.accumulo.core.security.thrift.tokens does not exist
[ERROR] <https://builds.apache.org/job/Accumulo-Trunk/org.apache.accumulo$accumulo-core/ws/src/main/java/org/apache/accumulo/core/client/mapreduce/AccumuloOutputFormat.java>:[46,54]
package org.apache.accumulo.core.security.thrift.tokens does not exist
[ERROR] <https://builds.apache.org/job/Accumulo-Trunk/org.apache.accumulo$accumulo-core/ws/src/main/java/org/apache/accumulo/core/client/mapreduce/AccumuloOutputFormat.java>:[95,65]
cannot find symbol
symbol  : class SecurityToken
location: class org.apache.accumulo.core.client.mapreduce.AccumuloOutputFormat
[ERROR] <https://builds.apache.org/job/Accumulo-Trunk/org.apache.accumulo$accumulo-core/ws/src/main/java/org/apache/accumulo/core/util/shell/commands/PasswdCommand.java>:[23,40]
cannot find symbol
symbol  : class CredentialHelper
location: package org.apache.accumulo.core.security
[ERROR] <https://builds.apache.org/job/Accumulo-Trunk/org.apache.accumulo$accumulo-core/ws/src/main/java/org/apache/accumulo/core/util/shell/commands/PasswdCommand.java>:[25,54]
package org.apache.accumulo.core.security.thrift.tokens does not exist
[ERROR] <https://builds.apache.org/job/Accumulo-Trunk/org.apache.accumulo$accumulo-core/ws/src/main/java/org/apache/accumulo/core/util/MetadataTable.java>:[42,40]
cannot find symbol
symbol  : class CredentialHelper
location: package org.apache.accumulo.core.security
[ERROR] <https://builds.apache.org/job/Accumulo-Trunk/org.apache.accumulo$accumulo-core/ws/src/main/java/org/apache/accumulo/core/client/mapred/AccumuloOutputFormat.java>:[42,40]
cannot find symbol
symbol  : class CredentialHelper
location: package org.apache.accumulo.core.security
[ERROR] <https://builds.apache.org/job/Accumulo-Trunk/org.apache.accumulo$accumulo-core/ws/src/main/java/org/apache/accumulo/core/client/mapred/AccumuloOutputFormat.java>:[44,54]
package org.apache.accumulo.core.security.thrift.tokens does not exist
[ERROR] <https://builds.apache.org/job/Accumulo-Trunk/org.apache.accumulo$accumulo-core/ws/src/main/java/org/apache/accumulo/core/client/mapred/AccumuloOutputFormat.java>:[91,69]
cannot find symbol
symbol  : class SecurityToken
location: class org.apache.accumulo.core.client.mapred.AccumuloOutputFormat
[ERROR] <https://builds.apache.org/job/Accumulo-Trunk/org.apache.accumulo$accumulo-core/ws/src/main/java/org/apache/accumulo/core/client/mock/MockAccumulo.java>:[47,45]
cannot find symbol
symbol  : class PasswordToken
location: class org.apache.accumulo.core.client.mock.MockAccumulo
[ERROR] <https://builds.apache.org/job/Accumulo-Trunk/org.apache.accumulo$accumulo-core/ws/src/main/java/org/apache/accumulo/core/util/shell/Shell.java>:[281,59]
cannot find symbol
symbol  : class PasswordToken
location: class org.apache.accumulo.core.util.shell.Shell
[ERROR] <https://builds.apache.org/job/Accumulo-Trunk/org.apache.accumulo$accumulo-core/ws/src/main/java/org/apache/accumulo/core/util/shell/Shell.java>:[281,25]
cannot find symbol
symbol  : variable CredentialHelper
location: class org.apache.accumulo.core.util.shell.Shell
[ERROR] <https://builds.apache.org/job/Accumulo-Trunk/org.apache.accumulo$accumulo-core/ws/src/main/java/org/apache/accumulo/core/util/shell/commands/UserCommand.java>:[49,60]
cannot find symbol
symbol  : class PasswordToken
location: class org.apache.accumulo.core.util.shell.commands.UserCommand
[ERROR] <https://builds.apache.org/job/Accumulo-Trunk/org.apache.accumulo$accumulo-core/ws/src/main/java/org/apache/accumulo/core/util/shell/commands/UserCommand.java>:[49,26]
cannot find symbol
symbol  : variable CredentialHelper
location: class org.apache.accumulo.core.util.shell.commands.UserCommand
[ERROR] <https://builds.apache.org/job/Accumulo-Trunk/org.apache.accumulo$accumulo-core/ws/src/main/java/org/apache/accumulo/core/client/mock/MockSecurityOperations.java>:[45,52]
cannot find symbol
symbol  : class PasswordToken
location: class org.apache.accumulo.core.client.mock.MockSecurityOperations
[ERROR] <https://builds.apache.org/job/Accumulo-Trunk/org.apache.accumulo$accumulo-core/ws/src/main/java/org/apache/accumulo/core/client/mock/MockSecurityOperations.java>:[59,38]
cannot find symbol
symbol  : class PasswordToken
location: class org.apache.accumulo.core.client.mock.MockSecurityOperations
[ERROR] <https://builds.apache.org/job/Accumulo-Trunk/org.apache.accumulo$accumulo-core/ws/src/main/java/org/apache/accumulo/core/client/mock/MockSecurityOperations.java>:[81,30]
cannot find symbol
symbol  : class PasswordToken
location: class org.apache.accumulo.core.client.mock.MockSecurityOperations
[ERROR] <https://builds.apache.org/job/Accumulo-Trunk/org.apache.accumulo$accumulo-core/ws/src/main/java/org/apache/accumulo/core/client/mapred/InputFormatBase.java>:[592,53]
cannot find symbol
symbol  : variable CredentialHelper
location: class org.apache.accumulo.core.client.mapred.InputFormatBase.RecordReaderBase<K,V>
[ERROR] <https://builds.apache.org/job/Accumulo-Trunk/org.apache.accumulo$accumulo-core/ws/src/main/java/org/apache/accumulo/core/client/mapreduce/InputFormatBase.java>:[608,58]
cannot find symbol
symbol  : variable CredentialHelper
location: class org.apache.accumulo.core.client.mapreduce.InputFormatBase.RecordReaderBase<K,V>
[ERROR] <https://builds.apache.org/job/Accumulo-Trunk/org.apache.accumulo$accumulo-core/ws/src/main/java/org/apache/accumulo/core/client/mapreduce/InputFormatBase.java>:[1015,64]
cannot find symbol
symbol  : class PasswordToken
location: class org.apache.accumulo.core.client.mapreduce.InputFormatBase<K,V>
[ERROR] <https://builds.apache.org/job/Accumulo-Trunk/org.apache.accumulo$accumulo-core/ws/src/main/java/org/apache/accumulo/core/cli/ClientOpts.java>:[113,4]
cannot find symbol
symbol  : class PasswordToken
location: class org.apache.accumulo.core.cli.ClientOpts
[ERROR] <https://builds.apache.org/job/Accumulo-Trunk/org.apache.accumulo$accumulo-core/ws/src/main/java/org/apache/accumulo/core/cli/ClientOpts.java>:[113,27]
cannot find symbol
symbol  : class PasswordToken
location: class org.apache.accumulo.core.cli.ClientOpts
[ERROR] <https://builds.apache.org/job/Accumulo-Trunk/org.apache.accumulo$accumulo-core/ws/src/main/java/org/apache/accumulo/core/cli/ClientOpts.java>:[210,11]
cannot find symbol
symbol  : variable CredentialHelper
location: class org.apache.accumulo.core.cli.ClientOpts
[ERROR] <https://builds.apache.org/job/Accumulo-Trunk/org.apache.accumulo$accumulo-core/ws/src/main/java/org/apache/accumulo/core/client/admin/SecurityOperationsImpl.java>:[119,15]
createUser(java.lang.String,SecurityToken,org.apache.accumulo.core.security.Authorizations)
in org.apache.accumulo.core.client.admin.SecurityOperationsImpl cannot implement createUser(java.lang.String,byte[],org.apache.accumulo.core.security.Authorizations)
in org.apache.accumulo.core.client.admin.SecurityOperations; attempting to assign weaker access
privileges; was public
[ERROR] <https://builds.apache.org/job/Accumulo-Trunk/org.apache.accumulo$accumulo-core/ws/src/main/java/org/apache/accumulo/core/client/admin/SecurityOperationsImpl.java>:[99,25]
cannot find symbol
symbol  : class PasswordToken
location: class org.apache.accumulo.core.client.admin.SecurityOperationsImpl
[ERROR] <https://builds.apache.org/job/Accumulo-Trunk/org.apache.accumulo$accumulo-core/ws/src/main/java/org/apache/accumulo/core/client/admin/SecurityOperationsImpl.java>:[121,32]
cannot find symbol
symbol  : variable CredentialHelper
location: class org.apache.accumulo.core.client.admin.SecurityOperationsImpl
[ERROR] <https://builds.apache.org/job/Accumulo-Trunk/org.apache.accumulo$accumulo-core/ws/src/main/java/org/apache/accumulo/core/client/admin/SecurityOperationsImpl.java>:[168,43]
cannot find symbol
symbol  : class PasswordToken
location: class org.apache.accumulo.core.client.admin.SecurityOperationsImpl
[ERROR] <https://builds.apache.org/job/Accumulo-Trunk/org.apache.accumulo$accumulo-core/ws/src/main/java/org/apache/accumulo/core/client/admin/SecurityOperationsImpl.java>:[174,30]
cannot find symbol
symbol  : variable CredentialHelper
location: class org.apache.accumulo.core.client.admin.SecurityOperationsImpl
[ERROR] <https://builds.apache.org/job/Accumulo-Trunk/org.apache.accumulo$accumulo-core/ws/src/main/java/org/apache/accumulo/core/client/admin/SecurityOperationsImpl.java>:[199,35]
cannot find symbol
mojoFailed org.apache.maven.plugins:maven-compiler-plugin:2.3.2(default-compile)symbol  :
class PasswordToken
location: class org.apache.accumulo.core.client.admin.SecurityOperationsImpl
[ERROR] <https://builds.apache.org/job/Accumulo-Trunk/org.apache.accumulo$accumulo-core/ws/src/main/java/org/apache/accumulo/core/client/admin/SecurityOperationsImpl.java>:[205,32]
cannot find symbol
symbol  : variable CredentialHelper
location: class org.apache.accumulo.core.client.admin.SecurityOperationsImpl
[ERROR] <https://builds.apache.org/job/Accumulo-Trunk/org.apache.accumulo$accumulo-core/ws/src/main/java/org/apache/accumulo/core/client/ZooKeeperInstance.java>:[227,24]
cannot find symbol
symbol  : variable CredentialHelper
location: class org.apache.accumulo.core.client.ZooKeeperInstance
[ERROR] <https://builds.apache.org/job/Accumulo-Trunk/org.apache.accumulo$accumulo-core/ws/src/main/java/org/apache/accumulo/core/client/ZooKeeperInstance.java>:[237,39]
cannot find symbol
symbol  : class PasswordToken
location: class org.apache.accumulo.core.client.ZooKeeperInstance
[ERROR] <https://builds.apache.org/job/Accumulo-Trunk/org.apache.accumulo$accumulo-core/ws/src/main/java/org/apache/accumulo/core/client/mock/MockInstance.java>:[121,34]
cannot find symbol
symbol  : class PasswordToken
location: class org.apache.accumulo.core.client.mock.MockInstance
[ERROR] <https://builds.apache.org/job/Accumulo-Trunk/org.apache.accumulo$accumulo-core/ws/src/main/java/org/apache/accumulo/core/client/mock/MockInstance.java>:[155,11]
cannot find symbol
symbol  : class ZKAuthenticator
location: class org.apache.accumulo.core.client.mock.MockInstance
[ERROR] <https://builds.apache.org/job/Accumulo-Trunk/org.apache.accumulo$accumulo-core/ws/src/main/java/org/apache/accumulo/core/client/mock/MockInstance.java>:[170,46]
cannot find symbol
symbol  : variable CredentialHelper
location: class org.apache.accumulo.core.client.mock.MockInstance
[ERROR] <https://builds.apache.org/job/Accumulo-Trunk/org.apache.accumulo$accumulo-core/ws/src/main/java/org/apache/accumulo/core/client/admin/TableOperationsImpl.java>:[1157,72]
cannot find symbol
symbol  : variable CredentialHelper
location: class org.apache.accumulo.core.client.admin.TableOperationsImpl
[ERROR] <https://builds.apache.org/job/Accumulo-Trunk/org.apache.accumulo$accumulo-core/ws/src/main/java/org/apache/accumulo/core/client/mapreduce/lib/util/ConfiguratorBase.java>:[109,68]
cannot find symbol
symbol  : variable CredentialHelper
location: class org.apache.accumulo.core.client.mapreduce.lib.util.ConfiguratorBase
[ERROR] <https://builds.apache.org/job/Accumulo-Trunk/org.apache.accumulo$accumulo-core/ws/src/main/java/org/apache/accumulo/core/client/mapreduce/lib/util/InputConfigurator.java>:[516,90]
cannot find symbol
symbol  : variable CredentialHelper
location: class org.apache.accumulo.core.client.mapreduce.lib.util.InputConfigurator
[ERROR] <https://builds.apache.org/job/Accumulo-Trunk/org.apache.accumulo$accumulo-core/ws/src/main/java/org/apache/accumulo/core/client/mapreduce/AccumuloOutputFormat.java>:[383,77]
cannot find symbol
symbol  : variable CredentialHelper
location: class org.apache.accumulo.core.client.mapreduce.AccumuloOutputFormat.AccumuloRecordWriter
[ERROR] <https://builds.apache.org/job/Accumulo-Trunk/org.apache.accumulo$accumulo-core/ws/src/main/java/org/apache/accumulo/core/client/mapreduce/AccumuloOutputFormat.java>:[517,69]
cannot find symbol
symbol  : variable CredentialHelper
location: class org.apache.accumulo.core.client.mapreduce.AccumuloOutputFormat
[ERROR] <https://builds.apache.org/job/Accumulo-Trunk/org.apache.accumulo$accumulo-core/ws/src/main/java/org/apache/accumulo/core/client/mapreduce/AccumuloOutputFormat.java>:[518,70]
cannot find symbol
symbol  : variable CredentialHelper
location: class org.apache.accumulo.core.client.mapreduce.AccumuloOutputFormat
[ERROR] <https://builds.apache.org/job/Accumulo-Trunk/org.apache.accumulo$accumulo-core/ws/src/main/java/org/apache/accumulo/core/client/mapreduce/AccumuloOutputFormat.java>:[552,65]
cannot find symbol
symbol  : class PasswordToken
location: class org.apache.accumulo.core.client.mapreduce.AccumuloOutputFormat
[ERROR] <https://builds.apache.org/job/Accumulo-Trunk/org.apache.accumulo$accumulo-core/ws/src/main/java/org/apache/accumulo/core/util/shell/commands/PasswdCommand.java>:[72,62]
cannot find symbol
symbol  : class PasswordToken
location: class org.apache.accumulo.core.util.shell.commands.PasswdCommand
[ERROR] <https://builds.apache.org/job/Accumulo-Trunk/org.apache.accumulo$accumulo-core/ws/src/main/java/org/apache/accumulo/core/util/shell/commands/PasswdCommand.java>:[72,28]
cannot find symbol
symbol  : variable CredentialHelper
location: class org.apache.accumulo.core.util.shell.commands.PasswdCommand
[ERROR] <https://builds.apache.org/job/Accumulo-Trunk/org.apache.accumulo$accumulo-core/ws/src/main/java/org/apache/accumulo/core/util/MetadataTable.java>:[244,72]
cannot find symbol
symbol  : variable CredentialHelper
location: class org.apache.accumulo.core.util.MetadataTable
[ERROR] <https://builds.apache.org/job/Accumulo-Trunk/org.apache.accumulo$accumulo-core/ws/src/main/java/org/apache/accumulo/core/client/mapred/AccumuloOutputFormat.java>:[379,69]
cannot find symbol
symbol  : variable CredentialHelper
location: class org.apache.accumulo.core.client.mapred.AccumuloOutputFormat.AccumuloRecordWriter
[ERROR] <https://builds.apache.org/job/Accumulo-Trunk/org.apache.accumulo$accumulo-core/ws/src/main/java/org/apache/accumulo/core/client/mapred/AccumuloOutputFormat.java>:[513,69]
cannot find symbol
symbol  : variable CredentialHelper
location: class org.apache.accumulo.core.client.mapred.AccumuloOutputFormat
[ERROR] <https://builds.apache.org/job/Accumulo-Trunk/org.apache.accumulo$accumulo-core/ws/src/main/java/org/apache/accumulo/core/client/mapred/AccumuloOutputFormat.java>:[514,70]
cannot find symbol
symbol  : variable CredentialHelper
location: class org.apache.accumulo.core.client.mapred.AccumuloOutputFormat
[INFO] 100 errors 
[INFO] -------------------------------------------------------------

projectFailed org.apache.accumulo:accumulo-core:1.5.0-SNAPSHOT

Mime
View raw message