accumulo-notifications mailing list archives

Site index · List index
Message view « Date » · « Thread »
Top « Date » · « Thread »
From Apache Jenkins Server <jenk...@builds.apache.org>
Subject Build failed in Jenkins: Accumulo-Trunk #722
Date Sun, 10 Feb 2013 03:20:59 GMT
See <https://builds.apache.org/job/Accumulo-Trunk/722/changes>

Changes:

[vines] ACCUMULO-1041 - minor packaging mishap

------------------------------------------
[...truncated 3083 lines...]
location: class org.apache.accumulo.core.client.mock.MockSecurityOperations
[ERROR] <https://builds.apache.org/job/Accumulo-Trunk/ws/accumulo-trunk/core/src/main/java/org/apache/accumulo/core/client/mock/MockSecurityOperations.java>:[63,47]
cannot find symbol
symbol  : class SecurityToken
location: class org.apache.accumulo.core.client.mock.MockSecurityOperations
[ERROR] <https://builds.apache.org/job/Accumulo-Trunk/ws/accumulo-trunk/core/src/main/java/org/apache/accumulo/core/client/mock/MockSecurityOperations.java>:[71,43]
cannot find symbol
symbol  : class SecurityToken
location: class org.apache.accumulo.core.client.mock.MockSecurityOperations
[ERROR] <https://builds.apache.org/job/Accumulo-Trunk/ws/accumulo-trunk/core/src/main/java/org/apache/accumulo/core/client/mapred/InputFormatBase.java>:[59,47]
package org.apache.accumulo.core.security.tokens does not exist
[ERROR] <https://builds.apache.org/job/Accumulo-Trunk/ws/accumulo-trunk/core/src/main/java/org/apache/accumulo/core/client/mapred/InputFormatBase.java>:[104,69]
cannot find symbol
symbol  : class SecurityToken
location: class org.apache.accumulo.core.client.mapred.InputFormatBase<K,V>
[ERROR] <https://builds.apache.org/job/Accumulo-Trunk/ws/accumulo-trunk/core/src/main/java/org/apache/accumulo/core/client/mapreduce/InputFormatBase.java>:[68,47]
package org.apache.accumulo.core.security.tokens does not exist
[ERROR] <https://builds.apache.org/job/Accumulo-Trunk/ws/accumulo-trunk/core/src/main/java/org/apache/accumulo/core/client/mapreduce/InputFormatBase.java>:[69,47]
package org.apache.accumulo.core.security.tokens does not exist
[ERROR] <https://builds.apache.org/job/Accumulo-Trunk/ws/accumulo-trunk/core/src/main/java/org/apache/accumulo/core/client/mapreduce/InputFormatBase.java>:[117,65]
cannot find symbol
symbol  : class SecurityToken
location: class org.apache.accumulo.core.client.mapreduce.InputFormatBase<K,V>
[ERROR] <https://builds.apache.org/job/Accumulo-Trunk/ws/accumulo-trunk/core/src/main/java/org/apache/accumulo/core/cli/ClientOpts.java>:[41,47]
package org.apache.accumulo.core.security.tokens does not exist
[ERROR] <https://builds.apache.org/job/Accumulo-Trunk/ws/accumulo-trunk/core/src/main/java/org/apache/accumulo/core/cli/ClientOpts.java>:[42,47]
package org.apache.accumulo.core.security.tokens does not exist
[ERROR] <https://builds.apache.org/job/Accumulo-Trunk/ws/accumulo-trunk/core/src/main/java/org/apache/accumulo/core/cli/ClientOpts.java>:[112,9]
cannot find symbol
symbol  : class SecurityToken
location: class org.apache.accumulo.core.cli.ClientOpts
[ERROR] <https://builds.apache.org/job/Accumulo-Trunk/ws/accumulo-trunk/core/src/main/java/org/apache/accumulo/core/security/handler/InsecureAuthenticator.java>:[22,47]
package org.apache.accumulo.core.security.tokens does not exist
[ERROR] <https://builds.apache.org/job/Accumulo-Trunk/ws/accumulo-trunk/core/src/main/java/org/apache/accumulo/core/security/handler/InsecureAuthenticator.java>:[23,47]
package org.apache.accumulo.core.security.tokens does not exist
[ERROR] <https://builds.apache.org/job/Accumulo-Trunk/ws/accumulo-trunk/core/src/main/java/org/apache/accumulo/core/security/handler/Authenticator.java>:[22,47]
package org.apache.accumulo.core.security.tokens does not exist
[ERROR] <https://builds.apache.org/job/Accumulo-Trunk/ws/accumulo-trunk/core/src/main/java/org/apache/accumulo/core/security/handler/InsecureAuthenticator.java>:[31,9]
cannot find symbol
symbol  : class SecurityToken
location: class org.apache.accumulo.core.security.handler.InsecureAuthenticator
[ERROR] <https://builds.apache.org/job/Accumulo-Trunk/ws/accumulo-trunk/core/src/main/java/org/apache/accumulo/core/security/handler/Authenticator.java>:[25,9]
cannot find symbol
symbol  : class SecurityToken
location: interface org.apache.accumulo.core.security.handler.Authenticator
[ERROR] <https://builds.apache.org/job/Accumulo-Trunk/ws/accumulo-trunk/core/src/main/java/org/apache/accumulo/core/client/admin/SecurityOperationsImpl.java>:[37,47]
package org.apache.accumulo.core.security.tokens does not exist
[ERROR] <https://builds.apache.org/job/Accumulo-Trunk/ws/accumulo-trunk/core/src/main/java/org/apache/accumulo/core/client/admin/SecurityOperationsImpl.java>:[38,47]
package org.apache.accumulo.core.security.tokens does not exist
[ERROR] <https://builds.apache.org/job/Accumulo-Trunk/ws/accumulo-trunk/core/src/main/java/org/apache/accumulo/core/client/admin/SecurityOperationsImpl.java>:[114,55]
cannot find symbol
symbol  : class SecurityToken
location: class org.apache.accumulo.core.client.admin.SecurityOperationsImpl
[ERROR] <https://builds.apache.org/job/Accumulo-Trunk/ws/accumulo-trunk/core/src/main/java/org/apache/accumulo/core/client/admin/SecurityOperationsImpl.java>:[119,44]
cannot find symbol
symbol  : class SecurityToken
location: class org.apache.accumulo.core.client.admin.SecurityOperationsImpl
[ERROR] <https://builds.apache.org/job/Accumulo-Trunk/ws/accumulo-trunk/core/src/main/java/org/apache/accumulo/core/client/admin/SecurityOperationsImpl.java>:[172,64]
cannot find symbol
symbol  : class SecurityToken
location: class org.apache.accumulo.core.client.admin.SecurityOperationsImpl
[ERROR] <https://builds.apache.org/job/Accumulo-Trunk/ws/accumulo-trunk/core/src/main/java/org/apache/accumulo/core/client/admin/SecurityOperationsImpl.java>:[203,54]
cannot find symbol
symbol  : class SecurityToken
location: class org.apache.accumulo.core.client.admin.SecurityOperationsImpl
[ERROR] <https://builds.apache.org/job/Accumulo-Trunk/ws/accumulo-trunk/core/src/main/java/org/apache/accumulo/core/client/ZooKeeperInstance.java>:[36,47]
package org.apache.accumulo.core.security.tokens does not exist
[ERROR] <https://builds.apache.org/job/Accumulo-Trunk/ws/accumulo-trunk/core/src/main/java/org/apache/accumulo/core/client/ZooKeeperInstance.java>:[37,47]
package org.apache.accumulo.core.security.tokens does not exist
[ERROR] <https://builds.apache.org/job/Accumulo-Trunk/ws/accumulo-trunk/core/src/main/java/org/apache/accumulo/core/client/ZooKeeperInstance.java>:[226,50]
cannot find symbol
symbol  : class SecurityToken
location: class org.apache.accumulo.core.client.ZooKeeperInstance
[ERROR] <https://builds.apache.org/job/Accumulo-Trunk/ws/accumulo-trunk/core/src/main/java/org/apache/accumulo/core/client/mock/MockInstance.java>:[36,47]
package org.apache.accumulo.core.security.tokens does not exist
[ERROR] <https://builds.apache.org/job/Accumulo-Trunk/ws/accumulo-trunk/core/src/main/java/org/apache/accumulo/core/client/mock/MockInstance.java>:[37,47]
package org.apache.accumulo.core.security.tokens does not exist
[ERROR] <https://builds.apache.org/job/Accumulo-Trunk/ws/accumulo-trunk/core/src/main/java/org/apache/accumulo/core/client/mock/MockInstance.java>:[159,50]
cannot find symbol
symbol  : class SecurityToken
location: class org.apache.accumulo.core.client.mock.MockInstance
[ERROR] <https://builds.apache.org/job/Accumulo-Trunk/ws/accumulo-trunk/core/src/main/java/org/apache/accumulo/core/client/mapreduce/lib/util/ConfiguratorBase.java>:[27,47]
package org.apache.accumulo.core.security.tokens does not exist
[ERROR] <https://builds.apache.org/job/Accumulo-Trunk/ws/accumulo-trunk/core/src/main/java/org/apache/accumulo/core/client/mapreduce/lib/util/ConfiguratorBase.java>:[101,104]
cannot find symbol
symbol  : class SecurityToken
location: class org.apache.accumulo.core.client.mapreduce.lib.util.ConfiguratorBase
[ERROR] <https://builds.apache.org/job/Accumulo-Trunk/ws/accumulo-trunk/core/src/main/java/org/apache/accumulo/core/security/handler/ZKAuthenticator.java>:[24,47]
package org.apache.accumulo.core.security.tokens does not exist
[ERROR] <https://builds.apache.org/job/Accumulo-Trunk/ws/accumulo-trunk/core/src/main/java/org/apache/accumulo/core/security/handler/ZKAuthenticator.java>:[25,47]
package org.apache.accumulo.core.security.tokens does not exist
[ERROR] <https://builds.apache.org/job/Accumulo-Trunk/ws/accumulo-trunk/core/src/main/java/org/apache/accumulo/core/security/handler/ZKAuthenticator.java>:[33,9]
cannot find symbol
symbol  : class SecurityToken
location: class org.apache.accumulo.core.security.handler.ZKAuthenticator
[ERROR] <https://builds.apache.org/job/Accumulo-Trunk/ws/accumulo-trunk/core/src/main/java/org/apache/accumulo/core/client/mapreduce/AccumuloOutputFormat.java>:[45,47]
package org.apache.accumulo.core.security.tokens does not exist
[ERROR] <https://builds.apache.org/job/Accumulo-Trunk/ws/accumulo-trunk/core/src/main/java/org/apache/accumulo/core/client/mapreduce/AccumuloOutputFormat.java>:[46,47]
package org.apache.accumulo.core.security.tokens does not exist
[ERROR] <https://builds.apache.org/job/Accumulo-Trunk/ws/accumulo-trunk/core/src/main/java/org/apache/accumulo/core/client/mapreduce/AccumuloOutputFormat.java>:[95,65]
cannot find symbol
symbol  : class SecurityToken
location: class org.apache.accumulo.core.client.mapreduce.AccumuloOutputFormat
[ERROR] <https://builds.apache.org/job/Accumulo-Trunk/ws/accumulo-trunk/core/src/main/java/org/apache/accumulo/core/util/shell/commands/PasswdCommand.java>:[25,47]
package org.apache.accumulo.core.security.tokens does not exist
[ERROR] <https://builds.apache.org/job/Accumulo-Trunk/ws/accumulo-trunk/core/src/main/java/org/apache/accumulo/core/client/mapred/AccumuloOutputFormat.java>:[44,47]
package org.apache.accumulo.core.security.tokens does not exist
[ERROR] <https://builds.apache.org/job/Accumulo-Trunk/ws/accumulo-trunk/core/src/main/java/org/apache/accumulo/core/client/mapred/AccumuloOutputFormat.java>:[91,69]
cannot find symbol
symbol  : class SecurityToken
location: class org.apache.accumulo.core.client.mapred.AccumuloOutputFormat
[ERROR] <https://builds.apache.org/job/Accumulo-Trunk/ws/accumulo-trunk/core/src/main/java/org/apache/accumulo/core/security/CredentialHelper.java>:[29,47]
package org.apache.accumulo.core.security.tokens does not exist
[ERROR] <https://builds.apache.org/job/Accumulo-Trunk/ws/accumulo-trunk/core/src/main/java/org/apache/accumulo/core/security/CredentialHelper.java>:[46,52]
cannot find symbol
symbol  : class SecurityToken
location: class org.apache.accumulo.core.security.CredentialHelper
[ERROR] <https://builds.apache.org/job/Accumulo-Trunk/ws/accumulo-trunk/core/src/main/java/org/apache/accumulo/core/security/CredentialHelper.java>:[104,16]
cannot find symbol
symbol  : class SecurityToken
location: class org.apache.accumulo.core.security.CredentialHelper
mojoFailed org.apache.maven.plugins:maven-compiler-plugin:2.3.2(default-compile)[ERROR] <https://builds.apache.org/job/Accumulo-Trunk/ws/accumulo-trunk/core/src/main/java/org/apache/accumulo/core/security/CredentialHelper.java>:[115,64]
cannot find symbol
symbol  : class SecurityToken
location: class org.apache.accumulo.core.security.CredentialHelper
[ERROR] <https://builds.apache.org/job/Accumulo-Trunk/ws/accumulo-trunk/core/src/main/java/org/apache/accumulo/core/security/CredentialHelper.java>:[129,37]
cannot find symbol
symbol  : class SecurityToken
location: class org.apache.accumulo.core.security.CredentialHelper
[ERROR] <https://builds.apache.org/job/Accumulo-Trunk/ws/accumulo-trunk/core/src/main/java/org/apache/accumulo/core/security/CredentialHelper.java>:[138,32]
cannot find symbol
symbol  : class SecurityToken
location: class org.apache.accumulo.core.security.CredentialHelper
[ERROR] <https://builds.apache.org/job/Accumulo-Trunk/ws/accumulo-trunk/core/src/main/java/org/apache/accumulo/core/security/CredentialHelper.java>:[158,16]
cannot find symbol
symbol  : class SecurityToken
location: class org.apache.accumulo.core.security.CredentialHelper
[ERROR] <https://builds.apache.org/job/Accumulo-Trunk/ws/accumulo-trunk/core/src/main/java/org/apache/accumulo/core/client/mock/MockAccumulo.java>:[47,45]
cannot find symbol
symbol  : class PasswordToken
location: class org.apache.accumulo.core.client.mock.MockAccumulo
[ERROR] <https://builds.apache.org/job/Accumulo-Trunk/ws/accumulo-trunk/core/src/main/java/org/apache/accumulo/core/util/shell/Shell.java>:[281,59]
cannot find symbol
symbol  : class PasswordToken
location: class org.apache.accumulo.core.util.shell.Shell
[ERROR] <https://builds.apache.org/job/Accumulo-Trunk/ws/accumulo-trunk/core/src/main/java/org/apache/accumulo/core/util/shell/commands/UserCommand.java>:[49,60]
cannot find symbol
symbol  : class PasswordToken
location: class org.apache.accumulo.core.util.shell.commands.UserCommand
[ERROR] <https://builds.apache.org/job/Accumulo-Trunk/ws/accumulo-trunk/core/src/main/java/org/apache/accumulo/core/client/mock/MockSecurityOperations.java>:[45,52]
cannot find symbol
symbol  : class PasswordToken
location: class org.apache.accumulo.core.client.mock.MockSecurityOperations
[ERROR] <https://builds.apache.org/job/Accumulo-Trunk/ws/accumulo-trunk/core/src/main/java/org/apache/accumulo/core/client/mock/MockSecurityOperations.java>:[59,38]
cannot find symbol
symbol  : class PasswordToken
location: class org.apache.accumulo.core.client.mock.MockSecurityOperations
[ERROR] <https://builds.apache.org/job/Accumulo-Trunk/ws/accumulo-trunk/core/src/main/java/org/apache/accumulo/core/client/mock/MockSecurityOperations.java>:[81,30]
cannot find symbol
symbol  : class PasswordToken
location: class org.apache.accumulo.core.client.mock.MockSecurityOperations
[ERROR] <https://builds.apache.org/job/Accumulo-Trunk/ws/accumulo-trunk/core/src/main/java/org/apache/accumulo/core/client/mapreduce/InputFormatBase.java>:[1015,64]
cannot find symbol
symbol  : class PasswordToken
location: class org.apache.accumulo.core.client.mapreduce.InputFormatBase<K,V>
[ERROR] <https://builds.apache.org/job/Accumulo-Trunk/ws/accumulo-trunk/core/src/main/java/org/apache/accumulo/core/cli/ClientOpts.java>:[113,4]
cannot find symbol
symbol  : class PasswordToken
location: class org.apache.accumulo.core.cli.ClientOpts
[ERROR] <https://builds.apache.org/job/Accumulo-Trunk/ws/accumulo-trunk/core/src/main/java/org/apache/accumulo/core/cli/ClientOpts.java>:[113,27]
cannot find symbol
symbol  : class PasswordToken
location: class org.apache.accumulo.core.cli.ClientOpts
[ERROR] <https://builds.apache.org/job/Accumulo-Trunk/ws/accumulo-trunk/core/src/main/java/org/apache/accumulo/core/security/handler/InsecureAuthenticator.java>:[32,15]
cannot find symbol
symbol  : class NullToken
location: class org.apache.accumulo.core.security.handler.InsecureAuthenticator
[ERROR] <https://builds.apache.org/job/Accumulo-Trunk/ws/accumulo-trunk/core/src/main/java/org/apache/accumulo/core/client/admin/SecurityOperationsImpl.java>:[119,15]
createUser(java.lang.String,SecurityToken,org.apache.accumulo.core.security.Authorizations)
in org.apache.accumulo.core.client.admin.SecurityOperationsImpl cannot implement createUser(java.lang.String,byte[],org.apache.accumulo.core.security.Authorizations)
in org.apache.accumulo.core.client.admin.SecurityOperations; attempting to assign weaker access
privileges; was public
[ERROR] <https://builds.apache.org/job/Accumulo-Trunk/ws/accumulo-trunk/core/src/main/java/org/apache/accumulo/core/client/admin/SecurityOperationsImpl.java>:[99,25]
cannot find symbol
symbol  : class PasswordToken
location: class org.apache.accumulo.core.client.admin.SecurityOperationsImpl
[ERROR] <https://builds.apache.org/job/Accumulo-Trunk/ws/accumulo-trunk/core/src/main/java/org/apache/accumulo/core/client/admin/SecurityOperationsImpl.java>:[168,43]
cannot find symbol
symbol  : class PasswordToken
location: class org.apache.accumulo.core.client.admin.SecurityOperationsImpl
[ERROR] <https://builds.apache.org/job/Accumulo-Trunk/ws/accumulo-trunk/core/src/main/java/org/apache/accumulo/core/client/admin/SecurityOperationsImpl.java>:[199,35]
cannot find symbol
symbol  : class PasswordToken
location: class org.apache.accumulo.core.client.admin.SecurityOperationsImpl
[ERROR] <https://builds.apache.org/job/Accumulo-Trunk/ws/accumulo-trunk/core/src/main/java/org/apache/accumulo/core/client/ZooKeeperInstance.java>:[237,39]
cannot find symbol
symbol  : class PasswordToken
location: class org.apache.accumulo.core.client.ZooKeeperInstance
[ERROR] <https://builds.apache.org/job/Accumulo-Trunk/ws/accumulo-trunk/core/src/main/java/org/apache/accumulo/core/client/mock/MockInstance.java>:[121,34]
cannot find symbol
symbol  : class PasswordToken
location: class org.apache.accumulo.core.client.mock.MockInstance
[ERROR] <https://builds.apache.org/job/Accumulo-Trunk/ws/accumulo-trunk/core/src/main/java/org/apache/accumulo/core/security/handler/ZKAuthenticator.java>:[35,17]
cannot find symbol
symbol  : class PasswordToken
location: class org.apache.accumulo.core.security.handler.ZKAuthenticator
[ERROR] <https://builds.apache.org/job/Accumulo-Trunk/ws/accumulo-trunk/core/src/main/java/org/apache/accumulo/core/client/mapreduce/AccumuloOutputFormat.java>:[552,65]
cannot find symbol
symbol  : class PasswordToken
location: class org.apache.accumulo.core.client.mapreduce.AccumuloOutputFormat
[ERROR] <https://builds.apache.org/job/Accumulo-Trunk/ws/accumulo-trunk/core/src/main/java/org/apache/accumulo/core/util/shell/commands/PasswdCommand.java>:[72,62]
cannot find symbol
symbol  : class PasswordToken
location: class org.apache.accumulo.core.util.shell.commands.PasswdCommand
[ERROR] <https://builds.apache.org/job/Accumulo-Trunk/ws/accumulo-trunk/core/src/main/java/org/apache/accumulo/core/security/CredentialHelper.java>:[161,25]
cannot find symbol
symbol  : class SecurityToken
location: class org.apache.accumulo.core.security.CredentialHelper
[ERROR] <https://builds.apache.org/job/Accumulo-Trunk/ws/accumulo-trunk/core/src/main/java/org/apache/accumulo/core/security/CredentialHelper.java>:[162,8]
cannot find symbol
symbol  : class SecurityToken
location: class org.apache.accumulo.core.security.CredentialHelper
[ERROR] <https://builds.apache.org/job/Accumulo-Trunk/ws/accumulo-trunk/core/src/main/java/org/apache/accumulo/core/security/CredentialHelper.java>:[162,31]
cannot find symbol
symbol  : class SecurityToken
location: class org.apache.accumulo.core.security.CredentialHelper
[INFO] 82 errors 
[INFO] -------------------------------------------------------------

projectFailed org.apache.accumulo:accumulo-core:1.5.0-SNAPSHOT
sessionEnded
[INFO] ------------------------------------------------------------------------
[INFO] Reactor Summary:
[INFO] 
[INFO] Apache Accumulo ................................... SUCCESS [27.263s]
[INFO] Trace ............................................. SUCCESS [21.043s]
[INFO] Start ............................................. SUCCESS [1:05.485s]
[INFO] Fate .............................................. SUCCESS [10.161s]
[INFO] Core .............................................. FAILURE [10.388s]
[INFO] Server ............................................ SKIPPED
[INFO] Examples .......................................... SKIPPED
[INFO] Simple Examples ................................... SKIPPED
[INFO] Testing ........................................... SKIPPED
[INFO] Instamo Example ................................... SKIPPED
[INFO] Proxy ............................................. SKIPPED
[INFO] Assemble .......................................... SKIPPED
[INFO] ------------------------------------------------------------------------
[INFO] BUILD FAILURE
[INFO] ------------------------------------------------------------------------
[INFO] Total time: 2:18.226s
[INFO] Finished at: Sun Feb 10 03:20:27 UTC 2013
[INFO] Final Memory: 49M/174M
[INFO] ------------------------------------------------------------------------
Projects to build: [MavenProject: org.apache.accumulo:accumulo:1.5.0-SNAPSHOT @ <https://builds.apache.org/job/Accumulo-Trunk/ws/accumulo-trunk/pom.xml,>
MavenProject: org.apache.accumulo:accumulo-trace:1.5.0-SNAPSHOT @ <https://builds.apache.org/job/Accumulo-Trunk/ws/accumulo-trunk/trace/pom.xml,>
MavenProject: org.apache.accumulo:accumulo-start:1.5.0-SNAPSHOT @ <https://builds.apache.org/job/Accumulo-Trunk/ws/accumulo-trunk/start/pom.xml,>
MavenProject: org.apache.accumulo:accumulo-fate:1.5.0-SNAPSHOT @ <https://builds.apache.org/job/Accumulo-Trunk/ws/accumulo-trunk/fate/pom.xml,>
MavenProject: org.apache.accumulo:accumulo-core:1.5.0-SNAPSHOT @ <https://builds.apache.org/job/Accumulo-Trunk/ws/accumulo-trunk/core/pom.xml,>
MavenProject: org.apache.accumulo:accumulo-server:1.5.0-SNAPSHOT @ <https://builds.apache.org/job/Accumulo-Trunk/ws/accumulo-trunk/server/pom.xml,>
MavenProject: org.apache.accumulo:accumulo-examples:1.5.0-SNAPSHOT @ <https://builds.apache.org/job/Accumulo-Trunk/ws/accumulo-trunk/examples/pom.xml,>
MavenProject: org.apache.accumulo:accumulo-examples-simple:1.5.0-SNAPSHOT @ <https://builds.apache.org/job/Accumulo-Trunk/ws/accumulo-trunk/examples/simple/pom.xml,>
MavenProject: org.apache.accumulo:accumulo-test:1.5.0-SNAPSHOT @ <https://builds.apache.org/job/Accumulo-Trunk/ws/accumulo-trunk/test/pom.xml,>
MavenProject: org.apache.accumulo:accumulo-examples-instamo:1.5.0-SNAPSHOT @ <https://builds.apache.org/job/Accumulo-Trunk/ws/accumulo-trunk/examples/instamo/pom.xml,>
MavenProject: org.apache.accumulo:accumulo-proxy:1.5.0-SNAPSHOT @ <https://builds.apache.org/job/Accumulo-Trunk/ws/accumulo-trunk/proxy/pom.xml,>
MavenProject: org.apache.accumulo:accumulo-assemble:1.5.0-SNAPSHOT @ <https://builds.apache.org/job/Accumulo-Trunk/ws/accumulo-trunk/assemble/pom.xml]>
[JENKINS] Archiving <https://builds.apache.org/job/Accumulo-Trunk/ws/accumulo-trunk/assemble/pom.xml>
to /home/hudson/hudson/jobs/Accumulo-Trunk/modules/org.apache.accumulo$accumulo-assemble/builds/2013-02-10_03-17-55/archive/org.apache.accumulo/accumulo-assemble/1.5.0-SNAPSHOT/accumulo-assemble-1.5.0-SNAPSHOT.pom
[JENKINS] Archiving <https://builds.apache.org/job/Accumulo-Trunk/ws/accumulo-trunk/server/pom.xml>
to /home/hudson/hudson/jobs/Accumulo-Trunk/modules/org.apache.accumulo$accumulo-server/builds/2013-02-10_03-17-55/archive/org.apache.accumulo/accumulo-server/1.5.0-SNAPSHOT/accumulo-server-1.5.0-SNAPSHOT.pom
[JENKINS] Archiving <https://builds.apache.org/job/Accumulo-Trunk/ws/accumulo-trunk/examples/simple/pom.xml>
to /home/hudson/hudson/jobs/Accumulo-Trunk/modules/org.apache.accumulo$accumulo-examples-simple/builds/2013-02-10_03-17-55/archive/org.apache.accumulo/accumulo-examples-simple/1.5.0-SNAPSHOT/accumulo-examples-simple-1.5.0-SNAPSHOT.pom
[JENKINS] Archiving <https://builds.apache.org/job/Accumulo-Trunk/ws/accumulo-trunk/proxy/pom.xml>
to /home/hudson/hudson/jobs/Accumulo-Trunk/modules/org.apache.accumulo$accumulo-proxy/builds/2013-02-10_03-17-55/archive/org.apache.accumulo/accumulo-proxy/1.5.0-SNAPSHOT/accumulo-proxy-1.5.0-SNAPSHOT.pom
[JENKINS] Archiving <https://builds.apache.org/job/Accumulo-Trunk/ws/accumulo-trunk/examples/pom.xml>
to /home/hudson/hudson/jobs/Accumulo-Trunk/modules/org.apache.accumulo$accumulo-examples/builds/2013-02-10_03-17-55/archive/org.apache.accumulo/accumulo-examples/1.5.0-SNAPSHOT/accumulo-examples-1.5.0-SNAPSHOT.pom
[JENKINS] Archiving <https://builds.apache.org/job/Accumulo-Trunk/ws/accumulo-trunk/pom.xml>
to /home/hudson/hudson/jobs/Accumulo-Trunk/modules/org.apache.accumulo$accumulo/builds/2013-02-10_03-17-55/archive/org.apache.accumulo/accumulo/1.5.0-SNAPSHOT/accumulo-1.5.0-SNAPSHOT.pom
[JENKINS] Archiving <https://builds.apache.org/job/Accumulo-Trunk/ws/accumulo-trunk/target/accumulo-1.5.0-SNAPSHOT-site.xml>
to /home/hudson/hudson/jobs/Accumulo-Trunk/modules/org.apache.accumulo$accumulo/builds/2013-02-10_03-17-55/archive/org.apache.accumulo/accumulo/1.5.0-SNAPSHOT/accumulo-1.5.0-SNAPSHOT-site.xml
[JENKINS] Archiving <https://builds.apache.org/job/Accumulo-Trunk/ws/accumulo-trunk/test/pom.xml>
to /home/hudson/hudson/jobs/Accumulo-Trunk/modules/org.apache.accumulo$accumulo-test/builds/2013-02-10_03-17-55/archive/org.apache.accumulo/accumulo-test/1.5.0-SNAPSHOT/accumulo-test-1.5.0-SNAPSHOT.pom
[JENKINS] Archiving <https://builds.apache.org/job/Accumulo-Trunk/ws/accumulo-trunk/start/pom.xml>
to /home/hudson/hudson/jobs/Accumulo-Trunk/modules/org.apache.accumulo$accumulo-start/builds/2013-02-10_03-17-55/archive/org.apache.accumulo/accumulo-start/1.5.0-SNAPSHOT/accumulo-start-1.5.0-SNAPSHOT.pom
[JENKINS] Archiving <https://builds.apache.org/job/Accumulo-Trunk/ws/accumulo-trunk/lib/accumulo-start-1.5.0-SNAPSHOT.jar>
to /home/hudson/hudson/jobs/Accumulo-Trunk/modules/org.apache.accumulo$accumulo-start/builds/2013-02-10_03-17-55/archive/org.apache.accumulo/accumulo-start/1.5.0-SNAPSHOT/accumulo-start-1.5.0-SNAPSHOT.jar
[JENKINS] Archiving <https://builds.apache.org/job/Accumulo-Trunk/ws/accumulo-trunk/lib/accumulo-start-1.5.0-SNAPSHOT-sources.jar>
to /home/hudson/hudson/jobs/Accumulo-Trunk/modules/org.apache.accumulo$accumulo-start/builds/2013-02-10_03-17-55/archive/org.apache.accumulo/accumulo-start/1.5.0-SNAPSHOT/accumulo-start-1.5.0-SNAPSHOT-sources.jar
[JENKINS] Archiving <https://builds.apache.org/job/Accumulo-Trunk/ws/accumulo-trunk/lib/accumulo-start-1.5.0-SNAPSHOT-test-sources.jar>
to /home/hudson/hudson/jobs/Accumulo-Trunk/modules/org.apache.accumulo$accumulo-start/builds/2013-02-10_03-17-55/archive/org.apache.accumulo/accumulo-start/1.5.0-SNAPSHOT/accumulo-start-1.5.0-SNAPSHOT-test-sources.jar
[JENKINS] Archiving <https://builds.apache.org/job/Accumulo-Trunk/ws/accumulo-trunk/fate/pom.xml>
to /home/hudson/hudson/jobs/Accumulo-Trunk/modules/org.apache.accumulo$accumulo-fate/builds/2013-02-10_03-17-55/archive/org.apache.accumulo/accumulo-fate/1.5.0-SNAPSHOT/accumulo-fate-1.5.0-SNAPSHOT.pom
[JENKINS] Archiving <https://builds.apache.org/job/Accumulo-Trunk/ws/accumulo-trunk/lib/accumulo-fate-1.5.0-SNAPSHOT.jar>
to /home/hudson/hudson/jobs/Accumulo-Trunk/modules/org.apache.accumulo$accumulo-fate/builds/2013-02-10_03-17-55/archive/org.apache.accumulo/accumulo-fate/1.5.0-SNAPSHOT/accumulo-fate-1.5.0-SNAPSHOT.jar
[JENKINS] Archiving <https://builds.apache.org/job/Accumulo-Trunk/ws/accumulo-trunk/lib/accumulo-fate-1.5.0-SNAPSHOT-sources.jar>
to /home/hudson/hudson/jobs/Accumulo-Trunk/modules/org.apache.accumulo$accumulo-fate/builds/2013-02-10_03-17-55/archive/org.apache.accumulo/accumulo-fate/1.5.0-SNAPSHOT/accumulo-fate-1.5.0-SNAPSHOT-sources.jar
[JENKINS] Archiving <https://builds.apache.org/job/Accumulo-Trunk/ws/accumulo-trunk/lib/accumulo-fate-1.5.0-SNAPSHOT-test-sources.jar>
to /home/hudson/hudson/jobs/Accumulo-Trunk/modules/org.apache.accumulo$accumulo-fate/builds/2013-02-10_03-17-55/archive/org.apache.accumulo/accumulo-fate/1.5.0-SNAPSHOT/accumulo-fate-1.5.0-SNAPSHOT-test-sources.jar
[JENKINS] Archiving <https://builds.apache.org/job/Accumulo-Trunk/ws/accumulo-trunk/core/pom.xml>
to /home/hudson/hudson/jobs/Accumulo-Trunk/modules/org.apache.accumulo$accumulo-core/builds/2013-02-10_03-17-55/archive/org.apache.accumulo/accumulo-core/1.5.0-SNAPSHOT/accumulo-core-1.5.0-SNAPSHOT.pom
[JENKINS] Archiving <https://builds.apache.org/job/Accumulo-Trunk/ws/accumulo-trunk/trace/pom.xml>
to /home/hudson/hudson/jobs/Accumulo-Trunk/modules/org.apache.accumulo$accumulo-trace/builds/2013-02-10_03-17-55/archive/org.apache.accumulo/accumulo-trace/1.5.0-SNAPSHOT/accumulo-trace-1.5.0-SNAPSHOT.pom
[JENKINS] Archiving <https://builds.apache.org/job/Accumulo-Trunk/ws/accumulo-trunk/lib/accumulo-trace-1.5.0-SNAPSHOT.jar>
to /home/hudson/hudson/jobs/Accumulo-Trunk/modules/org.apache.accumulo$accumulo-trace/builds/2013-02-10_03-17-55/archive/org.apache.accumulo/accumulo-trace/1.5.0-SNAPSHOT/accumulo-trace-1.5.0-SNAPSHOT.jar
[JENKINS] Archiving <https://builds.apache.org/job/Accumulo-Trunk/ws/accumulo-trunk/lib/accumulo-trace-1.5.0-SNAPSHOT-sources.jar>
to /home/hudson/hudson/jobs/Accumulo-Trunk/modules/org.apache.accumulo$accumulo-trace/builds/2013-02-10_03-17-55/archive/org.apache.accumulo/accumulo-trace/1.5.0-SNAPSHOT/accumulo-trace-1.5.0-SNAPSHOT-sources.jar
[JENKINS] Archiving <https://builds.apache.org/job/Accumulo-Trunk/ws/accumulo-trunk/lib/accumulo-trace-1.5.0-SNAPSHOT-test-sources.jar>
to /home/hudson/hudson/jobs/Accumulo-Trunk/modules/org.apache.accumulo$accumulo-trace/builds/2013-02-10_03-17-55/archive/org.apache.accumulo/accumulo-trace/1.5.0-SNAPSHOT/accumulo-trace-1.5.0-SNAPSHOT-test-sources.jar
[JENKINS] Archiving <https://builds.apache.org/job/Accumulo-Trunk/ws/accumulo-trunk/examples/instamo/pom.xml>
to /home/hudson/hudson/jobs/Accumulo-Trunk/modules/org.apache.accumulo$accumulo-examples-instamo/builds/2013-02-10_03-17-55/archive/org.apache.accumulo/accumulo-examples-instamo/1.5.0-SNAPSHOT/accumulo-examples-instamo-1.5.0-SNAPSHOT.pom
Waiting for Jenkins to finish collecting data
mavenExecutionResult exceptions not empty
message : Failed to execute goal org.apache.maven.plugins:maven-compiler-plugin:2.3.2:compile
(default-compile) on project accumulo-core: Compilation failure
cause : Compilation failure
Stack trace : 
org.apache.maven.lifecycle.LifecycleExecutionException: Failed to execute goal org.apache.maven.plugins:maven-compiler-plugin:2.3.2:compile
(default-compile) on project accumulo-core: Compilation failure
	at org.apache.maven.lifecycle.internal.MojoExecutor.execute(MojoExecutor.java:213)
	at org.apache.maven.lifecycle.internal.MojoExecutor.execute(MojoExecutor.java:153)
	at org.apache.maven.lifecycle.internal.MojoExecutor.execute(MojoExecutor.java:145)
	at org.apache.maven.lifecycle.internal.LifecycleModuleBuilder.buildProject(LifecycleModuleBuilder.java:84)
	at org.apache.maven.lifecycle.internal.LifecycleModuleBuilder.buildProject(LifecycleModuleBuilder.java:59)
	at org.apache.maven.lifecycle.internal.LifecycleStarter.singleThreadedBuild(LifecycleStarter.java:183)
	at org.apache.maven.lifecycle.internal.LifecycleStarter.execute(LifecycleStarter.java:161)
	at org.apache.maven.DefaultMaven.doExecute(DefaultMaven.java:320)
	at org.apache.maven.DefaultMaven.execute(DefaultMaven.java:156)
	at org.jvnet.hudson.maven3.launcher.Maven3Launcher.main(Maven3Launcher.java:79)
	at sun.reflect.NativeMethodAccessorImpl.invoke0(Native Method)
	at sun.reflect.NativeMethodAccessorImpl.invoke(NativeMethodAccessorImpl.java:39)
	at sun.reflect.DelegatingMethodAccessorImpl.invoke(DelegatingMethodAccessorImpl.java:25)
	at java.lang.reflect.Method.invoke(Method.java:597)
	at org.codehaus.plexus.classworlds.launcher.Launcher.launchStandard(Launcher.java:329)
	at org.codehaus.plexus.classworlds.launcher.Launcher.launch(Launcher.java:239)
	at org.jvnet.hudson.maven3.agent.Maven3Main.launch(Maven3Main.java:158)
	at hudson.maven.Maven3Builder.call(Maven3Builder.java:100)
	at hudson.maven.Maven3Builder.call(Maven3Builder.java:66)
	at hudson.remoting.UserRequest.perform(UserRequest.java:118)
	at hudson.remoting.UserRequest.perform(UserRequest.java:48)
	at hudson.remoting.Request$2.run(Request.java:326)
	at hudson.remoting.InterceptingExecutorService$1.call(InterceptingExecutorService.java:72)
	at java.util.concurrent.FutureTask$Sync.innerRun(FutureTask.java:303)
	at java.util.concurrent.FutureTask.run(FutureTask.java:138)
	at java.util.concurrent.ThreadPoolExecutor$Worker.runTask(ThreadPoolExecutor.java:886)
	at java.util.concurrent.ThreadPoolExecutor$Worker.run(ThreadPoolExecutor.java:908)
	at java.lang.Thread.run(Thread.java:662)
Caused by: org.apache.maven.plugin.CompilationFailureException: Compilation failure
	at org.apache.maven.plugin.AbstractCompilerMojo.execute(AbstractCompilerMojo.java:656)
	at org.apache.maven.plugin.CompilerMojo.execute(CompilerMojo.java:128)
	at org.apache.maven.plugin.DefaultBuildPluginManager.executeMojo(DefaultBuildPluginManager.java:101)
	at org.apache.maven.lifecycle.internal.MojoExecutor.execute(MojoExecutor.java:209)
	... 27 more
Sending e-mails to: notifications@accumulo.apache.org
channel stopped
Updating ACCUMULO-1041

Mime
View raw message