accumulo-notifications mailing list archives

Site index · List index
Message view « Date » · « Thread »
Top « Date » · « Thread »
From Apache Jenkins Server <jenk...@builds.apache.org>
Subject Build failed in Jenkins: Accumulo-Trunk-Hadoop-2.0 #78
Date Sat, 09 Feb 2013 08:57:29 GMT
See <https://builds.apache.org/job/Accumulo-Trunk-Hadoop-2.0/78/changes>

Changes:

[vines] ACCUMULO-1041 - Majority of the client interfaces tackled. CLI needs work, as does
proxy. Javadocs are a mess, as are some variable names, but it's functional. Except mapreduce
APIs need DistributedCache code reintegrated as discussed on JIRA

------------------------------------------
[...truncated 3126 lines...]
[ERROR] <https://builds.apache.org/job/Accumulo-Trunk-Hadoop-2.0/ws/accumulo-trunk/core/src/main/java/org/apache/accumulo/core/util/shell/commands/UserCommand.java>:[26,40]
cannot find symbol
symbol  : class CredentialHelper
location: package org.apache.accumulo.core.security
[ERROR] <https://builds.apache.org/job/Accumulo-Trunk-Hadoop-2.0/ws/accumulo-trunk/core/src/main/java/org/apache/accumulo/core/util/shell/commands/UserCommand.java>:[28,54]
package org.apache.accumulo.core.security.thrift.tokens does not exist
[ERROR] <https://builds.apache.org/job/Accumulo-Trunk-Hadoop-2.0/ws/accumulo-trunk/core/src/main/java/org/apache/accumulo/core/client/mock/MockInstance.java>:[31,40]
cannot find symbol
symbol  : class CredentialHelper
location: package org.apache.accumulo.core.security
[ERROR] <https://builds.apache.org/job/Accumulo-Trunk-Hadoop-2.0/ws/accumulo-trunk/core/src/main/java/org/apache/accumulo/core/client/mock/MockInstance.java>:[32,48]
package org.apache.accumulo.core.security.handler does not exist
[ERROR] <https://builds.apache.org/job/Accumulo-Trunk-Hadoop-2.0/ws/accumulo-trunk/core/src/main/java/org/apache/accumulo/core/client/mock/MockInstance.java>:[36,54]
package org.apache.accumulo.core.security.thrift.tokens does not exist
[ERROR] <https://builds.apache.org/job/Accumulo-Trunk-Hadoop-2.0/ws/accumulo-trunk/core/src/main/java/org/apache/accumulo/core/client/mock/MockInstance.java>:[37,54]
package org.apache.accumulo.core.security.thrift.tokens does not exist
[ERROR] <https://builds.apache.org/job/Accumulo-Trunk-Hadoop-2.0/ws/accumulo-trunk/core/src/main/java/org/apache/accumulo/core/client/mock/MockInstance.java>:[159,50]
cannot find symbol
symbol  : class SecurityToken
location: class org.apache.accumulo.core.client.mock.MockInstance
[ERROR] <https://builds.apache.org/job/Accumulo-Trunk-Hadoop-2.0/ws/accumulo-trunk/core/src/main/java/org/apache/accumulo/core/client/ZooKeeperInstance.java>:[32,40]
cannot find symbol
symbol  : class CredentialHelper
location: package org.apache.accumulo.core.security
[ERROR] <https://builds.apache.org/job/Accumulo-Trunk-Hadoop-2.0/ws/accumulo-trunk/core/src/main/java/org/apache/accumulo/core/client/ZooKeeperInstance.java>:[36,54]
package org.apache.accumulo.core.security.thrift.tokens does not exist
[ERROR] <https://builds.apache.org/job/Accumulo-Trunk-Hadoop-2.0/ws/accumulo-trunk/core/src/main/java/org/apache/accumulo/core/client/ZooKeeperInstance.java>:[37,54]
package org.apache.accumulo.core.security.thrift.tokens does not exist
[ERROR] <https://builds.apache.org/job/Accumulo-Trunk-Hadoop-2.0/ws/accumulo-trunk/core/src/main/java/org/apache/accumulo/core/client/ZooKeeperInstance.java>:[226,50]
cannot find symbol
symbol  : class SecurityToken
location: class org.apache.accumulo.core.client.ZooKeeperInstance
[ERROR] <https://builds.apache.org/job/Accumulo-Trunk-Hadoop-2.0/ws/accumulo-trunk/core/src/main/java/org/apache/accumulo/core/util/shell/commands/PasswdCommand.java>:[23,40]
cannot find symbol
symbol  : class CredentialHelper
location: package org.apache.accumulo.core.security
[ERROR] <https://builds.apache.org/job/Accumulo-Trunk-Hadoop-2.0/ws/accumulo-trunk/core/src/main/java/org/apache/accumulo/core/util/shell/commands/PasswdCommand.java>:[25,54]
package org.apache.accumulo.core.security.thrift.tokens does not exist
[ERROR] <https://builds.apache.org/job/Accumulo-Trunk-Hadoop-2.0/ws/accumulo-trunk/core/src/main/java/org/apache/accumulo/core/util/MetadataTable.java>:[42,40]
cannot find symbol
symbol  : class CredentialHelper
location: package org.apache.accumulo.core.security
[ERROR] <https://builds.apache.org/job/Accumulo-Trunk-Hadoop-2.0/ws/accumulo-trunk/core/src/main/java/org/apache/accumulo/core/client/admin/TableOperationsImpl.java>:[77,40]
cannot find symbol
symbol  : class CredentialHelper
location: package org.apache.accumulo.core.security
[ERROR] <https://builds.apache.org/job/Accumulo-Trunk-Hadoop-2.0/ws/accumulo-trunk/core/src/main/java/org/apache/accumulo/core/client/mapreduce/lib/util/InputConfigurator.java>:[49,40]
cannot find symbol
symbol  : class CredentialHelper
location: package org.apache.accumulo.core.security
[ERROR] <https://builds.apache.org/job/Accumulo-Trunk-Hadoop-2.0/ws/accumulo-trunk/core/src/main/java/org/apache/accumulo/core/client/mapred/AccumuloOutputFormat.java>:[42,40]
cannot find symbol
symbol  : class CredentialHelper
location: package org.apache.accumulo.core.security
[ERROR] <https://builds.apache.org/job/Accumulo-Trunk-Hadoop-2.0/ws/accumulo-trunk/core/src/main/java/org/apache/accumulo/core/client/mapred/AccumuloOutputFormat.java>:[44,54]
package org.apache.accumulo.core.security.thrift.tokens does not exist
[ERROR] <https://builds.apache.org/job/Accumulo-Trunk-Hadoop-2.0/ws/accumulo-trunk/core/src/main/java/org/apache/accumulo/core/client/mapred/AccumuloOutputFormat.java>:[91,69]
cannot find symbol
symbol  : class SecurityToken
location: class org.apache.accumulo.core.client.mapred.AccumuloOutputFormat
[ERROR] <https://builds.apache.org/job/Accumulo-Trunk-Hadoop-2.0/ws/accumulo-trunk/core/src/main/java/org/apache/accumulo/core/util/shell/Shell.java>:[281,59]
cannot find symbol
symbol  : class PasswordToken
location: class org.apache.accumulo.core.util.shell.Shell
[ERROR] <https://builds.apache.org/job/Accumulo-Trunk-Hadoop-2.0/ws/accumulo-trunk/core/src/main/java/org/apache/accumulo/core/util/shell/Shell.java>:[281,25]
cannot find symbol
symbol  : variable CredentialHelper
location: class org.apache.accumulo.core.util.shell.Shell
[ERROR] <https://builds.apache.org/job/Accumulo-Trunk-Hadoop-2.0/ws/accumulo-trunk/core/src/main/java/org/apache/accumulo/core/cli/ClientOpts.java>:[113,4]
cannot find symbol
symbol  : class PasswordToken
location: class org.apache.accumulo.core.cli.ClientOpts
[ERROR] <https://builds.apache.org/job/Accumulo-Trunk-Hadoop-2.0/ws/accumulo-trunk/core/src/main/java/org/apache/accumulo/core/cli/ClientOpts.java>:[113,27]
cannot find symbol
symbol  : class PasswordToken
location: class org.apache.accumulo.core.cli.ClientOpts
[ERROR] <https://builds.apache.org/job/Accumulo-Trunk-Hadoop-2.0/ws/accumulo-trunk/core/src/main/java/org/apache/accumulo/core/cli/ClientOpts.java>:[210,11]
cannot find symbol
symbol  : variable CredentialHelper
location: class org.apache.accumulo.core.cli.ClientOpts
[ERROR] <https://builds.apache.org/job/Accumulo-Trunk-Hadoop-2.0/ws/accumulo-trunk/core/src/main/java/org/apache/accumulo/core/client/mapred/InputFormatBase.java>:[592,53]
cannot find symbol
symbol  : variable CredentialHelper
location: class org.apache.accumulo.core.client.mapred.InputFormatBase.RecordReaderBase<K,V>
[ERROR] <https://builds.apache.org/job/Accumulo-Trunk-Hadoop-2.0/ws/accumulo-trunk/core/src/main/java/org/apache/accumulo/core/client/mapreduce/InputFormatBase.java>:[608,58]
cannot find symbol
symbol  : variable CredentialHelper
location: class org.apache.accumulo.core.client.mapreduce.InputFormatBase.RecordReaderBase<K,V>
[ERROR] <https://builds.apache.org/job/Accumulo-Trunk-Hadoop-2.0/ws/accumulo-trunk/core/src/main/java/org/apache/accumulo/core/client/mapreduce/InputFormatBase.java>:[1015,64]
cannot find symbol
symbol  : class PasswordToken
location: class org.apache.accumulo.core.client.mapreduce.InputFormatBase<K,V>
[ERROR] <https://builds.apache.org/job/Accumulo-Trunk-Hadoop-2.0/ws/accumulo-trunk/core/src/main/java/org/apache/accumulo/core/client/mock/MockSecurityOperations.java>:[45,52]
cannot find symbol
symbol  : class PasswordToken
location: class org.apache.accumulo.core.client.mock.MockSecurityOperations
[ERROR] <https://builds.apache.org/job/Accumulo-Trunk-Hadoop-2.0/ws/accumulo-trunk/core/src/main/java/org/apache/accumulo/core/client/mock/MockSecurityOperations.java>:[59,38]
cannot find symbol
symbol  : class PasswordToken
location: class org.apache.accumulo.core.client.mock.MockSecurityOperations
[ERROR] <https://builds.apache.org/job/Accumulo-Trunk-Hadoop-2.0/ws/accumulo-trunk/core/src/main/java/org/apache/accumulo/core/client/mock/MockSecurityOperations.java>:[81,30]
cannot find symbol
symbol  : class PasswordToken
location: class org.apache.accumulo.core.client.mock.MockSecurityOperations
[ERROR] <https://builds.apache.org/job/Accumulo-Trunk-Hadoop-2.0/ws/accumulo-trunk/core/src/main/java/org/apache/accumulo/core/client/mock/MockAccumulo.java>:[47,45]
cannot find symbol
symbol  : class PasswordToken
location: class org.apache.accumulo.core.client.mock.MockAccumulo
[ERROR] <https://builds.apache.org/job/Accumulo-Trunk-Hadoop-2.0/ws/accumulo-trunk/core/src/main/java/org/apache/accumulo/core/client/mapreduce/lib/util/ConfiguratorBase.java>:[109,68]
cannot find symbol
symbol  : variable CredentialHelper
location: class org.apache.accumulo.core.client.mapreduce.lib.util.ConfiguratorBase
[ERROR] <https://builds.apache.org/job/Accumulo-Trunk-Hadoop-2.0/ws/accumulo-trunk/core/src/main/java/org/apache/accumulo/core/client/mapreduce/AccumuloOutputFormat.java>:[383,77]
cannot find symbol
symbol  : variable CredentialHelper
location: class org.apache.accumulo.core.client.mapreduce.AccumuloOutputFormat.AccumuloRecordWriter
[ERROR] <https://builds.apache.org/job/Accumulo-Trunk-Hadoop-2.0/ws/accumulo-trunk/core/src/main/java/org/apache/accumulo/core/client/mapreduce/AccumuloOutputFormat.java>:[517,69]
cannot find symbol
symbol  : variable CredentialHelper
location: class org.apache.accumulo.core.client.mapreduce.AccumuloOutputFormat
[ERROR] <https://builds.apache.org/job/Accumulo-Trunk-Hadoop-2.0/ws/accumulo-trunk/core/src/main/java/org/apache/accumulo/core/client/mapreduce/AccumuloOutputFormat.java>:[518,70]
cannot find symbol
symbol  : variable CredentialHelper
location: class org.apache.accumulo.core.client.mapreduce.AccumuloOutputFormat
[ERROR] <https://builds.apache.org/job/Accumulo-Trunk-Hadoop-2.0/ws/accumulo-trunk/core/src/main/java/org/apache/accumulo/core/client/mapreduce/AccumuloOutputFormat.java>:[552,65]
cannot find symbol
symbol  : class PasswordToken
location: class org.apache.accumulo.core.client.mapreduce.AccumuloOutputFormat
[ERROR] <https://builds.apache.org/job/Accumulo-Trunk-Hadoop-2.0/ws/accumulo-trunk/core/src/main/java/org/apache/accumulo/core/client/admin/SecurityOperationsImpl.java>:[119,15]
createUser(java.lang.String,SecurityToken,org.apache.accumulo.core.security.Authorizations)
in org.apache.accumulo.core.client.admin.SecurityOperationsImpl cannot implement createUser(java.lang.String,byte[],org.apache.accumulo.core.security.Authorizations)
in org.apache.accumulo.core.client.admin.SecurityOperations; attempting to assign weaker access
privileges; was public
[ERROR] <https://builds.apache.org/job/Accumulo-Trunk-Hadoop-2.0/ws/accumulo-trunk/core/src/main/java/org/apache/accumulo/core/client/admin/SecurityOperationsImpl.java>:[99,25]
cannot find symbol
symbol  : class PasswordToken
location: class org.apache.accumulo.core.client.admin.SecurityOperationsImpl
[ERROR] <https://builds.apache.org/job/Accumulo-Trunk-Hadoop-2.0/ws/accumulo-trunk/core/src/main/java/org/apache/accumulo/core/client/admin/SecurityOperationsImpl.java>:[121,32]
cannot find symbol
symbol  : variable CredentialHelper
location: class org.apache.accumulo.core.client.admin.SecurityOperationsImpl
[ERROR] <https://builds.apache.org/job/Accumulo-Trunk-Hadoop-2.0/ws/accumulo-trunk/core/src/main/java/org/apache/accumulo/core/client/admin/SecurityOperationsImpl.java>:[168,43]
cannot find symbol
symbol  : class PasswordToken
location: class org.apache.accumulo.core.client.admin.SecurityOperationsImpl
[ERROR] <https://builds.apache.org/job/Accumulo-Trunk-Hadoop-2.0/ws/accumulo-trunk/core/src/main/java/org/apache/accumulo/core/client/admin/SecurityOperationsImpl.java>:[174,30]
cannot find symbol
symbol  : variable CredentialHelper
location: class org.apache.accumulo.core.client.admin.SecurityOperationsImpl
[ERROR] <https://builds.apache.org/job/Accumulo-Trunk-Hadoop-2.0/ws/accumulo-trunk/core/src/main/java/org/apache/accumulo/core/client/admin/SecurityOperationsImpl.java>:[199,35]
cannot find symbol
symbol  : class PasswordToken
location: class org.apache.accumulo.core.client.admin.SecurityOperationsImpl
[ERROR] <https://builds.apache.org/job/Accumulo-Trunk-Hadoop-2.0/ws/accumulo-trunk/core/src/main/java/org/apache/accumulo/core/client/admin/SecurityOperationsImpl.java>:[205,32]
cannot find symbol
symbol  : variable CredentialHelper
location: class org.apache.accumulo.core.client.admin.SecurityOperationsImpl
[ERROR] <https://builds.apache.org/job/Accumulo-Trunk-Hadoop-2.0/ws/accumulo-trunk/core/src/main/java/org/apache/accumulo/core/util/shell/commands/UserCommand.java>:[49,60]
cannot find symbol
symbol  : class PasswordToken
location: class org.apache.accumulo.core.util.shell.commands.UserCommand
[ERROR] <https://builds.apache.org/job/Accumulo-Trunk-Hadoop-2.0/ws/accumulo-trunk/core/src/main/java/org/apache/accumulo/core/util/shell/commands/UserCommand.java>:[49,26]
cannot find symbol
symbol  : variable CredentialHelper
location: class org.apache.accumulo.core.util.shell.commands.UserCommand
[ERROR] <https://builds.apache.org/job/Accumulo-Trunk-Hadoop-2.0/ws/accumulo-trunk/core/src/main/java/org/apache/accumulo/core/client/mock/MockInstance.java>:[121,34]
cannot find symbol
symbol  : class PasswordToken
location: class org.apache.accumulo.core.client.mock.MockInstance
mojoFailed org.apache.maven.plugins:maven-compiler-plugin:2.3.2(default-compile)[ERROR] <https://builds.apache.org/job/Accumulo-Trunk-Hadoop-2.0/ws/accumulo-trunk/core/src/main/java/org/apache/accumulo/core/client/mock/MockInstance.java>:[155,11]
cannot find symbol
symbol  : class ZKAuthenticator
location: class org.apache.accumulo.core.client.mock.MockInstance
[ERROR] <https://builds.apache.org/job/Accumulo-Trunk-Hadoop-2.0/ws/accumulo-trunk/core/src/main/java/org/apache/accumulo/core/client/mock/MockInstance.java>:[170,46]
cannot find symbol
symbol  : variable CredentialHelper
location: class org.apache.accumulo.core.client.mock.MockInstance
[ERROR] <https://builds.apache.org/job/Accumulo-Trunk-Hadoop-2.0/ws/accumulo-trunk/core/src/main/java/org/apache/accumulo/core/client/ZooKeeperInstance.java>:[227,24]
cannot find symbol
symbol  : variable CredentialHelper
location: class org.apache.accumulo.core.client.ZooKeeperInstance
[ERROR] <https://builds.apache.org/job/Accumulo-Trunk-Hadoop-2.0/ws/accumulo-trunk/core/src/main/java/org/apache/accumulo/core/client/ZooKeeperInstance.java>:[237,39]
cannot find symbol
symbol  : class PasswordToken
location: class org.apache.accumulo.core.client.ZooKeeperInstance
[ERROR] <https://builds.apache.org/job/Accumulo-Trunk-Hadoop-2.0/ws/accumulo-trunk/core/src/main/java/org/apache/accumulo/core/util/shell/commands/PasswdCommand.java>:[72,62]
cannot find symbol
symbol  : class PasswordToken
location: class org.apache.accumulo.core.util.shell.commands.PasswdCommand
[ERROR] <https://builds.apache.org/job/Accumulo-Trunk-Hadoop-2.0/ws/accumulo-trunk/core/src/main/java/org/apache/accumulo/core/util/shell/commands/PasswdCommand.java>:[72,28]
cannot find symbol
symbol  : variable CredentialHelper
location: class org.apache.accumulo.core.util.shell.commands.PasswdCommand
[ERROR] <https://builds.apache.org/job/Accumulo-Trunk-Hadoop-2.0/ws/accumulo-trunk/core/src/main/java/org/apache/accumulo/core/util/MetadataTable.java>:[244,72]
cannot find symbol
symbol  : variable CredentialHelper
location: class org.apache.accumulo.core.util.MetadataTable
[ERROR] <https://builds.apache.org/job/Accumulo-Trunk-Hadoop-2.0/ws/accumulo-trunk/core/src/main/java/org/apache/accumulo/core/client/admin/TableOperationsImpl.java>:[1157,72]
cannot find symbol
symbol  : variable CredentialHelper
location: class org.apache.accumulo.core.client.admin.TableOperationsImpl
[ERROR] <https://builds.apache.org/job/Accumulo-Trunk-Hadoop-2.0/ws/accumulo-trunk/core/src/main/java/org/apache/accumulo/core/client/mapreduce/lib/util/InputConfigurator.java>:[516,90]
cannot find symbol
symbol  : variable CredentialHelper
location: class org.apache.accumulo.core.client.mapreduce.lib.util.InputConfigurator
[ERROR] <https://builds.apache.org/job/Accumulo-Trunk-Hadoop-2.0/ws/accumulo-trunk/core/src/main/java/org/apache/accumulo/core/client/mapred/AccumuloOutputFormat.java>:[379,69]
cannot find symbol
symbol  : variable CredentialHelper
location: class org.apache.accumulo.core.client.mapred.AccumuloOutputFormat.AccumuloRecordWriter
[ERROR] <https://builds.apache.org/job/Accumulo-Trunk-Hadoop-2.0/ws/accumulo-trunk/core/src/main/java/org/apache/accumulo/core/client/mapred/AccumuloOutputFormat.java>:[513,69]
cannot find symbol
symbol  : variable CredentialHelper
location: class org.apache.accumulo.core.client.mapred.AccumuloOutputFormat
[ERROR] <https://builds.apache.org/job/Accumulo-Trunk-Hadoop-2.0/ws/accumulo-trunk/core/src/main/java/org/apache/accumulo/core/client/mapred/AccumuloOutputFormat.java>:[514,70]
cannot find symbol
symbol  : variable CredentialHelper
location: class org.apache.accumulo.core.client.mapred.AccumuloOutputFormat
[INFO] 100 errors 
[INFO] -------------------------------------------------------------

projectFailed org.apache.accumulo:accumulo-core:1.5.0-SNAPSHOT
sessionEnded
[INFO] ------------------------------------------------------------------------
[INFO] Reactor Summary:
[INFO] 
[INFO] Apache Accumulo ................................... SUCCESS [22.107s]
[INFO] Trace ............................................. SUCCESS [29.326s]
[INFO] Start ............................................. SUCCESS [1:24.221s]
[INFO] Fate .............................................. SUCCESS [13.679s]
[INFO] Core .............................................. FAILURE [15.434s]
[INFO] Server ............................................ SKIPPED
[INFO] Examples .......................................... SKIPPED
[INFO] Simple Examples ................................... SKIPPED
[INFO] Testing ........................................... SKIPPED
[INFO] Instamo Example ................................... SKIPPED
[INFO] Proxy ............................................. SKIPPED
[INFO] Assemble .......................................... SKIPPED
[INFO] ------------------------------------------------------------------------
[INFO] BUILD FAILURE
[INFO] ------------------------------------------------------------------------
[INFO] Total time: 2:49.693s
[INFO] Finished at: Sat Feb 09 08:57:06 UTC 2013
[INFO] Final Memory: 67M/396M
[INFO] ------------------------------------------------------------------------
Projects to build: [MavenProject: org.apache.accumulo:accumulo:1.5.0-SNAPSHOT @ <https://builds.apache.org/job/Accumulo-Trunk-Hadoop-2.0/ws/accumulo-trunk/pom.xml,>
MavenProject: org.apache.accumulo:accumulo-trace:1.5.0-SNAPSHOT @ <https://builds.apache.org/job/Accumulo-Trunk-Hadoop-2.0/ws/accumulo-trunk/trace/pom.xml,>
MavenProject: org.apache.accumulo:accumulo-start:1.5.0-SNAPSHOT @ <https://builds.apache.org/job/Accumulo-Trunk-Hadoop-2.0/ws/accumulo-trunk/start/pom.xml,>
MavenProject: org.apache.accumulo:accumulo-fate:1.5.0-SNAPSHOT @ <https://builds.apache.org/job/Accumulo-Trunk-Hadoop-2.0/ws/accumulo-trunk/fate/pom.xml,>
MavenProject: org.apache.accumulo:accumulo-core:1.5.0-SNAPSHOT @ <https://builds.apache.org/job/Accumulo-Trunk-Hadoop-2.0/ws/accumulo-trunk/core/pom.xml,>
MavenProject: org.apache.accumulo:accumulo-server:1.5.0-SNAPSHOT @ <https://builds.apache.org/job/Accumulo-Trunk-Hadoop-2.0/ws/accumulo-trunk/server/pom.xml,>
MavenProject: org.apache.accumulo:accumulo-examples:1.5.0-SNAPSHOT @ <https://builds.apache.org/job/Accumulo-Trunk-Hadoop-2.0/ws/accumulo-trunk/examples/pom.xml,>
MavenProject: org.apache.accumulo:accumulo-examples-simple:1.5.0-SNAPSHOT @ <https://builds.apache.org/job/Accumulo-Trunk-Hadoop-2.0/ws/accumulo-trunk/examples/simple/pom.xml,>
MavenProject: org.apache.accumulo:accumulo-test:1.5.0-SNAPSHOT @ <https://builds.apache.org/job/Accumulo-Trunk-Hadoop-2.0/ws/accumulo-trunk/test/pom.xml,>
MavenProject: org.apache.accumulo:accumulo-examples-instamo:1.5.0-SNAPSHOT @ <https://builds.apache.org/job/Accumulo-Trunk-Hadoop-2.0/ws/accumulo-trunk/examples/instamo/pom.xml,>
MavenProject: org.apache.accumulo:accumulo-proxy:1.5.0-SNAPSHOT @ <https://builds.apache.org/job/Accumulo-Trunk-Hadoop-2.0/ws/accumulo-trunk/proxy/pom.xml,>
MavenProject: org.apache.accumulo:accumulo-assemble:1.5.0-SNAPSHOT @ <https://builds.apache.org/job/Accumulo-Trunk-Hadoop-2.0/ws/accumulo-trunk/assemble/pom.xml]>
[JENKINS] Archiving <https://builds.apache.org/job/Accumulo-Trunk-Hadoop-2.0/ws/accumulo-trunk/assemble/pom.xml>
to /home/hudson/hudson/jobs/Accumulo-Trunk-Hadoop-2.0/modules/org.apache.accumulo$accumulo-assemble/builds/2013-02-09_08-54-03/archive/org.apache.accumulo/accumulo-assemble/1.5.0-SNAPSHOT/accumulo-assemble-1.5.0-SNAPSHOT.pom
[JENKINS] Archiving <https://builds.apache.org/job/Accumulo-Trunk-Hadoop-2.0/ws/accumulo-trunk/server/pom.xml>
to /home/hudson/hudson/jobs/Accumulo-Trunk-Hadoop-2.0/modules/org.apache.accumulo$accumulo-server/builds/2013-02-09_08-54-03/archive/org.apache.accumulo/accumulo-server/1.5.0-SNAPSHOT/accumulo-server-1.5.0-SNAPSHOT.pom
[JENKINS] Archiving <https://builds.apache.org/job/Accumulo-Trunk-Hadoop-2.0/ws/accumulo-trunk/examples/simple/pom.xml>
to /home/hudson/hudson/jobs/Accumulo-Trunk-Hadoop-2.0/modules/org.apache.accumulo$accumulo-examples-simple/builds/2013-02-09_08-54-03/archive/org.apache.accumulo/accumulo-examples-simple/1.5.0-SNAPSHOT/accumulo-examples-simple-1.5.0-SNAPSHOT.pom
[JENKINS] Archiving <https://builds.apache.org/job/Accumulo-Trunk-Hadoop-2.0/ws/accumulo-trunk/proxy/pom.xml>
to /home/hudson/hudson/jobs/Accumulo-Trunk-Hadoop-2.0/modules/org.apache.accumulo$accumulo-proxy/builds/2013-02-09_08-54-03/archive/org.apache.accumulo/accumulo-proxy/1.5.0-SNAPSHOT/accumulo-proxy-1.5.0-SNAPSHOT.pom
[JENKINS] Archiving <https://builds.apache.org/job/Accumulo-Trunk-Hadoop-2.0/ws/accumulo-trunk/examples/pom.xml>
to /home/hudson/hudson/jobs/Accumulo-Trunk-Hadoop-2.0/modules/org.apache.accumulo$accumulo-examples/builds/2013-02-09_08-54-03/archive/org.apache.accumulo/accumulo-examples/1.5.0-SNAPSHOT/accumulo-examples-1.5.0-SNAPSHOT.pom
[JENKINS] Archiving <https://builds.apache.org/job/Accumulo-Trunk-Hadoop-2.0/ws/accumulo-trunk/pom.xml>
to /home/hudson/hudson/jobs/Accumulo-Trunk-Hadoop-2.0/modules/org.apache.accumulo$accumulo/builds/2013-02-09_08-54-03/archive/org.apache.accumulo/accumulo/1.5.0-SNAPSHOT/accumulo-1.5.0-SNAPSHOT.pom
[JENKINS] Archiving <https://builds.apache.org/job/Accumulo-Trunk-Hadoop-2.0/ws/accumulo-trunk/target/accumulo-1.5.0-SNAPSHOT-site.xml>
to /home/hudson/hudson/jobs/Accumulo-Trunk-Hadoop-2.0/modules/org.apache.accumulo$accumulo/builds/2013-02-09_08-54-03/archive/org.apache.accumulo/accumulo/1.5.0-SNAPSHOT/accumulo-1.5.0-SNAPSHOT-site.xml
[JENKINS] Archiving <https://builds.apache.org/job/Accumulo-Trunk-Hadoop-2.0/ws/accumulo-trunk/test/pom.xml>
to /home/hudson/hudson/jobs/Accumulo-Trunk-Hadoop-2.0/modules/org.apache.accumulo$accumulo-test/builds/2013-02-09_08-54-03/archive/org.apache.accumulo/accumulo-test/1.5.0-SNAPSHOT/accumulo-test-1.5.0-SNAPSHOT.pom
[JENKINS] Archiving <https://builds.apache.org/job/Accumulo-Trunk-Hadoop-2.0/ws/accumulo-trunk/start/pom.xml>
to /home/hudson/hudson/jobs/Accumulo-Trunk-Hadoop-2.0/modules/org.apache.accumulo$accumulo-start/builds/2013-02-09_08-54-03/archive/org.apache.accumulo/accumulo-start/1.5.0-SNAPSHOT/accumulo-start-1.5.0-SNAPSHOT.pom
[JENKINS] Archiving <https://builds.apache.org/job/Accumulo-Trunk-Hadoop-2.0/ws/accumulo-trunk/lib/accumulo-start-1.5.0-SNAPSHOT.jar>
to /home/hudson/hudson/jobs/Accumulo-Trunk-Hadoop-2.0/modules/org.apache.accumulo$accumulo-start/builds/2013-02-09_08-54-03/archive/org.apache.accumulo/accumulo-start/1.5.0-SNAPSHOT/accumulo-start-1.5.0-SNAPSHOT.jar
[JENKINS] Archiving <https://builds.apache.org/job/Accumulo-Trunk-Hadoop-2.0/ws/accumulo-trunk/lib/accumulo-start-1.5.0-SNAPSHOT-sources.jar>
to /home/hudson/hudson/jobs/Accumulo-Trunk-Hadoop-2.0/modules/org.apache.accumulo$accumulo-start/builds/2013-02-09_08-54-03/archive/org.apache.accumulo/accumulo-start/1.5.0-SNAPSHOT/accumulo-start-1.5.0-SNAPSHOT-sources.jar
[JENKINS] Archiving <https://builds.apache.org/job/Accumulo-Trunk-Hadoop-2.0/ws/accumulo-trunk/lib/accumulo-start-1.5.0-SNAPSHOT-test-sources.jar>
to /home/hudson/hudson/jobs/Accumulo-Trunk-Hadoop-2.0/modules/org.apache.accumulo$accumulo-start/builds/2013-02-09_08-54-03/archive/org.apache.accumulo/accumulo-start/1.5.0-SNAPSHOT/accumulo-start-1.5.0-SNAPSHOT-test-sources.jar
[JENKINS] Archiving <https://builds.apache.org/job/Accumulo-Trunk-Hadoop-2.0/ws/accumulo-trunk/fate/pom.xml>
to /home/hudson/hudson/jobs/Accumulo-Trunk-Hadoop-2.0/modules/org.apache.accumulo$accumulo-fate/builds/2013-02-09_08-54-03/archive/org.apache.accumulo/accumulo-fate/1.5.0-SNAPSHOT/accumulo-fate-1.5.0-SNAPSHOT.pom
[JENKINS] Archiving <https://builds.apache.org/job/Accumulo-Trunk-Hadoop-2.0/ws/accumulo-trunk/lib/accumulo-fate-1.5.0-SNAPSHOT.jar>
to /home/hudson/hudson/jobs/Accumulo-Trunk-Hadoop-2.0/modules/org.apache.accumulo$accumulo-fate/builds/2013-02-09_08-54-03/archive/org.apache.accumulo/accumulo-fate/1.5.0-SNAPSHOT/accumulo-fate-1.5.0-SNAPSHOT.jar
[JENKINS] Archiving <https://builds.apache.org/job/Accumulo-Trunk-Hadoop-2.0/ws/accumulo-trunk/lib/accumulo-fate-1.5.0-SNAPSHOT-sources.jar>
to /home/hudson/hudson/jobs/Accumulo-Trunk-Hadoop-2.0/modules/org.apache.accumulo$accumulo-fate/builds/2013-02-09_08-54-03/archive/org.apache.accumulo/accumulo-fate/1.5.0-SNAPSHOT/accumulo-fate-1.5.0-SNAPSHOT-sources.jar
[JENKINS] Archiving <https://builds.apache.org/job/Accumulo-Trunk-Hadoop-2.0/ws/accumulo-trunk/lib/accumulo-fate-1.5.0-SNAPSHOT-test-sources.jar>
to /home/hudson/hudson/jobs/Accumulo-Trunk-Hadoop-2.0/modules/org.apache.accumulo$accumulo-fate/builds/2013-02-09_08-54-03/archive/org.apache.accumulo/accumulo-fate/1.5.0-SNAPSHOT/accumulo-fate-1.5.0-SNAPSHOT-test-sources.jar
[JENKINS] Archiving <https://builds.apache.org/job/Accumulo-Trunk-Hadoop-2.0/ws/accumulo-trunk/core/pom.xml>
to /home/hudson/hudson/jobs/Accumulo-Trunk-Hadoop-2.0/modules/org.apache.accumulo$accumulo-core/builds/2013-02-09_08-54-03/archive/org.apache.accumulo/accumulo-core/1.5.0-SNAPSHOT/accumulo-core-1.5.0-SNAPSHOT.pom
[JENKINS] Archiving <https://builds.apache.org/job/Accumulo-Trunk-Hadoop-2.0/ws/accumulo-trunk/trace/pom.xml>
to /home/hudson/hudson/jobs/Accumulo-Trunk-Hadoop-2.0/modules/org.apache.accumulo$accumulo-trace/builds/2013-02-09_08-54-03/archive/org.apache.accumulo/accumulo-trace/1.5.0-SNAPSHOT/accumulo-trace-1.5.0-SNAPSHOT.pom
[JENKINS] Archiving <https://builds.apache.org/job/Accumulo-Trunk-Hadoop-2.0/ws/accumulo-trunk/lib/accumulo-trace-1.5.0-SNAPSHOT.jar>
to /home/hudson/hudson/jobs/Accumulo-Trunk-Hadoop-2.0/modules/org.apache.accumulo$accumulo-trace/builds/2013-02-09_08-54-03/archive/org.apache.accumulo/accumulo-trace/1.5.0-SNAPSHOT/accumulo-trace-1.5.0-SNAPSHOT.jar
[JENKINS] Archiving <https://builds.apache.org/job/Accumulo-Trunk-Hadoop-2.0/ws/accumulo-trunk/lib/accumulo-trace-1.5.0-SNAPSHOT-sources.jar>
to /home/hudson/hudson/jobs/Accumulo-Trunk-Hadoop-2.0/modules/org.apache.accumulo$accumulo-trace/builds/2013-02-09_08-54-03/archive/org.apache.accumulo/accumulo-trace/1.5.0-SNAPSHOT/accumulo-trace-1.5.0-SNAPSHOT-sources.jar
[JENKINS] Archiving <https://builds.apache.org/job/Accumulo-Trunk-Hadoop-2.0/ws/accumulo-trunk/lib/accumulo-trace-1.5.0-SNAPSHOT-test-sources.jar>
to /home/hudson/hudson/jobs/Accumulo-Trunk-Hadoop-2.0/modules/org.apache.accumulo$accumulo-trace/builds/2013-02-09_08-54-03/archive/org.apache.accumulo/accumulo-trace/1.5.0-SNAPSHOT/accumulo-trace-1.5.0-SNAPSHOT-test-sources.jar
[JENKINS] Archiving <https://builds.apache.org/job/Accumulo-Trunk-Hadoop-2.0/ws/accumulo-trunk/examples/instamo/pom.xml>
to /home/hudson/hudson/jobs/Accumulo-Trunk-Hadoop-2.0/modules/org.apache.accumulo$accumulo-examples-instamo/builds/2013-02-09_08-54-03/archive/org.apache.accumulo/accumulo-examples-instamo/1.5.0-SNAPSHOT/accumulo-examples-instamo-1.5.0-SNAPSHOT.pom
Waiting for Jenkins to finish collecting data
mavenExecutionResult exceptions not empty
message : Failed to execute goal org.apache.maven.plugins:maven-compiler-plugin:2.3.2:compile
(default-compile) on project accumulo-core: Compilation failure
cause : Compilation failure
Stack trace : 
org.apache.maven.lifecycle.LifecycleExecutionException: Failed to execute goal org.apache.maven.plugins:maven-compiler-plugin:2.3.2:compile
(default-compile) on project accumulo-core: Compilation failure
	at org.apache.maven.lifecycle.internal.MojoExecutor.execute(MojoExecutor.java:213)
	at org.apache.maven.lifecycle.internal.MojoExecutor.execute(MojoExecutor.java:153)
	at org.apache.maven.lifecycle.internal.MojoExecutor.execute(MojoExecutor.java:145)
	at org.apache.maven.lifecycle.internal.LifecycleModuleBuilder.buildProject(LifecycleModuleBuilder.java:84)
	at org.apache.maven.lifecycle.internal.LifecycleModuleBuilder.buildProject(LifecycleModuleBuilder.java:59)
	at org.apache.maven.lifecycle.internal.LifecycleStarter.singleThreadedBuild(LifecycleStarter.java:183)
	at org.apache.maven.lifecycle.internal.LifecycleStarter.execute(LifecycleStarter.java:161)
	at org.apache.maven.DefaultMaven.doExecute(DefaultMaven.java:320)
	at org.apache.maven.DefaultMaven.execute(DefaultMaven.java:156)
	at org.jvnet.hudson.maven3.launcher.Maven3Launcher.main(Maven3Launcher.java:79)
	at sun.reflect.NativeMethodAccessorImpl.invoke0(Native Method)
	at sun.reflect.NativeMethodAccessorImpl.invoke(NativeMethodAccessorImpl.java:39)
	at sun.reflect.DelegatingMethodAccessorImpl.invoke(DelegatingMethodAccessorImpl.java:25)
	at java.lang.reflect.Method.invoke(Method.java:597)
	at org.codehaus.plexus.classworlds.launcher.Launcher.launchStandard(Launcher.java:329)
	at org.codehaus.plexus.classworlds.launcher.Launcher.launch(Launcher.java:239)
	at org.jvnet.hudson.maven3.agent.Maven3Main.launch(Maven3Main.java:158)
	at hudson.maven.Maven3Builder.call(Maven3Builder.java:100)
	at hudson.maven.Maven3Builder.call(Maven3Builder.java:66)
	at hudson.remoting.UserRequest.perform(UserRequest.java:118)
	at hudson.remoting.UserRequest.perform(UserRequest.java:48)
	at hudson.remoting.Request$2.run(Request.java:326)
	at hudson.remoting.InterceptingExecutorService$1.call(InterceptingExecutorService.java:72)
	at java.util.concurrent.FutureTask$Sync.innerRun(FutureTask.java:303)
	at java.util.concurrent.FutureTask.run(FutureTask.java:138)
	at java.util.concurrent.ThreadPoolExecutor$Worker.runTask(ThreadPoolExecutor.java:886)
	at java.util.concurrent.ThreadPoolExecutor$Worker.run(ThreadPoolExecutor.java:908)
	at java.lang.Thread.run(Thread.java:662)
Caused by: org.apache.maven.plugin.CompilationFailureException: Compilation failure
	at org.apache.maven.plugin.AbstractCompilerMojo.execute(AbstractCompilerMojo.java:656)
	at org.apache.maven.plugin.CompilerMojo.execute(CompilerMojo.java:128)
	at org.apache.maven.plugin.DefaultBuildPluginManager.executeMojo(DefaultBuildPluginManager.java:101)
	at org.apache.maven.lifecycle.internal.MojoExecutor.execute(MojoExecutor.java:209)
	... 27 more
Sending e-mails to: notifications@accumulo.apache.org
channel stopped
Updating ACCUMULO-1041

Mime
View raw message