accumulo-notifications mailing list archives

Site index · List index
Message view « Date » · « Thread »
Top « Date » · « Thread »
From Apache Jenkins Server <jenk...@builds.apache.org>
Subject Build failed in Jenkins: Accumulo-Trunk-Hadoop-2.0 » Core #80
Date Sun, 10 Feb 2013 03:19:50 GMT
See <https://builds.apache.org/job/Accumulo-Trunk-Hadoop-2.0/org.apache.accumulo$accumulo-core/80/changes>

Changes:

[vines] ACCUMULO-1041 - minor packaging mishap

------------------------------------------
projectStarted org.apache.accumulo:accumulo-core:1.5.0-SNAPSHOT
[INFO]                                                                         
[INFO] ------------------------------------------------------------------------
[INFO] Building Core 1.5.0-SNAPSHOT
[INFO] ------------------------------------------------------------------------
[INFO] Deleting <https://builds.apache.org/job/Accumulo-Trunk-Hadoop-2.0/org.apache.accumulo$accumulo-core/ws/>
(includes = [**/*.pyc], excludes = [])
mojoStarted org.apache.maven.plugins:maven-clean-plugin:2.5(default-clean)
[INFO] 
[INFO] --- maven-clean-plugin:2.5:clean (default-clean) @ accumulo-core ---
mojoSucceeded org.apache.maven.plugins:maven-clean-plugin:2.5(default-clean)
mojoStarted org.codehaus.mojo:buildnumber-maven-plugin:1.1(default)[INFO] Checking for local
modifications: skipped.
[INFO] Updating project files from SCM: skipped.
[INFO] Executing: /bin/sh -c cd <https://builds.apache.org/job/Accumulo-Trunk-Hadoop-2.0/org.apache.accumulo$accumulo-core/ws/>
&& svn --non-interactive info
[INFO] Working directory: <https://builds.apache.org/job/Accumulo-Trunk-Hadoop-2.0/org.apache.accumulo$accumulo-core/ws/>
[INFO] Storing buildNumber: 1444476 at timestamp: 1360466360630
[INFO] Executing: /bin/sh -c cd <https://builds.apache.org/job/Accumulo-Trunk-Hadoop-2.0/org.apache.accumulo$accumulo-core/ws/>
&& svn --non-interactive info
[INFO] Working directory: <https://builds.apache.org/job/Accumulo-Trunk-Hadoop-2.0/org.apache.accumulo$accumulo-core/ws/>
[INFO] Storing buildScmBranch: trunk

[INFO] 
[INFO] --- buildnumber-maven-plugin:1.1:create (default) @ accumulo-core ---
mojoSucceeded org.codehaus.mojo:buildnumber-maven-plugin:1.1(default)
mojoStarted org.apache.maven.plugins:maven-enforcer-plugin:1.0.1(enforce-mvn)
[INFO] 
[INFO] --- maven-enforcer-plugin:1.0.1:enforce (enforce-mvn) @ accumulo-core ---
mojoSucceeded org.apache.maven.plugins:maven-enforcer-plugin:1.0.1(enforce-mvn)
mojoStarted org.codehaus.mojo:exec-maven-plugin:1.2.1(generate-thrift)
[INFO] 
[INFO] --- exec-maven-plugin:1.2.1:exec (generate-thrift) @ accumulo-core ---
mojoSucceeded org.codehaus.mojo:exec-maven-plugin:1.2.1(generate-thrift)
mojoStarted org.apache.maven.plugins:maven-remote-resources-plugin:1.3(default)
[INFO] 
[INFO] --- maven-remote-resources-plugin:1.3:process (default) @ accumulo-core ---
mojoSucceeded org.apache.maven.plugins:maven-remote-resources-plugin:1.3(default)
mojoStarted org.apache.maven.plugins:maven-resources-plugin:2.5(default-resources)[debug]
execute contextualize
[INFO] Using 'UTF-8' encoding to copy filtered resources.
[INFO] Copying 1 resource
[INFO] Copying 3 resources

[INFO] 
[INFO] --- maven-resources-plugin:2.5:resources (default-resources) @ accumulo-core ---
mojoSucceeded org.apache.maven.plugins:maven-resources-plugin:2.5(default-resources)
mojoStarted org.apache.maven.plugins:maven-dependency-plugin:2.3(copy-dependencies)[INFO]
Copying commons-collections-3.2.jar to /home/hudson/hudson-slave/workspace/Accumulo-Trunk-Hadoop-2.0/accumulo-trunk/lib/commons-collections-3.2.jar
[INFO] Copying jline-0.9.94.jar to /home/hudson/hudson-slave/workspace/Accumulo-Trunk-Hadoop-2.0/accumulo-trunk/lib/jline-0.9.94.jar
[INFO] Copying jcommander-1.30.jar to /home/hudson/hudson-slave/workspace/Accumulo-Trunk-Hadoop-2.0/accumulo-trunk/lib/jcommander-1.30.jar
[INFO] commons-lang-2.4.jar already exists in destination.
[INFO] libthrift-0.9.0.jar already exists in destination.
[INFO] log4j-1.2.16.jar already exists in destination.
[INFO] commons-logging-1.0.4.jar already exists in destination.

[INFO] 
[INFO] --- maven-dependency-plugin:2.3:copy-dependencies (copy-dependencies) @ accumulo-core
---
mojoSucceeded org.apache.maven.plugins:maven-dependency-plugin:2.3(copy-dependencies)
mojoStarted org.apache.maven.plugins:maven-compiler-plugin:2.3.2(default-compile)
[INFO] 
[INFO] --- maven-compiler-plugin:2.3.2:compile (default-compile) @ accumulo-core ---
[INFO] Compiling 484 source files to <https://builds.apache.org/job/Accumulo-Trunk-Hadoop-2.0/org.apache.accumulo$accumulo-core/ws/target/classes>
[INFO] -------------------------------------------------------------
[ERROR] COMPILATION ERROR : 
[INFO] -------------------------------------------------------------
[ERROR] <https://builds.apache.org/job/Accumulo-Trunk-Hadoop-2.0/org.apache.accumulo$accumulo-core/ws/src/main/java/org/apache/accumulo/core/client/Instance.java>:[25,47]
package org.apache.accumulo.core.security.tokens does not exist
[ERROR] <https://builds.apache.org/job/Accumulo-Trunk-Hadoop-2.0/org.apache.accumulo$accumulo-core/ws/src/main/java/org/apache/accumulo/core/client/admin/SecurityOperations.java>:[26,47]
package org.apache.accumulo.core.security.tokens does not exist
[ERROR] <https://builds.apache.org/job/Accumulo-Trunk-Hadoop-2.0/org.apache.accumulo$accumulo-core/ws/src/main/java/org/apache/accumulo/core/client/Instance.java>:[162,43]
cannot find symbol
symbol  : class SecurityToken
location: interface org.apache.accumulo.core.client.Instance
[ERROR] <https://builds.apache.org/job/Accumulo-Trunk-Hadoop-2.0/org.apache.accumulo$accumulo-core/ws/src/main/java/org/apache/accumulo/core/client/admin/SecurityOperations.java>:[63,43]
cannot find symbol
symbol  : class SecurityToken
location: interface org.apache.accumulo.core.client.admin.SecurityOperations
[ERROR] <https://builds.apache.org/job/Accumulo-Trunk-Hadoop-2.0/org.apache.accumulo$accumulo-core/ws/src/main/java/org/apache/accumulo/core/client/admin/SecurityOperations.java>:[106,45]
cannot find symbol
symbol  : class SecurityToken
location: interface org.apache.accumulo.core.client.admin.SecurityOperations
[ERROR] <https://builds.apache.org/job/Accumulo-Trunk-Hadoop-2.0/org.apache.accumulo$accumulo-core/ws/src/main/java/org/apache/accumulo/core/client/admin/SecurityOperations.java>:[265,41]
cannot find symbol
symbol  : class SecurityToken
location: interface org.apache.accumulo.core.client.admin.SecurityOperations
[ERROR] <https://builds.apache.org/job/Accumulo-Trunk-Hadoop-2.0/org.apache.accumulo$accumulo-core/ws/src/main/java/org/apache/accumulo/core/util/shell/Shell.java>:[57,47]
package org.apache.accumulo.core.security.tokens does not exist
[ERROR] <https://builds.apache.org/job/Accumulo-Trunk-Hadoop-2.0/org.apache.accumulo$accumulo-core/ws/src/main/java/org/apache/accumulo/core/client/mock/MockAccumulo.java>:[32,47]
package org.apache.accumulo.core.security.tokens does not exist
[ERROR] <https://builds.apache.org/job/Accumulo-Trunk-Hadoop-2.0/org.apache.accumulo$accumulo-core/ws/src/main/java/org/apache/accumulo/core/client/mock/MockUser.java>:[23,47]
package org.apache.accumulo.core.security.tokens does not exist
[ERROR] <https://builds.apache.org/job/Accumulo-Trunk-Hadoop-2.0/org.apache.accumulo$accumulo-core/ws/src/main/java/org/apache/accumulo/core/client/mock/MockUser.java>:[28,2]
cannot find symbol
symbol  : class SecurityToken
location: class org.apache.accumulo.core.client.mock.MockUser
[ERROR] <https://builds.apache.org/job/Accumulo-Trunk-Hadoop-2.0/org.apache.accumulo$accumulo-core/ws/src/main/java/org/apache/accumulo/core/client/mock/MockUser.java>:[31,29]
cannot find symbol
symbol  : class SecurityToken
location: class org.apache.accumulo.core.client.mock.MockUser
[ERROR] <https://builds.apache.org/job/Accumulo-Trunk-Hadoop-2.0/org.apache.accumulo$accumulo-core/ws/src/main/java/org/apache/accumulo/core/client/mock/MockInstance.java>:[36,47]
package org.apache.accumulo.core.security.tokens does not exist
[ERROR] <https://builds.apache.org/job/Accumulo-Trunk-Hadoop-2.0/org.apache.accumulo$accumulo-core/ws/src/main/java/org/apache/accumulo/core/client/mock/MockInstance.java>:[37,47]
package org.apache.accumulo.core.security.tokens does not exist
[ERROR] <https://builds.apache.org/job/Accumulo-Trunk-Hadoop-2.0/org.apache.accumulo$accumulo-core/ws/src/main/java/org/apache/accumulo/core/client/mock/MockInstance.java>:[159,50]
cannot find symbol
symbol  : class SecurityToken
location: class org.apache.accumulo.core.client.mock.MockInstance
[ERROR] <https://builds.apache.org/job/Accumulo-Trunk-Hadoop-2.0/org.apache.accumulo$accumulo-core/ws/src/main/java/org/apache/accumulo/core/cli/ClientOpts.java>:[41,47]
package org.apache.accumulo.core.security.tokens does not exist
[ERROR] <https://builds.apache.org/job/Accumulo-Trunk-Hadoop-2.0/org.apache.accumulo$accumulo-core/ws/src/main/java/org/apache/accumulo/core/cli/ClientOpts.java>:[42,47]
package org.apache.accumulo.core.security.tokens does not exist
[ERROR] <https://builds.apache.org/job/Accumulo-Trunk-Hadoop-2.0/org.apache.accumulo$accumulo-core/ws/src/main/java/org/apache/accumulo/core/cli/ClientOpts.java>:[112,9]
cannot find symbol
symbol  : class SecurityToken
location: class org.apache.accumulo.core.cli.ClientOpts
[ERROR] <https://builds.apache.org/job/Accumulo-Trunk-Hadoop-2.0/org.apache.accumulo$accumulo-core/ws/src/main/java/org/apache/accumulo/core/client/mapreduce/lib/util/ConfiguratorBase.java>:[27,47]
package org.apache.accumulo.core.security.tokens does not exist
[ERROR] <https://builds.apache.org/job/Accumulo-Trunk-Hadoop-2.0/org.apache.accumulo$accumulo-core/ws/src/main/java/org/apache/accumulo/core/client/mapreduce/lib/util/ConfiguratorBase.java>:[101,104]
cannot find symbol
symbol  : class SecurityToken
location: class org.apache.accumulo.core.client.mapreduce.lib.util.ConfiguratorBase
[ERROR] <https://builds.apache.org/job/Accumulo-Trunk-Hadoop-2.0/org.apache.accumulo$accumulo-core/ws/src/main/java/org/apache/accumulo/core/client/ZooKeeperInstance.java>:[36,47]
package org.apache.accumulo.core.security.tokens does not exist
[ERROR] <https://builds.apache.org/job/Accumulo-Trunk-Hadoop-2.0/org.apache.accumulo$accumulo-core/ws/src/main/java/org/apache/accumulo/core/client/ZooKeeperInstance.java>:[37,47]
package org.apache.accumulo.core.security.tokens does not exist
[ERROR] <https://builds.apache.org/job/Accumulo-Trunk-Hadoop-2.0/org.apache.accumulo$accumulo-core/ws/src/main/java/org/apache/accumulo/core/client/ZooKeeperInstance.java>:[226,50]
cannot find symbol
symbol  : class SecurityToken
location: class org.apache.accumulo.core.client.ZooKeeperInstance
[ERROR] <https://builds.apache.org/job/Accumulo-Trunk-Hadoop-2.0/org.apache.accumulo$accumulo-core/ws/src/main/java/org/apache/accumulo/core/security/handler/ZKAuthenticator.java>:[24,47]
package org.apache.accumulo.core.security.tokens does not exist
[ERROR] <https://builds.apache.org/job/Accumulo-Trunk-Hadoop-2.0/org.apache.accumulo$accumulo-core/ws/src/main/java/org/apache/accumulo/core/security/handler/ZKAuthenticator.java>:[25,47]
package org.apache.accumulo.core.security.tokens does not exist
[ERROR] <https://builds.apache.org/job/Accumulo-Trunk-Hadoop-2.0/org.apache.accumulo$accumulo-core/ws/src/main/java/org/apache/accumulo/core/security/handler/Authenticator.java>:[22,47]
package org.apache.accumulo.core.security.tokens does not exist
[ERROR] <https://builds.apache.org/job/Accumulo-Trunk-Hadoop-2.0/org.apache.accumulo$accumulo-core/ws/src/main/java/org/apache/accumulo/core/security/handler/ZKAuthenticator.java>:[33,9]
cannot find symbol
symbol  : class SecurityToken
location: class org.apache.accumulo.core.security.handler.ZKAuthenticator
[ERROR] <https://builds.apache.org/job/Accumulo-Trunk-Hadoop-2.0/org.apache.accumulo$accumulo-core/ws/src/main/java/org/apache/accumulo/core/security/handler/Authenticator.java>:[25,9]
cannot find symbol
symbol  : class SecurityToken
location: interface org.apache.accumulo.core.security.handler.Authenticator
[ERROR] <https://builds.apache.org/job/Accumulo-Trunk-Hadoop-2.0/org.apache.accumulo$accumulo-core/ws/src/main/java/org/apache/accumulo/core/client/mapreduce/AccumuloOutputFormat.java>:[45,47]
package org.apache.accumulo.core.security.tokens does not exist
[ERROR] <https://builds.apache.org/job/Accumulo-Trunk-Hadoop-2.0/org.apache.accumulo$accumulo-core/ws/src/main/java/org/apache/accumulo/core/client/mapreduce/AccumuloOutputFormat.java>:[46,47]
package org.apache.accumulo.core.security.tokens does not exist
[ERROR] <https://builds.apache.org/job/Accumulo-Trunk-Hadoop-2.0/org.apache.accumulo$accumulo-core/ws/src/main/java/org/apache/accumulo/core/client/mapreduce/AccumuloOutputFormat.java>:[95,65]
cannot find symbol
symbol  : class SecurityToken
location: class org.apache.accumulo.core.client.mapreduce.AccumuloOutputFormat
[ERROR] <https://builds.apache.org/job/Accumulo-Trunk-Hadoop-2.0/org.apache.accumulo$accumulo-core/ws/src/main/java/org/apache/accumulo/core/client/mapreduce/InputFormatBase.java>:[68,47]
package org.apache.accumulo.core.security.tokens does not exist
[ERROR] <https://builds.apache.org/job/Accumulo-Trunk-Hadoop-2.0/org.apache.accumulo$accumulo-core/ws/src/main/java/org/apache/accumulo/core/client/mapreduce/InputFormatBase.java>:[69,47]
package org.apache.accumulo.core.security.tokens does not exist
[ERROR] <https://builds.apache.org/job/Accumulo-Trunk-Hadoop-2.0/org.apache.accumulo$accumulo-core/ws/src/main/java/org/apache/accumulo/core/client/mapreduce/InputFormatBase.java>:[117,65]
cannot find symbol
symbol  : class SecurityToken
location: class org.apache.accumulo.core.client.mapreduce.InputFormatBase<K,V>
[ERROR] <https://builds.apache.org/job/Accumulo-Trunk-Hadoop-2.0/org.apache.accumulo$accumulo-core/ws/src/main/java/org/apache/accumulo/core/client/mapred/InputFormatBase.java>:[59,47]
package org.apache.accumulo.core.security.tokens does not exist
[ERROR] <https://builds.apache.org/job/Accumulo-Trunk-Hadoop-2.0/org.apache.accumulo$accumulo-core/ws/src/main/java/org/apache/accumulo/core/client/mapred/InputFormatBase.java>:[104,69]
cannot find symbol
symbol  : class SecurityToken
location: class org.apache.accumulo.core.client.mapred.InputFormatBase<K,V>
[ERROR] <https://builds.apache.org/job/Accumulo-Trunk-Hadoop-2.0/org.apache.accumulo$accumulo-core/ws/src/main/java/org/apache/accumulo/core/security/CredentialHelper.java>:[29,47]
package org.apache.accumulo.core.security.tokens does not exist
[ERROR] <https://builds.apache.org/job/Accumulo-Trunk-Hadoop-2.0/org.apache.accumulo$accumulo-core/ws/src/main/java/org/apache/accumulo/core/security/CredentialHelper.java>:[46,52]
cannot find symbol
symbol  : class SecurityToken
location: class org.apache.accumulo.core.security.CredentialHelper
[ERROR] <https://builds.apache.org/job/Accumulo-Trunk-Hadoop-2.0/org.apache.accumulo$accumulo-core/ws/src/main/java/org/apache/accumulo/core/security/CredentialHelper.java>:[104,16]
cannot find symbol
symbol  : class SecurityToken
location: class org.apache.accumulo.core.security.CredentialHelper
[ERROR] <https://builds.apache.org/job/Accumulo-Trunk-Hadoop-2.0/org.apache.accumulo$accumulo-core/ws/src/main/java/org/apache/accumulo/core/security/CredentialHelper.java>:[115,64]
cannot find symbol
symbol  : class SecurityToken
location: class org.apache.accumulo.core.security.CredentialHelper
[ERROR] <https://builds.apache.org/job/Accumulo-Trunk-Hadoop-2.0/org.apache.accumulo$accumulo-core/ws/src/main/java/org/apache/accumulo/core/security/CredentialHelper.java>:[129,37]
cannot find symbol
symbol  : class SecurityToken
location: class org.apache.accumulo.core.security.CredentialHelper
[ERROR] <https://builds.apache.org/job/Accumulo-Trunk-Hadoop-2.0/org.apache.accumulo$accumulo-core/ws/src/main/java/org/apache/accumulo/core/security/CredentialHelper.java>:[138,32]
cannot find symbol
symbol  : class SecurityToken
location: class org.apache.accumulo.core.security.CredentialHelper
[ERROR] <https://builds.apache.org/job/Accumulo-Trunk-Hadoop-2.0/org.apache.accumulo$accumulo-core/ws/src/main/java/org/apache/accumulo/core/security/CredentialHelper.java>:[158,16]
cannot find symbol
symbol  : class SecurityToken
location: class org.apache.accumulo.core.security.CredentialHelper
[ERROR] <https://builds.apache.org/job/Accumulo-Trunk-Hadoop-2.0/org.apache.accumulo$accumulo-core/ws/src/main/java/org/apache/accumulo/core/client/mock/MockSecurityOperations.java>:[29,47]
package org.apache.accumulo.core.security.tokens does not exist
[ERROR] <https://builds.apache.org/job/Accumulo-Trunk-Hadoop-2.0/org.apache.accumulo$accumulo-core/ws/src/main/java/org/apache/accumulo/core/client/mock/MockSecurityOperations.java>:[30,47]
package org.apache.accumulo.core.security.tokens does not exist
[ERROR] <https://builds.apache.org/job/Accumulo-Trunk-Hadoop-2.0/org.apache.accumulo$accumulo-core/ws/src/main/java/org/apache/accumulo/core/client/mock/MockSecurityOperations.java>:[49,38]
cannot find symbol
symbol  : class SecurityToken
location: class org.apache.accumulo.core.client.mock.MockSecurityOperations
[ERROR] <https://builds.apache.org/job/Accumulo-Trunk-Hadoop-2.0/org.apache.accumulo$accumulo-core/ws/src/main/java/org/apache/accumulo/core/client/mock/MockSecurityOperations.java>:[63,47]
cannot find symbol
symbol  : class SecurityToken
location: class org.apache.accumulo.core.client.mock.MockSecurityOperations
[ERROR] <https://builds.apache.org/job/Accumulo-Trunk-Hadoop-2.0/org.apache.accumulo$accumulo-core/ws/src/main/java/org/apache/accumulo/core/client/mock/MockSecurityOperations.java>:[71,43]
cannot find symbol
symbol  : class SecurityToken
location: class org.apache.accumulo.core.client.mock.MockSecurityOperations
[ERROR] <https://builds.apache.org/job/Accumulo-Trunk-Hadoop-2.0/org.apache.accumulo$accumulo-core/ws/src/main/java/org/apache/accumulo/core/client/mapred/AccumuloOutputFormat.java>:[44,47]
package org.apache.accumulo.core.security.tokens does not exist
[ERROR] <https://builds.apache.org/job/Accumulo-Trunk-Hadoop-2.0/org.apache.accumulo$accumulo-core/ws/src/main/java/org/apache/accumulo/core/client/mapred/AccumuloOutputFormat.java>:[91,69]
cannot find symbol
symbol  : class SecurityToken
location: class org.apache.accumulo.core.client.mapred.AccumuloOutputFormat
[ERROR] <https://builds.apache.org/job/Accumulo-Trunk-Hadoop-2.0/org.apache.accumulo$accumulo-core/ws/src/main/java/org/apache/accumulo/core/client/admin/SecurityOperationsImpl.java>:[37,47]
package org.apache.accumulo.core.security.tokens does not exist
[ERROR] <https://builds.apache.org/job/Accumulo-Trunk-Hadoop-2.0/org.apache.accumulo$accumulo-core/ws/src/main/java/org/apache/accumulo/core/client/admin/SecurityOperationsImpl.java>:[38,47]
package org.apache.accumulo.core.security.tokens does not exist
[ERROR] <https://builds.apache.org/job/Accumulo-Trunk-Hadoop-2.0/org.apache.accumulo$accumulo-core/ws/src/main/java/org/apache/accumulo/core/client/admin/SecurityOperationsImpl.java>:[114,55]
cannot find symbol
symbol  : class SecurityToken
location: class org.apache.accumulo.core.client.admin.SecurityOperationsImpl
[ERROR] <https://builds.apache.org/job/Accumulo-Trunk-Hadoop-2.0/org.apache.accumulo$accumulo-core/ws/src/main/java/org/apache/accumulo/core/client/admin/SecurityOperationsImpl.java>:[119,44]
cannot find symbol
symbol  : class SecurityToken
location: class org.apache.accumulo.core.client.admin.SecurityOperationsImpl
[ERROR] <https://builds.apache.org/job/Accumulo-Trunk-Hadoop-2.0/org.apache.accumulo$accumulo-core/ws/src/main/java/org/apache/accumulo/core/client/admin/SecurityOperationsImpl.java>:[172,64]
cannot find symbol
symbol  : class SecurityToken
location: class org.apache.accumulo.core.client.admin.SecurityOperationsImpl
[ERROR] <https://builds.apache.org/job/Accumulo-Trunk-Hadoop-2.0/org.apache.accumulo$accumulo-core/ws/src/main/java/org/apache/accumulo/core/client/admin/SecurityOperationsImpl.java>:[203,54]
cannot find symbol
symbol  : class SecurityToken
location: class org.apache.accumulo.core.client.admin.SecurityOperationsImpl
[ERROR] <https://builds.apache.org/job/Accumulo-Trunk-Hadoop-2.0/org.apache.accumulo$accumulo-core/ws/src/main/java/org/apache/accumulo/core/util/shell/commands/PasswdCommand.java>:[25,47]
package org.apache.accumulo.core.security.tokens does not exist
[ERROR] <https://builds.apache.org/job/Accumulo-Trunk-Hadoop-2.0/org.apache.accumulo$accumulo-core/ws/src/main/java/org/apache/accumulo/core/security/handler/InsecureAuthenticator.java>:[22,47]
package org.apache.accumulo.core.security.tokens does not exist
[ERROR] <https://builds.apache.org/job/Accumulo-Trunk-Hadoop-2.0/org.apache.accumulo$accumulo-core/ws/src/main/java/org/apache/accumulo/core/security/handler/InsecureAuthenticator.java>:[23,47]
package org.apache.accumulo.core.security.tokens does not exist
[ERROR] <https://builds.apache.org/job/Accumulo-Trunk-Hadoop-2.0/org.apache.accumulo$accumulo-core/ws/src/main/java/org/apache/accumulo/core/security/handler/InsecureAuthenticator.java>:[31,9]
cannot find symbol
symbol  : class SecurityToken
location: class org.apache.accumulo.core.security.handler.InsecureAuthenticator
[ERROR] <https://builds.apache.org/job/Accumulo-Trunk-Hadoop-2.0/org.apache.accumulo$accumulo-core/ws/src/main/java/org/apache/accumulo/core/util/shell/commands/UserCommand.java>:[28,47]
package org.apache.accumulo.core.security.tokens does not exist
[ERROR] <https://builds.apache.org/job/Accumulo-Trunk-Hadoop-2.0/org.apache.accumulo$accumulo-core/ws/src/main/java/org/apache/accumulo/core/util/shell/Shell.java>:[281,59]
cannot find symbol
symbol  : class PasswordToken
location: class org.apache.accumulo.core.util.shell.Shell
[ERROR] <https://builds.apache.org/job/Accumulo-Trunk-Hadoop-2.0/org.apache.accumulo$accumulo-core/ws/src/main/java/org/apache/accumulo/core/client/mock/MockAccumulo.java>:[47,45]
cannot find symbol
symbol  : class PasswordToken
location: class org.apache.accumulo.core.client.mock.MockAccumulo
[ERROR] <https://builds.apache.org/job/Accumulo-Trunk-Hadoop-2.0/org.apache.accumulo$accumulo-core/ws/src/main/java/org/apache/accumulo/core/client/mock/MockInstance.java>:[121,34]
cannot find symbol
symbol  : class PasswordToken
location: class org.apache.accumulo.core.client.mock.MockInstance
[ERROR] <https://builds.apache.org/job/Accumulo-Trunk-Hadoop-2.0/org.apache.accumulo$accumulo-core/ws/src/main/java/org/apache/accumulo/core/cli/ClientOpts.java>:[113,4]
cannot find symbol
symbol  : class PasswordToken
location: class org.apache.accumulo.core.cli.ClientOpts
[ERROR] <https://builds.apache.org/job/Accumulo-Trunk-Hadoop-2.0/org.apache.accumulo$accumulo-core/ws/src/main/java/org/apache/accumulo/core/cli/ClientOpts.java>:[113,27]
cannot find symbol
symbol  : class PasswordToken
location: class org.apache.accumulo.core.cli.ClientOpts
[ERROR] <https://builds.apache.org/job/Accumulo-Trunk-Hadoop-2.0/org.apache.accumulo$accumulo-core/ws/src/main/java/org/apache/accumulo/core/client/ZooKeeperInstance.java>:[237,39]
cannot find symbol
symbol  : class PasswordToken
location: class org.apache.accumulo.core.client.ZooKeeperInstance
[ERROR] <https://builds.apache.org/job/Accumulo-Trunk-Hadoop-2.0/org.apache.accumulo$accumulo-core/ws/src/main/java/org/apache/accumulo/core/security/handler/ZKAuthenticator.java>:[35,17]
cannot find symbol
symbol  : class PasswordToken
location: class org.apache.accumulo.core.security.handler.ZKAuthenticator
[ERROR] <https://builds.apache.org/job/Accumulo-Trunk-Hadoop-2.0/org.apache.accumulo$accumulo-core/ws/src/main/java/org/apache/accumulo/core/client/mapreduce/AccumuloOutputFormat.java>:[552,65]
cannot find symbol
symbol  : class PasswordToken
location: class org.apache.accumulo.core.client.mapreduce.AccumuloOutputFormat
[ERROR] <https://builds.apache.org/job/Accumulo-Trunk-Hadoop-2.0/org.apache.accumulo$accumulo-core/ws/src/main/java/org/apache/accumulo/core/client/mapreduce/InputFormatBase.java>:[1015,64]
cannot find symbol
symbol  : class PasswordToken
location: class org.apache.accumulo.core.client.mapreduce.InputFormatBase<K,V>
[ERROR] <https://builds.apache.org/job/Accumulo-Trunk-Hadoop-2.0/org.apache.accumulo$accumulo-core/ws/src/main/java/org/apache/accumulo/core/security/CredentialHelper.java>:[161,25]
cannot find symbol
symbol  : class SecurityToken
location: class org.apache.accumulo.core.security.CredentialHelper
[ERROR] <https://builds.apache.org/job/Accumulo-Trunk-Hadoop-2.0/org.apache.accumulo$accumulo-core/ws/src/main/java/org/apache/accumulo/core/security/CredentialHelper.java>:[162,8]
cannot find symbol
symbol  : class SecurityToken
location: class org.apache.accumulo.core.security.CredentialHelper
[ERROR] <https://builds.apache.org/job/Accumulo-Trunk-Hadoop-2.0/org.apache.accumulo$accumulo-core/ws/src/main/java/org/apache/accumulo/core/security/CredentialHelper.java>:[162,31]
cannot find symbol
symbol  : class SecurityToken
location: class org.apache.accumulo.core.security.CredentialHelper
mojoFailed org.apache.maven.plugins:maven-compiler-plugin:2.3.2(default-compile)[ERROR] <https://builds.apache.org/job/Accumulo-Trunk-Hadoop-2.0/org.apache.accumulo$accumulo-core/ws/src/main/java/org/apache/accumulo/core/client/mock/MockSecurityOperations.java>:[45,52]
cannot find symbol
symbol  : class PasswordToken
location: class org.apache.accumulo.core.client.mock.MockSecurityOperations
[ERROR] <https://builds.apache.org/job/Accumulo-Trunk-Hadoop-2.0/org.apache.accumulo$accumulo-core/ws/src/main/java/org/apache/accumulo/core/client/mock/MockSecurityOperations.java>:[59,38]
cannot find symbol
symbol  : class PasswordToken
location: class org.apache.accumulo.core.client.mock.MockSecurityOperations
[ERROR] <https://builds.apache.org/job/Accumulo-Trunk-Hadoop-2.0/org.apache.accumulo$accumulo-core/ws/src/main/java/org/apache/accumulo/core/client/mock/MockSecurityOperations.java>:[81,30]
cannot find symbol
symbol  : class PasswordToken
location: class org.apache.accumulo.core.client.mock.MockSecurityOperations
[ERROR] <https://builds.apache.org/job/Accumulo-Trunk-Hadoop-2.0/org.apache.accumulo$accumulo-core/ws/src/main/java/org/apache/accumulo/core/client/admin/SecurityOperationsImpl.java>:[119,15]
createUser(java.lang.String,SecurityToken,org.apache.accumulo.core.security.Authorizations)
in org.apache.accumulo.core.client.admin.SecurityOperationsImpl cannot implement createUser(java.lang.String,byte[],org.apache.accumulo.core.security.Authorizations)
in org.apache.accumulo.core.client.admin.SecurityOperations; attempting to assign weaker access
privileges; was public
[ERROR] <https://builds.apache.org/job/Accumulo-Trunk-Hadoop-2.0/org.apache.accumulo$accumulo-core/ws/src/main/java/org/apache/accumulo/core/client/admin/SecurityOperationsImpl.java>:[99,25]
cannot find symbol
symbol  : class PasswordToken
location: class org.apache.accumulo.core.client.admin.SecurityOperationsImpl
[ERROR] <https://builds.apache.org/job/Accumulo-Trunk-Hadoop-2.0/org.apache.accumulo$accumulo-core/ws/src/main/java/org/apache/accumulo/core/client/admin/SecurityOperationsImpl.java>:[168,43]
cannot find symbol
symbol  : class PasswordToken
location: class org.apache.accumulo.core.client.admin.SecurityOperationsImpl
[ERROR] <https://builds.apache.org/job/Accumulo-Trunk-Hadoop-2.0/org.apache.accumulo$accumulo-core/ws/src/main/java/org/apache/accumulo/core/client/admin/SecurityOperationsImpl.java>:[199,35]
cannot find symbol
symbol  : class PasswordToken
location: class org.apache.accumulo.core.client.admin.SecurityOperationsImpl
[ERROR] <https://builds.apache.org/job/Accumulo-Trunk-Hadoop-2.0/org.apache.accumulo$accumulo-core/ws/src/main/java/org/apache/accumulo/core/util/shell/commands/PasswdCommand.java>:[72,62]
cannot find symbol
symbol  : class PasswordToken
location: class org.apache.accumulo.core.util.shell.commands.PasswdCommand
[ERROR] <https://builds.apache.org/job/Accumulo-Trunk-Hadoop-2.0/org.apache.accumulo$accumulo-core/ws/src/main/java/org/apache/accumulo/core/security/handler/InsecureAuthenticator.java>:[32,15]
cannot find symbol
symbol  : class NullToken
location: class org.apache.accumulo.core.security.handler.InsecureAuthenticator
[ERROR] <https://builds.apache.org/job/Accumulo-Trunk-Hadoop-2.0/org.apache.accumulo$accumulo-core/ws/src/main/java/org/apache/accumulo/core/util/shell/commands/UserCommand.java>:[49,60]
cannot find symbol
symbol  : class PasswordToken
location: class org.apache.accumulo.core.util.shell.commands.UserCommand
[INFO] 82 errors 
[INFO] -------------------------------------------------------------

projectFailed org.apache.accumulo:accumulo-core:1.5.0-SNAPSHOT

Mime
View raw message