accumulo-notifications mailing list archives

Site index · List index
Message view « Date » · « Thread »
Top « Date » · « Thread »
From Apache Jenkins Server <jenk...@builds.apache.org>
Subject Build failed in Jenkins: Accumulo-Trunk #747
Date Wed, 27 Feb 2013 17:19:59 GMT
See <https://builds.apache.org/job/Accumulo-Trunk/747/changes>

Changes:

[ecn] ACCUMULO-1114 store token for root, not serialized bytes

[ecn] ACCUMULO-1121 remove references to top-level src directory

[ecn] ACCUMULO-1118 reverting change that breaks "admin stop"

------------------------------------------
[...truncated 3961 lines...]
Running org.apache.accumulo.core.iterators.system.VisibilityFilterTest
Tests run: 1, Failures: 0, Errors: 0, Skipped: 0, Time elapsed: 0.001 sec
Running org.apache.accumulo.core.iterators.system.SourceSwitchingIteratorTest
Tests run: 5, Failures: 0, Errors: 0, Skipped: 0, Time elapsed: 0.006 sec
Running org.apache.accumulo.core.iterators.system.DeletingIteratorTest
Tests run: 4, Failures: 0, Errors: 0, Skipped: 0, Time elapsed: 0.004 sec
Running org.apache.accumulo.core.iterators.system.ColumnFilterTest
Tests run: 3, Failures: 0, Errors: 0, Skipped: 0, Time elapsed: 0.001 sec
Running org.apache.accumulo.core.iterators.system.ColumnFamilySkippingIteratorTest
Tests run: 3, Failures: 0, Errors: 0, Skipped: 0, Time elapsed: 5.949 sec
Running org.apache.accumulo.core.iterators.system.MultiIteratorTest
Tests run: 7, Failures: 0, Errors: 0, Skipped: 0, Time elapsed: 0.587 sec
Running org.apache.accumulo.core.iterators.system.TimeSettingIteratorTest
Tests run: 1, Failures: 0, Errors: 0, Skipped: 0, Time elapsed: 0.002 sec
Running org.apache.accumulo.core.iterators.FirstEntryInRowTest
Tests run: 2, Failures: 0, Errors: 0, Skipped: 0, Time elapsed: 0.043 sec
Running org.apache.accumulo.core.iterators.aggregation.NumSummationTest
Tests run: 5, Failures: 0, Errors: 0, Skipped: 0, Time elapsed: 0.004 sec
Running org.apache.accumulo.core.iterators.aggregation.conf.AggregatorConfigurationTest
Tests run: 2, Failures: 0, Errors: 0, Skipped: 0, Time elapsed: 0.008 sec
Running org.apache.accumulo.core.iterators.user.VisibilityFilterTest
13/02/27 17:18:07 ERROR system.VisibilityFilter: Parse Error
org.apache.accumulo.core.util.BadArgumentException: empty term near index 0
&
^
	at org.apache.accumulo.core.security.ColumnVisibility$ColumnVisibilityParser.processTerm(ColumnVisibility.java:240)
	at org.apache.accumulo.core.security.ColumnVisibility$ColumnVisibilityParser.parse_(ColumnVisibility.java:253)
	at org.apache.accumulo.core.security.ColumnVisibility$ColumnVisibilityParser.parse(ColumnVisibility.java:221)
	at org.apache.accumulo.core.security.ColumnVisibility.validate(ColumnVisibility.java:354)
	at org.apache.accumulo.core.security.ColumnVisibility.<init>(ColumnVisibility.java:430)
	at org.apache.accumulo.core.security.ColumnVisibility.<init>(ColumnVisibility.java:388)
	at org.apache.accumulo.core.iterators.system.VisibilityFilter.accept(VisibilityFilter.java:71)
	at org.apache.accumulo.core.iterators.user.VisibilityFilter.accept(VisibilityFilter.java:85)
	at org.apache.accumulo.core.iterators.Filter.findTop(Filter.java:72)
	at org.apache.accumulo.core.iterators.Filter.seek(Filter.java:65)
	at org.apache.accumulo.core.iterators.user.VisibilityFilterTest.verify(VisibilityFilterTest.java:85)
	at org.apache.accumulo.core.iterators.user.VisibilityFilterTest.testFilterUnauthorizedAndBad(VisibilityFilterTest.java:187)
	at sun.reflect.NativeMethodAccessorImpl.invoke0(Native Method)
	at sun.reflect.NativeMethodAccessorImpl.invoke(NativeMethodAccessorImpl.java:39)
	at sun.reflect.DelegatingMethodAccessorImpl.invoke(DelegatingMethodAccessorImpl.java:25)
	at java.lang.reflect.Method.invoke(Method.java:597)
	at org.junit.runners.model.FrameworkMethod$1.runReflectiveCall(FrameworkMethod.java:47)
	at org.junit.internal.runners.model.ReflectiveCallable.run(ReflectiveCallable.java:12)
	at org.junit.runners.model.FrameworkMethod.invokeExplosively(FrameworkMethod.java:44)
	at org.junit.internal.runners.statements.InvokeMethod.evaluate(InvokeMethod.java:17)
	at org.junit.runners.ParentRunner.runLeaf(ParentRunner.java:271)
	at org.junit.runners.BlockJUnit4ClassRunner.runChild(BlockJUnit4ClassRunner.java:70)
	at org.junit.runners.BlockJUnit4ClassRunner.runChild(BlockJUnit4ClassRunner.java:50)
	at org.junit.runners.ParentRunner$3.run(ParentRunner.java:238)
	at org.junit.runners.ParentRunner$1.schedule(ParentRunner.java:63)
	at org.junit.runners.ParentRunner.runChildren(ParentRunner.java:236)
	at org.junit.runners.ParentRunner.access$000(ParentRunner.java:53)
	at org.junit.runners.ParentRunner$2.evaluate(ParentRunner.java:229)
	at org.junit.runners.ParentRunner.run(ParentRunner.java:309)
	at org.apache.maven.surefire.junit4.JUnit4Provider.execute(JUnit4Provider.java:236)
	at org.apache.maven.surefire.junit4.JUnit4Provider.executeTestSet(JUnit4Provider.java:134)
	at org.apache.maven.surefire.junit4.JUnit4Provider.invoke(JUnit4Provider.java:113)
	at sun.reflect.NativeMethodAccessorImpl.invoke0(Native Method)
	at sun.reflect.NativeMethodAccessorImpl.invoke(NativeMethodAccessorImpl.java:39)
	at sun.reflect.DelegatingMethodAccessorImpl.invoke(DelegatingMethodAccessorImpl.java:25)
	at java.lang.reflect.Method.invoke(Method.java:597)
	at org.apache.maven.surefire.util.ReflectionUtils.invokeMethodWithArray(ReflectionUtils.java:189)
	at org.apache.maven.surefire.booter.ProviderFactory$ProviderProxy.invoke(ProviderFactory.java:165)
	at org.apache.maven.surefire.booter.ProviderFactory.invokeProvider(ProviderFactory.java:85)
	at org.apache.maven.surefire.booter.ForkedBooter.runSuitesInProcess(ForkedBooter.java:103)
	at org.apache.maven.surefire.booter.ForkedBooter.main(ForkedBooter.java:74)
Tests run: 9, Failures: 0, Errors: 0, Skipped: 0, Time elapsed: 0.335 sec
Running org.apache.accumulo.core.iterators.user.GrepIteratorTest
Tests run: 1, Failures: 0, Errors: 0, Skipped: 0, Time elapsed: 0.004 sec
Running org.apache.accumulo.core.iterators.user.LargeRowFilterTest
Tests run: 5, Failures: 0, Errors: 0, Skipped: 0, Time elapsed: 0.285 sec
Running org.apache.accumulo.core.iterators.user.FilterTest
Tests run: 11, Failures: 0, Errors: 0, Skipped: 0, Time elapsed: 0.302 sec
Running org.apache.accumulo.core.iterators.user.TransformingIteratorTest
13/02/27 17:18:08 ERROR user.TransformingIteratorTest$IllegalVisKeyTransformingIterator: Parse
error after transformation : A&|||
13/02/27 17:18:08 ERROR user.TransformingIteratorTest$IllegalVisKeyTransformingIterator: Parse
error after transformation : A&|||
13/02/27 17:18:08 ERROR user.TransformingIteratorTest$IllegalVisCompactionKeyTransformingIterator:
Parse error after transformation : A&|||
Tests run: 16, Failures: 0, Errors: 0, Skipped: 0, Time elapsed: 0.333 sec
Running org.apache.accumulo.core.iterators.user.CombinerTest
Tests run: 14, Failures: 0, Errors: 0, Skipped: 0, Time elapsed: 0.02 sec
Running org.apache.accumulo.core.iterators.user.RegExFilterTest
Tests run: 1, Failures: 0, Errors: 0, Skipped: 0, Time elapsed: 0.004 sec
Running org.apache.accumulo.core.iterators.user.IndexedDocIteratorTest
Tests run: 5, Failures: 0, Errors: 0, Skipped: 0, Time elapsed: 4.131 sec
Running org.apache.accumulo.core.iterators.user.RowDeletingIteratorTest
Tests run: 4, Failures: 0, Errors: 0, Skipped: 0, Time elapsed: 0.006 sec
Running org.apache.accumulo.core.iterators.user.WholeRowIteratorTest
Tests run: 3, Failures: 0, Errors: 0, Skipped: 0, Time elapsed: 0.004 sec
Running org.apache.accumulo.core.iterators.user.IntersectingIteratorTest
Tests run: 6, Failures: 0, Errors: 0, Skipped: 0, Time elapsed: 8.008 sec
Running org.apache.accumulo.core.iterators.user.RowFilterTest
Tests run: 1, Failures: 0, Errors: 0, Skipped: 0, Time elapsed: 0.047 sec
Running org.apache.accumulo.core.iterators.user.VersioningIteratorTest
Tests run: 6, Failures: 0, Errors: 0, Skipped: 0, Time elapsed: 0.032 sec
Running org.apache.accumulo.core.iterators.AggregatingIteratorTest
Tests run: 7, Failures: 0, Errors: 0, Skipped: 0, Time elapsed: 0.008 sec
Running org.apache.accumulo.core.iterators.IterUtilTest
Tests run: 5, Failures: 0, Errors: 0, Skipped: 0, Time elapsed: 0.01 sec
Running org.apache.accumulo.core.iterators.FirstEntryInRowIteratorTest
Tests run: 1, Failures: 0, Errors: 0, Skipped: 0, Time elapsed: 0 sec
Running org.apache.accumulo.core.conf.PropertyTest
Tests run: 3, Failures: 0, Errors: 0, Skipped: 0, Time elapsed: 0.001 sec
Running org.apache.accumulo.core.file.blockfile.cache.TestCachedBlockQueue
Tests run: 2, Failures: 0, Errors: 0, Skipped: 0, Time elapsed: 0 sec
Running org.apache.accumulo.core.file.blockfile.cache.TestLruBlockCache
Tests run: 7, Failures: 0, Errors: 0, Skipped: 0, Time elapsed: 1.029 sec
Running org.apache.accumulo.core.file.rfile.RFileTest
Tests run: 21, Failures: 0, Errors: 0, Skipped: 0, Time elapsed: 16.48 sec
Running org.apache.accumulo.core.file.rfile.RelativeKeyTest
Tests run: 6, Failures: 0, Errors: 0, Skipped: 0, Time elapsed: 0.162 sec
Running org.apache.accumulo.core.file.rfile.BlockIndexTest
Tests run: 2, Failures: 0, Errors: 0, Skipped: 0, Time elapsed: 0.297 sec
Running org.apache.accumulo.core.file.rfile.MultiLevelIndexTest
Tests run: 1, Failures: 0, Errors: 0, Skipped: 0, Time elapsed: 1.622 sec
Flushing results...
Flushing results done
Cobertura: Loaded information on 1936 classes.
Cobertura: Saved information on 1936 classes.

Results :

Tests run: 365, Failures: 0, Errors: 0, Skipped: 0

[INFO] ------------------------------------------------------------------------
[INFO] Reactor Summary:
[INFO] 
[INFO] Apache Accumulo ................................... SUCCESS [33.507s]
[INFO] Trace ............................................. SUCCESS [26.771s]
[INFO] Start ............................................. SUCCESS [1:03.075s]
[INFO] Fate .............................................. SUCCESS [10.851s]
[INFO] Core .............................................. FAILURE [3:14.616s]
[INFO] Server ............................................ SKIPPED
[INFO] Examples .......................................... SKIPPED
[INFO] Simple Examples ................................... SKIPPED
[INFO] Testing ........................................... SKIPPED
[INFO] Instamo Example ................................... SKIPPED
[INFO] Proxy ............................................. SKIPPED
[INFO] Assemble .......................................... SKIPPED
[INFO] ------------------------------------------------------------------------
[INFO] BUILD FAILURE
[INFO] ------------------------------------------------------------------------
[INFO] Total time: 5:35.287s
[INFO] Finished at: Wed Feb 27 17:18:43 UTC 2013
[INFO] Final Memory: 60M/204M
[INFO] ------------------------------------------------------------------------
[JENKINS] Archiving <https://builds.apache.org/job/Accumulo-Trunk/ws/accumulo-trunk/assemble/pom.xml>
to /home/hudson/hudson/jobs/Accumulo-Trunk/modules/org.apache.accumulo$accumulo-assemble/builds/2013-02-27_17-12-50/archive/org.apache.accumulo/accumulo-assemble/1.6.0-SNAPSHOT/accumulo-assemble-1.6.0-SNAPSHOT.pom
[JENKINS] Archiving <https://builds.apache.org/job/Accumulo-Trunk/ws/accumulo-trunk/server/pom.xml>
to /home/hudson/hudson/jobs/Accumulo-Trunk/modules/org.apache.accumulo$accumulo-server/builds/2013-02-27_17-12-49/archive/org.apache.accumulo/accumulo-server/1.6.0-SNAPSHOT/accumulo-server-1.6.0-SNAPSHOT.pom
[JENKINS] Archiving <https://builds.apache.org/job/Accumulo-Trunk/ws/accumulo-trunk/examples/simple/pom.xml>
to /home/hudson/hudson/jobs/Accumulo-Trunk/modules/org.apache.accumulo$accumulo-examples-simple/builds/2013-02-27_17-12-50/archive/org.apache.accumulo/accumulo-examples-simple/1.6.0-SNAPSHOT/accumulo-examples-simple-1.6.0-SNAPSHOT.pom
[JENKINS] Archiving <https://builds.apache.org/job/Accumulo-Trunk/ws/accumulo-trunk/proxy/pom.xml>
to /home/hudson/hudson/jobs/Accumulo-Trunk/modules/org.apache.accumulo$accumulo-proxy/builds/2013-02-27_17-12-50/archive/org.apache.accumulo/accumulo-proxy/1.6.0-SNAPSHOT/accumulo-proxy-1.6.0-SNAPSHOT.pom
[JENKINS] Archiving <https://builds.apache.org/job/Accumulo-Trunk/ws/accumulo-trunk/examples/pom.xml>
to /home/hudson/hudson/jobs/Accumulo-Trunk/modules/org.apache.accumulo$accumulo-examples/builds/2013-02-27_17-12-50/archive/org.apache.accumulo/accumulo-examples/1.6.0-SNAPSHOT/accumulo-examples-1.6.0-SNAPSHOT.pom
[JENKINS] Archiving <https://builds.apache.org/job/Accumulo-Trunk/ws/accumulo-trunk/pom.xml>
to /home/hudson/hudson/jobs/Accumulo-Trunk/modules/org.apache.accumulo$accumulo/builds/2013-02-27_17-12-49/archive/org.apache.accumulo/accumulo/1.6.0-SNAPSHOT/accumulo-1.6.0-SNAPSHOT.pom
[JENKINS] Archiving <https://builds.apache.org/job/Accumulo-Trunk/ws/accumulo-trunk/target/accumulo-1.6.0-SNAPSHOT-site.xml>
to /home/hudson/hudson/jobs/Accumulo-Trunk/modules/org.apache.accumulo$accumulo/builds/2013-02-27_17-12-49/archive/org.apache.accumulo/accumulo/1.6.0-SNAPSHOT/accumulo-1.6.0-SNAPSHOT-site.xml
[JENKINS] Archiving <https://builds.apache.org/job/Accumulo-Trunk/ws/accumulo-trunk/test/pom.xml>
to /home/hudson/hudson/jobs/Accumulo-Trunk/modules/org.apache.accumulo$accumulo-test/builds/2013-02-27_17-12-50/archive/org.apache.accumulo/accumulo-test/1.6.0-SNAPSHOT/accumulo-test-1.6.0-SNAPSHOT.pom
[JENKINS] Archiving <https://builds.apache.org/job/Accumulo-Trunk/ws/accumulo-trunk/start/pom.xml>
to /home/hudson/hudson/jobs/Accumulo-Trunk/modules/org.apache.accumulo$accumulo-start/builds/2013-02-27_17-12-50/archive/org.apache.accumulo/accumulo-start/1.6.0-SNAPSHOT/accumulo-start-1.6.0-SNAPSHOT.pom
[JENKINS] Archiving <https://builds.apache.org/job/Accumulo-Trunk/ws/accumulo-trunk/lib/accumulo-start-1.6.0-SNAPSHOT.jar>
to /home/hudson/hudson/jobs/Accumulo-Trunk/modules/org.apache.accumulo$accumulo-start/builds/2013-02-27_17-12-50/archive/org.apache.accumulo/accumulo-start/1.6.0-SNAPSHOT/accumulo-start-1.6.0-SNAPSHOT.jar
[JENKINS] Archiving <https://builds.apache.org/job/Accumulo-Trunk/ws/accumulo-trunk/lib/accumulo-start-1.6.0-SNAPSHOT-sources.jar>
to /home/hudson/hudson/jobs/Accumulo-Trunk/modules/org.apache.accumulo$accumulo-start/builds/2013-02-27_17-12-50/archive/org.apache.accumulo/accumulo-start/1.6.0-SNAPSHOT/accumulo-start-1.6.0-SNAPSHOT-sources.jar
[JENKINS] Archiving <https://builds.apache.org/job/Accumulo-Trunk/ws/accumulo-trunk/lib/accumulo-start-1.6.0-SNAPSHOT-test-sources.jar>
to /home/hudson/hudson/jobs/Accumulo-Trunk/modules/org.apache.accumulo$accumulo-start/builds/2013-02-27_17-12-50/archive/org.apache.accumulo/accumulo-start/1.6.0-SNAPSHOT/accumulo-start-1.6.0-SNAPSHOT-test-sources.jar
[JENKINS] Archiving <https://builds.apache.org/job/Accumulo-Trunk/ws/accumulo-trunk/fate/pom.xml>
to /home/hudson/hudson/jobs/Accumulo-Trunk/modules/org.apache.accumulo$accumulo-fate/builds/2013-02-27_17-12-49/archive/org.apache.accumulo/accumulo-fate/1.6.0-SNAPSHOT/accumulo-fate-1.6.0-SNAPSHOT.pom
[JENKINS] Archiving <https://builds.apache.org/job/Accumulo-Trunk/ws/accumulo-trunk/lib/accumulo-fate-1.6.0-SNAPSHOT.jar>
to /home/hudson/hudson/jobs/Accumulo-Trunk/modules/org.apache.accumulo$accumulo-fate/builds/2013-02-27_17-12-49/archive/org.apache.accumulo/accumulo-fate/1.6.0-SNAPSHOT/accumulo-fate-1.6.0-SNAPSHOT.jar
[JENKINS] Archiving <https://builds.apache.org/job/Accumulo-Trunk/ws/accumulo-trunk/lib/accumulo-fate-1.6.0-SNAPSHOT-sources.jar>
to /home/hudson/hudson/jobs/Accumulo-Trunk/modules/org.apache.accumulo$accumulo-fate/builds/2013-02-27_17-12-49/archive/org.apache.accumulo/accumulo-fate/1.6.0-SNAPSHOT/accumulo-fate-1.6.0-SNAPSHOT-sources.jar
[JENKINS] Archiving <https://builds.apache.org/job/Accumulo-Trunk/ws/accumulo-trunk/lib/accumulo-fate-1.6.0-SNAPSHOT-test-sources.jar>
to /home/hudson/hudson/jobs/Accumulo-Trunk/modules/org.apache.accumulo$accumulo-fate/builds/2013-02-27_17-12-49/archive/org.apache.accumulo/accumulo-fate/1.6.0-SNAPSHOT/accumulo-fate-1.6.0-SNAPSHOT-test-sources.jar
[JENKINS] Archiving <https://builds.apache.org/job/Accumulo-Trunk/ws/accumulo-trunk/core/pom.xml>
to /home/hudson/hudson/jobs/Accumulo-Trunk/modules/org.apache.accumulo$accumulo-core/builds/2013-02-27_17-12-49/archive/org.apache.accumulo/accumulo-core/1.6.0-SNAPSHOT/accumulo-core-1.6.0-SNAPSHOT.pom
[JENKINS] Archiving <https://builds.apache.org/job/Accumulo-Trunk/ws/accumulo-trunk/lib/accumulo-core-1.6.0-SNAPSHOT.jar>
to /home/hudson/hudson/jobs/Accumulo-Trunk/modules/org.apache.accumulo$accumulo-core/builds/2013-02-27_17-12-49/archive/org.apache.accumulo/accumulo-core/1.6.0-SNAPSHOT/accumulo-core-1.6.0-SNAPSHOT.jar
[JENKINS] Archiving <https://builds.apache.org/job/Accumulo-Trunk/ws/accumulo-trunk/lib/accumulo-core-1.6.0-SNAPSHOT-sources.jar>
to /home/hudson/hudson/jobs/Accumulo-Trunk/modules/org.apache.accumulo$accumulo-core/builds/2013-02-27_17-12-49/archive/org.apache.accumulo/accumulo-core/1.6.0-SNAPSHOT/accumulo-core-1.6.0-SNAPSHOT-sources.jar
[JENKINS] Archiving <https://builds.apache.org/job/Accumulo-Trunk/ws/accumulo-trunk/lib/accumulo-core-1.6.0-SNAPSHOT-test-sources.jar>
to /home/hudson/hudson/jobs/Accumulo-Trunk/modules/org.apache.accumulo$accumulo-core/builds/2013-02-27_17-12-49/archive/org.apache.accumulo/accumulo-core/1.6.0-SNAPSHOT/accumulo-core-1.6.0-SNAPSHOT-test-sources.jar
[JENKINS] Archiving <https://builds.apache.org/job/Accumulo-Trunk/ws/accumulo-trunk/trace/pom.xml>
to /home/hudson/hudson/jobs/Accumulo-Trunk/modules/org.apache.accumulo$accumulo-trace/builds/2013-02-27_17-12-49/archive/org.apache.accumulo/accumulo-trace/1.6.0-SNAPSHOT/accumulo-trace-1.6.0-SNAPSHOT.pom
[JENKINS] Archiving <https://builds.apache.org/job/Accumulo-Trunk/ws/accumulo-trunk/lib/accumulo-trace-1.6.0-SNAPSHOT.jar>
to /home/hudson/hudson/jobs/Accumulo-Trunk/modules/org.apache.accumulo$accumulo-trace/builds/2013-02-27_17-12-49/archive/org.apache.accumulo/accumulo-trace/1.6.0-SNAPSHOT/accumulo-trace-1.6.0-SNAPSHOT.jar
[JENKINS] Archiving <https://builds.apache.org/job/Accumulo-Trunk/ws/accumulo-trunk/lib/accumulo-trace-1.6.0-SNAPSHOT-sources.jar>
to /home/hudson/hudson/jobs/Accumulo-Trunk/modules/org.apache.accumulo$accumulo-trace/builds/2013-02-27_17-12-49/archive/org.apache.accumulo/accumulo-trace/1.6.0-SNAPSHOT/accumulo-trace-1.6.0-SNAPSHOT-sources.jar
[JENKINS] Archiving <https://builds.apache.org/job/Accumulo-Trunk/ws/accumulo-trunk/lib/accumulo-trace-1.6.0-SNAPSHOT-test-sources.jar>
to /home/hudson/hudson/jobs/Accumulo-Trunk/modules/org.apache.accumulo$accumulo-trace/builds/2013-02-27_17-12-49/archive/org.apache.accumulo/accumulo-trace/1.6.0-SNAPSHOT/accumulo-trace-1.6.0-SNAPSHOT-test-sources.jar
[JENKINS] Archiving <https://builds.apache.org/job/Accumulo-Trunk/ws/accumulo-trunk/examples/instamo/pom.xml>
to /home/hudson/hudson/jobs/Accumulo-Trunk/modules/org.apache.accumulo$accumulo-examples-instamo/builds/2013-02-27_17-12-50/archive/org.apache.accumulo/accumulo-examples-instamo/1.6.0-SNAPSHOT/accumulo-examples-instamo-1.6.0-SNAPSHOT.pom
Waiting for Jenkins to finish collecting data
mavenExecutionResult exceptions not empty
message : Internal error: java.lang.reflect.UndeclaredThrowableException
cause : null
Stack trace : 
org.apache.maven.InternalErrorException: Internal error: java.lang.reflect.UndeclaredThrowableException
	at org.apache.maven.lifecycle.internal.BuilderCommon.handleBuildError(BuilderCommon.java:128)
	at org.apache.maven.lifecycle.internal.LifecycleModuleBuilder.buildProject(LifecycleModuleBuilder.java:95)
	at org.apache.maven.lifecycle.internal.LifecycleModuleBuilder.buildProject(LifecycleModuleBuilder.java:59)
	at org.apache.maven.lifecycle.internal.LifecycleStarter.singleThreadedBuild(LifecycleStarter.java:183)
	at org.apache.maven.lifecycle.internal.LifecycleStarter.execute(LifecycleStarter.java:161)
	at org.apache.maven.DefaultMaven.doExecute(DefaultMaven.java:320)
	at org.apache.maven.DefaultMaven.execute(DefaultMaven.java:156)
	at org.jvnet.hudson.maven3.launcher.Maven3Launcher.main(Maven3Launcher.java:79)
	at sun.reflect.NativeMethodAccessorImpl.invoke0(Native Method)
	at sun.reflect.NativeMethodAccessorImpl.invoke(NativeMethodAccessorImpl.java:39)
	at sun.reflect.DelegatingMethodAccessorImpl.invoke(DelegatingMethodAccessorImpl.java:25)
	at java.lang.reflect.Method.invoke(Method.java:597)
	at org.codehaus.plexus.classworlds.launcher.Launcher.launchStandard(Launcher.java:329)
	at org.codehaus.plexus.classworlds.launcher.Launcher.launch(Launcher.java:239)
	at org.jvnet.hudson.maven3.agent.Maven3Main.launch(Maven3Main.java:158)
	at hudson.maven.Maven3Builder.call(Maven3Builder.java:100)
	at hudson.maven.Maven3Builder.call(Maven3Builder.java:66)
	at hudson.remoting.UserRequest.perform(UserRequest.java:118)
	at hudson.remoting.UserRequest.perform(UserRequest.java:48)
	at hudson.remoting.Request$2.run(Request.java:326)
	at hudson.remoting.InterceptingExecutorService$1.call(InterceptingExecutorService.java:72)
	at java.util.concurrent.FutureTask$Sync.innerRun(FutureTask.java:303)
	at java.util.concurrent.FutureTask.run(FutureTask.java:138)
	at java.util.concurrent.ThreadPoolExecutor$Worker.runTask(ThreadPoolExecutor.java:886)
	at java.util.concurrent.ThreadPoolExecutor$Worker.run(ThreadPoolExecutor.java:908)
	at java.lang.Thread.run(Thread.java:662)
Caused by: java.lang.reflect.UndeclaredThrowableException
	at $Proxy2.setExecutedMojos(Unknown Source)
	at hudson.maven.MavenBuildProxy$Filter.setExecutedMojos(MavenBuildProxy.java:243)
	at hudson.maven.Maven3Builder$MavenExecutionListener.recordMojoEnded(Maven3Builder.java:439)
	at hudson.maven.Maven3Builder$MavenExecutionListener.mojoSucceeded(Maven3Builder.java:425)
	at org.apache.maven.lifecycle.internal.DefaultExecutionEventCatapult.fire(DefaultExecutionEventCatapult.java:87)
	at org.apache.maven.lifecycle.internal.DefaultExecutionEventCatapult.fire(DefaultExecutionEventCatapult.java:42)
	at org.apache.maven.lifecycle.internal.MojoExecutor.execute(MojoExecutor.java:228)
	at org.apache.maven.lifecycle.internal.MojoExecutor.execute(MojoExecutor.java:153)
	at org.apache.maven.lifecycle.internal.MojoExecutor.execute(MojoExecutor.java:145)
	at org.apache.maven.lifecycle.internal.MojoExecutor.executeForkedExecutions(MojoExecutor.java:365)
	at org.apache.maven.lifecycle.internal.MojoExecutor.execute(MojoExecutor.java:199)
	at org.apache.maven.lifecycle.internal.MojoExecutor.execute(MojoExecutor.java:153)
	at org.apache.maven.lifecycle.internal.MojoExecutor.execute(MojoExecutor.java:145)
	at org.apache.maven.lifecycle.internal.LifecycleModuleBuilder.buildProject(LifecycleModuleBuilder.java:84)
	... 24 more
Caused by: java.io.UTFDataFormatException
	at java.io.ObjectInputStream$BlockDataInputStream.readUTFSpan(ObjectInputStream.java:3105)
	at java.io.ObjectInputStream$BlockDataInputStream.readUTFBody(ObjectInputStream.java:3030)
	at java.io.ObjectInputStream$BlockDataInputStream.readUTF(ObjectInputStream.java:2843)
	at java.io.ObjectInputStream.readUTF(ObjectInputStream.java:1069)
	at java.io.ObjectStreamClass.readNonProxy(ObjectStreamClass.java:658)
	at java.io.ObjectInputStream.readClassDescriptor(ObjectInputStream.java:827)
	at java.io.ObjectInputStream.readNonProxyDesc(ObjectInputStream.java:1583)
	at java.io.ObjectInputStream.readClassDesc(ObjectInputStream.java:1514)
	at java.io.ObjectInputStream.readArray(ObjectInputStream.java:1642)
	at java.io.ObjectInputStream.readObject0(ObjectInputStream.java:1341)
	at java.io.ObjectInputStream.defaultReadFields(ObjectInputStream.java:1970)
	at java.io.ObjectInputStream.readSerialData(ObjectInputStream.java:1894)
	at java.io.ObjectInputStream.readOrdinaryObject(ObjectInputStream.java:1777)
	at java.io.ObjectInputStream.readObject0(ObjectInputStream.java:1347)
	at java.io.ObjectInputStream.readObject(ObjectInputStream.java:369)
	at hudson.remoting.UserRequest.deserialize(UserRequest.java:182)
	at hudson.remoting.UserRequest.perform(UserRequest.java:98)
	at hudson.remoting.UserRequest.perform(UserRequest.java:48)
	at hudson.remoting.Request$2.run(Request.java:326)
	at hudson.remoting.InterceptingExecutorService$1.call(InterceptingExecutorService.java:72)
	at java.util.concurrent.FutureTask$Sync.innerRun(FutureTask.java:334)
	at java.util.concurrent.FutureTask.run(FutureTask.java:166)
	at java.util.concurrent.ThreadPoolExecutor.runWorker(ThreadPoolExecutor.java:1145)
	at java.util.concurrent.ThreadPoolExecutor$Worker.run(ThreadPoolExecutor.java:615)
	at java.lang.Thread.run(Thread.java:722)
Sending e-mails to: notifications@accumulo.apache.org
channel stopped
Updating ACCUMULO-1121
Updating ACCUMULO-1114
Updating ACCUMULO-1118

Mime
View raw message