accumulo-notifications mailing list archives

Site index · List index
Message view « Date » · « Thread »
Top « Date » · « Thread »
From Apache Jenkins Server <jenk...@builds.apache.org>
Subject Build failed in Jenkins: Accumulo-Trunk-Hadoop-2.0 #76
Date Sat, 09 Feb 2013 00:01:32 GMT
See <https://builds.apache.org/job/Accumulo-Trunk-Hadoop-2.0/76/changes>

Changes:

[kturner] ACCUMULO-1049 modified master to stop locking tserver nodes and just monitor  tserver
nodes in zookeeper

[ctubbsii] ACCUMULO-1001 Fix typo on setAuthorizations method name.

------------------------------------------
[...truncated 2425 lines...]
Report time: 1290ms

[INFO] Cobertura Report generation was successful.
mojoSucceeded org.codehaus.mojo:cobertura-maven-plugin:2.5.2(default-cli)[INFO] Cobertura
1.9.4.1 - GNU GPL License (NO WARRANTY) - See COPYRIGHT file
Cobertura: Loaded information on 79 classes.
Report time: 1277ms

[INFO] Cobertura Report generation was successful.

projectSucceeded org.apache.accumulo:accumulo-trace:1.5.0-SNAPSHOT
projectStarted org.apache.accumulo:accumulo-start:1.5.0-SNAPSHOT
[INFO]                                                                         
[INFO] ------------------------------------------------------------------------
[INFO] Building Start 1.5.0-SNAPSHOT
[INFO] ------------------------------------------------------------------------
Downloading: https://repository.apache.org/content/repositories/snapshots/org/mortbay/jetty/jetty/maven-metadata.xml
Downloading: http://repo.maven.apache.org/maven2/org/mortbay/jetty/jetty/maven-metadata.xml
Downloading: http://repository.jboss.org/nexus/content/groups/public/org/mortbay/jetty/jetty/maven-metadata.xml
Downloading: http://repository.apache.org/snapshots/org/mortbay/jetty/jetty/maven-metadata.xml
Downloaded: http://repo.maven.apache.org/maven2/org/mortbay/jetty/jetty/maven-metadata.xml
(688 B at 1.4 KB/sec)
Downloaded: http://repository.jboss.org/nexus/content/groups/public/org/mortbay/jetty/jetty/maven-metadata.xml
(348 B at 0.6 KB/sec)
mojoStarted org.apache.maven.plugins:maven-clean-plugin:2.5(default-clean)[INFO] Deleting
<https://builds.apache.org/job/Accumulo-Trunk-Hadoop-2.0/ws/accumulo-trunk/start> (includes
= [**/*.pyc], excludes = [])

[INFO] 
[INFO] --- maven-clean-plugin:2.5:clean (default-clean) @ accumulo-start ---
mojoSucceeded org.apache.maven.plugins:maven-clean-plugin:2.5(default-clean)
[INFO] Checking for local modifications: skipped.
mojoStarted org.codehaus.mojo:buildnumber-maven-plugin:1.1(default)[INFO] Updating project
files from SCM: skipped.
[INFO] Executing: /bin/sh -c cd <https://builds.apache.org/job/Accumulo-Trunk-Hadoop-2.0/ws/accumulo-trunk/start>
&& svn --non-interactive info
[INFO] Working directory: <https://builds.apache.org/job/Accumulo-Trunk-Hadoop-2.0/ws/accumulo-trunk/start>
[INFO] Storing buildNumber: 1444290 at timestamp: 1360368031888
[INFO] Executing: /bin/sh -c cd <https://builds.apache.org/job/Accumulo-Trunk-Hadoop-2.0/ws/accumulo-trunk/start>
&& svn --non-interactive info
[INFO] Working directory: <https://builds.apache.org/job/Accumulo-Trunk-Hadoop-2.0/ws/accumulo-trunk/start>
[INFO] Storing buildScmBranch: trunk

[INFO] 
[INFO] --- buildnumber-maven-plugin:1.1:create (default) @ accumulo-start ---
mojoSucceeded org.codehaus.mojo:buildnumber-maven-plugin:1.1(default)
mojoStarted org.apache.maven.plugins:maven-enforcer-plugin:1.0.1(enforce-mvn)
[INFO] 
[INFO] --- maven-enforcer-plugin:1.0.1:enforce (enforce-mvn) @ accumulo-start ---
mojoSucceeded org.apache.maven.plugins:maven-enforcer-plugin:1.0.1(enforce-mvn)
mojoStarted org.apache.maven.plugins:maven-remote-resources-plugin:1.3(default)
[INFO] 
[INFO] --- maven-remote-resources-plugin:1.3:process (default) @ accumulo-start ---
mojoSucceeded org.apache.maven.plugins:maven-remote-resources-plugin:1.3(default)
[debug] execute contextualize
[INFO] Using 'UTF-8' encoding to copy filtered resources.
mojoStarted org.apache.maven.plugins:maven-resources-plugin:2.5(default-resources)[INFO] skip
non existing resourceDirectory <https://builds.apache.org/job/Accumulo-Trunk-Hadoop-2.0/ws/accumulo-trunk/start/src/main/resources>
[INFO] Copying 3 resources

[INFO] 
[INFO] --- maven-resources-plugin:2.5:resources (default-resources) @ accumulo-start ---
mojoSucceeded org.apache.maven.plugins:maven-resources-plugin:2.5(default-resources)
[INFO] Copying commons-io-1.4.jar to <https://builds.apache.org/job/Accumulo-Trunk-Hadoop-2.0/ws/accumulo-trunk/lib/commons-io-1.4.jar>
[INFO] Copying commons-logging-1.0.4.jar to <https://builds.apache.org/job/Accumulo-Trunk-Hadoop-2.0/ws/accumulo-trunk/lib/commons-logging-1.0.4.jar>
[INFO] Copying commons-vfs2-2.0.jar to <https://builds.apache.org/job/Accumulo-Trunk-Hadoop-2.0/ws/accumulo-trunk/lib/commons-vfs2-2.0.jar>
mojoStarted org.apache.maven.plugins:maven-dependency-plugin:2.3(copy-dependencies)[INFO]
log4j-1.2.16.jar already exists in destination.

[INFO] 
[INFO] --- maven-dependency-plugin:2.3:copy-dependencies (copy-dependencies) @ accumulo-start
---
mojoSucceeded org.apache.maven.plugins:maven-dependency-plugin:2.3(copy-dependencies)
mojoStarted org.apache.maven.plugins:maven-compiler-plugin:2.3.2(default-compile)[INFO] Compiling
16 source files to <https://builds.apache.org/job/Accumulo-Trunk-Hadoop-2.0/ws/accumulo-trunk/start/target/classes>

[INFO] 
[INFO] --- maven-compiler-plugin:2.3.2:compile (default-compile) @ accumulo-start ---
mojoSucceeded org.apache.maven.plugins:maven-compiler-plugin:2.3.2(default-compile)
mojoStarted org.apache.maven.plugins:maven-resources-plugin:2.5(default-testResources)[debug]
execute contextualize
[INFO] Using 'UTF-8' encoding to copy filtered resources.
[INFO] Copying 4 resources
[INFO] Copying 3 resources

[INFO] 
[INFO] --- maven-resources-plugin:2.5:testResources (default-testResources) @ accumulo-start
---
mojoSucceeded org.apache.maven.plugins:maven-resources-plugin:2.5(default-testResources)
mojoStarted org.apache.maven.plugins:maven-compiler-plugin:2.3.2(default-testCompile)[INFO]
Compiling 7 source files to <https://builds.apache.org/job/Accumulo-Trunk-Hadoop-2.0/ws/accumulo-trunk/start/target/test-classes>

[INFO] 
[INFO] --- maven-compiler-plugin:2.3.2:testCompile (default-testCompile) @ accumulo-start
---
mojoSucceeded org.apache.maven.plugins:maven-compiler-plugin:2.3.2(default-testCompile)
mojoStarted org.apache.maven.plugins:maven-surefire-plugin:2.12(default-test)[INFO] Surefire
report directory: <https://builds.apache.org/job/Accumulo-Trunk-Hadoop-2.0/ws/accumulo-trunk/start/target/surefire-reports>

-------------------------------------------------------
 T E S T S
-------------------------------------------------------


[INFO] -------------------------------------------------------
 T E S T S
-------------------------------------------------------

[INFO] --- maven-surefire-plugin:2.12:test (default-test) @ accumulo-start ---
Running org.apache.accumulo.start.classloader.vfs.AccumuloReloadingVFSClassLoaderTest
Tests run: 2, Failures: 0, Errors: 0, Skipped: 0, Time elapsed: 2.259 sec
Running org.apache.accumulo.start.classloader.vfs.ContextManagerTest
2013-02-09 00:00:44,632 INFO  [main] impl.DefaultFileSystemManager (VfsLog.java:info(138))
- Using "/tmp/vfs_cache" as temporary files store.
2013-02-09 00:00:44,728 INFO  [main] impl.DefaultFileSystemManager (VfsLog.java:info(138))
- Using "/tmp/vfs_cache" as temporary files store.
Tests run: 2, Failures: 0, Errors: 0, Skipped: 0, Time elapsed: 0.284 sec
Running org.apache.accumulo.start.classloader.vfs.AccumuloVFSClassLoaderTest
2013-02-09 00:00:46,231 INFO  [main] impl.DefaultFileSystemManager (VfsLog.java:info(138))
- Using "/tmp/vfs_cache" as temporary files store.
2013-02-09 00:00:46,566 WARN  [main] vfs.AccumuloVFSClassLoader (AccumuloVFSClassLoader.java:resolve(144))
- ignoring classpath entry file:///lib/ext/[^.].*.jar
2013-02-09 00:00:46,628 WARN  [main] vfs.AccumuloVFSClassLoader (AccumuloVFSClassLoader.java:resolve(144))
- ignoring classpath entry file:///lib/ext/[^.].*.jar
Tests run: 2, Failures: 0, Errors: 0, Skipped: 0, Time elapsed: 1.644 sec
Running org.apache.accumulo.start.classloader.vfs.providers.VfsClassLoaderTest
Formatting using clusterid: testClusterID
SLF4J: Class path contains multiple SLF4J bindings.
SLF4J: Found binding in [jar:file:/home/jenkins/jenkins-slave/maven-repositories/1/org/slf4j/slf4j-nop/1.7.2/slf4j-nop-1.7.2.jar!/org/slf4j/impl/StaticLoggerBinder.class]
SLF4J: Found binding in [jar:file:/home/jenkins/jenkins-slave/maven-repositories/1/org/slf4j/slf4j-log4j12/1.6.1/slf4j-log4j12-1.6.1.jar!/org/slf4j/impl/StaticLoggerBinder.class]
SLF4J: See http://www.slf4j.org/codes.html#multiple_bindings for an explanation.
Tests run: 2, Failures: 0, Errors: 0, Skipped: 0, Time elapsed: 11.929 sec
Running org.apache.accumulo.start.classloader.vfs.providers.ReadOnlyHdfsFileProviderTest
Formatting using clusterid: testClusterID
SLF4J: Class path contains multiple SLF4J bindings.
SLF4J: Found binding in [jar:file:/home/jenkins/jenkins-slave/maven-repositories/1/org/slf4j/slf4j-nop/1.7.2/slf4j-nop-1.7.2.jar!/org/slf4j/impl/StaticLoggerBinder.class]
SLF4J: Found binding in [jar:file:/home/jenkins/jenkins-slave/maven-repositories/1/org/slf4j/slf4j-log4j12/1.6.1/slf4j-log4j12-1.6.1.jar!/org/slf4j/impl/StaticLoggerBinder.class]
SLF4J: See http://www.slf4j.org/codes.html#multiple_bindings for an explanation.
Tests run: 15, Failures: 0, Errors: 0, Skipped: 0, Time elapsed: 8.749 sec

Results :

Tests run: 23, Failures: 0, Errors: 0, Skipped: 0

mojoSucceeded org.apache.maven.plugins:maven-surefire-plugin:2.12(default-test)
projectFailed org.apache.accumulo:accumulo-start:1.5.0-SNAPSHOT
sessionEnded
[INFO] ------------------------------------------------------------------------
[INFO] Reactor Summary:
[INFO] 
[INFO] Apache Accumulo ................................... SUCCESS [42.832s]
[INFO] Trace ............................................. SUCCESS [31.303s]
[INFO] Start ............................................. FAILURE [45.726s]
[INFO] Fate .............................................. SKIPPED
[INFO] Core .............................................. SKIPPED
[INFO] Server ............................................ SKIPPED
[INFO] Examples .......................................... SKIPPED
[INFO] Simple Examples ................................... SKIPPED
[INFO] Testing ........................................... SKIPPED
[INFO] Instamo Example ................................... SKIPPED
[INFO] Proxy ............................................. SKIPPED
[INFO] Assemble .......................................... SKIPPED
[INFO] ------------------------------------------------------------------------
[INFO] BUILD FAILURE
[INFO] ------------------------------------------------------------------------
[INFO] Total time: 2:09.449s
[INFO] Finished at: Sat Feb 09 00:01:09 UTC 2013
[INFO] Final Memory: 49M/198M
[INFO] ------------------------------------------------------------------------
Projects to build: [MavenProject: org.apache.accumulo:accumulo:1.5.0-SNAPSHOT @ <https://builds.apache.org/job/Accumulo-Trunk-Hadoop-2.0/ws/accumulo-trunk/pom.xml,>
MavenProject: org.apache.accumulo:accumulo-trace:1.5.0-SNAPSHOT @ <https://builds.apache.org/job/Accumulo-Trunk-Hadoop-2.0/ws/accumulo-trunk/trace/pom.xml,>
MavenProject: org.apache.accumulo:accumulo-start:1.5.0-SNAPSHOT @ <https://builds.apache.org/job/Accumulo-Trunk-Hadoop-2.0/ws/accumulo-trunk/start/pom.xml,>
MavenProject: org.apache.accumulo:accumulo-fate:1.5.0-SNAPSHOT @ <https://builds.apache.org/job/Accumulo-Trunk-Hadoop-2.0/ws/accumulo-trunk/fate/pom.xml,>
MavenProject: org.apache.accumulo:accumulo-core:1.5.0-SNAPSHOT @ <https://builds.apache.org/job/Accumulo-Trunk-Hadoop-2.0/ws/accumulo-trunk/core/pom.xml,>
MavenProject: org.apache.accumulo:accumulo-server:1.5.0-SNAPSHOT @ <https://builds.apache.org/job/Accumulo-Trunk-Hadoop-2.0/ws/accumulo-trunk/server/pom.xml,>
MavenProject: org.apache.accumulo:accumulo-examples:1.5.0-SNAPSHOT @ <https://builds.apache.org/job/Accumulo-Trunk-Hadoop-2.0/ws/accumulo-trunk/examples/pom.xml,>
MavenProject: org.apache.accumulo:accumulo-examples-simple:1.5.0-SNAPSHOT @ <https://builds.apache.org/job/Accumulo-Trunk-Hadoop-2.0/ws/accumulo-trunk/examples/simple/pom.xml,>
MavenProject: org.apache.accumulo:accumulo-test:1.5.0-SNAPSHOT @ <https://builds.apache.org/job/Accumulo-Trunk-Hadoop-2.0/ws/accumulo-trunk/test/pom.xml,>
MavenProject: org.apache.accumulo:accumulo-examples-instamo:1.5.0-SNAPSHOT @ <https://builds.apache.org/job/Accumulo-Trunk-Hadoop-2.0/ws/accumulo-trunk/examples/instamo/pom.xml,>
MavenProject: org.apache.accumulo:accumulo-proxy:1.5.0-SNAPSHOT @ <https://builds.apache.org/job/Accumulo-Trunk-Hadoop-2.0/ws/accumulo-trunk/proxy/pom.xml,>
MavenProject: org.apache.accumulo:accumulo-assemble:1.5.0-SNAPSHOT @ <https://builds.apache.org/job/Accumulo-Trunk-Hadoop-2.0/ws/accumulo-trunk/assemble/pom.xml]>
[JENKINS] Archiving <https://builds.apache.org/job/Accumulo-Trunk-Hadoop-2.0/ws/accumulo-trunk/assemble/pom.xml>
to /home/hudson/hudson/jobs/Accumulo-Trunk-Hadoop-2.0/modules/org.apache.accumulo$accumulo-assemble/builds/2013-02-08_23-58-44/archive/org.apache.accumulo/accumulo-assemble/1.5.0-SNAPSHOT/accumulo-assemble-1.5.0-SNAPSHOT.pom
[JENKINS] Archiving <https://builds.apache.org/job/Accumulo-Trunk-Hadoop-2.0/ws/accumulo-trunk/server/pom.xml>
to /home/hudson/hudson/jobs/Accumulo-Trunk-Hadoop-2.0/modules/org.apache.accumulo$accumulo-server/builds/2013-02-08_23-58-44/archive/org.apache.accumulo/accumulo-server/1.5.0-SNAPSHOT/accumulo-server-1.5.0-SNAPSHOT.pom
[JENKINS] Archiving <https://builds.apache.org/job/Accumulo-Trunk-Hadoop-2.0/ws/accumulo-trunk/examples/simple/pom.xml>
to /home/hudson/hudson/jobs/Accumulo-Trunk-Hadoop-2.0/modules/org.apache.accumulo$accumulo-examples-simple/builds/2013-02-08_23-58-44/archive/org.apache.accumulo/accumulo-examples-simple/1.5.0-SNAPSHOT/accumulo-examples-simple-1.5.0-SNAPSHOT.pom
[JENKINS] Archiving <https://builds.apache.org/job/Accumulo-Trunk-Hadoop-2.0/ws/accumulo-trunk/proxy/pom.xml>
to /home/hudson/hudson/jobs/Accumulo-Trunk-Hadoop-2.0/modules/org.apache.accumulo$accumulo-proxy/builds/2013-02-08_23-58-44/archive/org.apache.accumulo/accumulo-proxy/1.5.0-SNAPSHOT/accumulo-proxy-1.5.0-SNAPSHOT.pom
[JENKINS] Archiving <https://builds.apache.org/job/Accumulo-Trunk-Hadoop-2.0/ws/accumulo-trunk/examples/pom.xml>
to /home/hudson/hudson/jobs/Accumulo-Trunk-Hadoop-2.0/modules/org.apache.accumulo$accumulo-examples/builds/2013-02-08_23-58-44/archive/org.apache.accumulo/accumulo-examples/1.5.0-SNAPSHOT/accumulo-examples-1.5.0-SNAPSHOT.pom
[JENKINS] Archiving <https://builds.apache.org/job/Accumulo-Trunk-Hadoop-2.0/ws/accumulo-trunk/pom.xml>
to /home/hudson/hudson/jobs/Accumulo-Trunk-Hadoop-2.0/modules/org.apache.accumulo$accumulo/builds/2013-02-08_23-58-44/archive/org.apache.accumulo/accumulo/1.5.0-SNAPSHOT/accumulo-1.5.0-SNAPSHOT.pom
[JENKINS] Archiving <https://builds.apache.org/job/Accumulo-Trunk-Hadoop-2.0/ws/accumulo-trunk/target/accumulo-1.5.0-SNAPSHOT-site.xml>
to /home/hudson/hudson/jobs/Accumulo-Trunk-Hadoop-2.0/modules/org.apache.accumulo$accumulo/builds/2013-02-08_23-58-44/archive/org.apache.accumulo/accumulo/1.5.0-SNAPSHOT/accumulo-1.5.0-SNAPSHOT-site.xml
[JENKINS] Archiving <https://builds.apache.org/job/Accumulo-Trunk-Hadoop-2.0/ws/accumulo-trunk/test/pom.xml>
to /home/hudson/hudson/jobs/Accumulo-Trunk-Hadoop-2.0/modules/org.apache.accumulo$accumulo-test/builds/2013-02-08_23-58-44/archive/org.apache.accumulo/accumulo-test/1.5.0-SNAPSHOT/accumulo-test-1.5.0-SNAPSHOT.pom
[JENKINS] Archiving <https://builds.apache.org/job/Accumulo-Trunk-Hadoop-2.0/ws/accumulo-trunk/start/pom.xml>
to /home/hudson/hudson/jobs/Accumulo-Trunk-Hadoop-2.0/modules/org.apache.accumulo$accumulo-start/builds/2013-02-08_23-58-44/archive/org.apache.accumulo/accumulo-start/1.5.0-SNAPSHOT/accumulo-start-1.5.0-SNAPSHOT.pom
[JENKINS] Archiving <https://builds.apache.org/job/Accumulo-Trunk-Hadoop-2.0/ws/accumulo-trunk/fate/pom.xml>
to /home/hudson/hudson/jobs/Accumulo-Trunk-Hadoop-2.0/modules/org.apache.accumulo$accumulo-fate/builds/2013-02-08_23-58-44/archive/org.apache.accumulo/accumulo-fate/1.5.0-SNAPSHOT/accumulo-fate-1.5.0-SNAPSHOT.pom
[JENKINS] Archiving <https://builds.apache.org/job/Accumulo-Trunk-Hadoop-2.0/ws/accumulo-trunk/core/pom.xml>
to /home/hudson/hudson/jobs/Accumulo-Trunk-Hadoop-2.0/modules/org.apache.accumulo$accumulo-core/builds/2013-02-08_23-58-44/archive/org.apache.accumulo/accumulo-core/1.5.0-SNAPSHOT/accumulo-core-1.5.0-SNAPSHOT.pom
[JENKINS] Archiving <https://builds.apache.org/job/Accumulo-Trunk-Hadoop-2.0/ws/accumulo-trunk/trace/pom.xml>
to /home/hudson/hudson/jobs/Accumulo-Trunk-Hadoop-2.0/modules/org.apache.accumulo$accumulo-trace/builds/2013-02-08_23-58-44/archive/org.apache.accumulo/accumulo-trace/1.5.0-SNAPSHOT/accumulo-trace-1.5.0-SNAPSHOT.pom
[JENKINS] Archiving <https://builds.apache.org/job/Accumulo-Trunk-Hadoop-2.0/ws/accumulo-trunk/lib/accumulo-trace-1.5.0-SNAPSHOT.jar>
to /home/hudson/hudson/jobs/Accumulo-Trunk-Hadoop-2.0/modules/org.apache.accumulo$accumulo-trace/builds/2013-02-08_23-58-44/archive/org.apache.accumulo/accumulo-trace/1.5.0-SNAPSHOT/accumulo-trace-1.5.0-SNAPSHOT.jar
[JENKINS] Archiving <https://builds.apache.org/job/Accumulo-Trunk-Hadoop-2.0/ws/accumulo-trunk/lib/accumulo-trace-1.5.0-SNAPSHOT-sources.jar>
to /home/hudson/hudson/jobs/Accumulo-Trunk-Hadoop-2.0/modules/org.apache.accumulo$accumulo-trace/builds/2013-02-08_23-58-44/archive/org.apache.accumulo/accumulo-trace/1.5.0-SNAPSHOT/accumulo-trace-1.5.0-SNAPSHOT-sources.jar
[JENKINS] Archiving <https://builds.apache.org/job/Accumulo-Trunk-Hadoop-2.0/ws/accumulo-trunk/lib/accumulo-trace-1.5.0-SNAPSHOT-test-sources.jar>
to /home/hudson/hudson/jobs/Accumulo-Trunk-Hadoop-2.0/modules/org.apache.accumulo$accumulo-trace/builds/2013-02-08_23-58-44/archive/org.apache.accumulo/accumulo-trace/1.5.0-SNAPSHOT/accumulo-trace-1.5.0-SNAPSHOT-test-sources.jar
[JENKINS] Archiving <https://builds.apache.org/job/Accumulo-Trunk-Hadoop-2.0/ws/accumulo-trunk/examples/instamo/pom.xml>
to /home/hudson/hudson/jobs/Accumulo-Trunk-Hadoop-2.0/modules/org.apache.accumulo$accumulo-examples-instamo/builds/2013-02-08_23-58-44/archive/org.apache.accumulo/accumulo-examples-instamo/1.5.0-SNAPSHOT/accumulo-examples-instamo-1.5.0-SNAPSHOT.pom
Waiting for Jenkins to finish collecting data
mavenExecutionResult exceptions not empty
message : Internal error: java.lang.reflect.UndeclaredThrowableException
cause : null
Stack trace : 
org.apache.maven.InternalErrorException: Internal error: java.lang.reflect.UndeclaredThrowableException
	at org.apache.maven.lifecycle.internal.BuilderCommon.handleBuildError(BuilderCommon.java:128)
	at org.apache.maven.lifecycle.internal.LifecycleModuleBuilder.buildProject(LifecycleModuleBuilder.java:95)
	at org.apache.maven.lifecycle.internal.LifecycleModuleBuilder.buildProject(LifecycleModuleBuilder.java:59)
	at org.apache.maven.lifecycle.internal.LifecycleStarter.singleThreadedBuild(LifecycleStarter.java:183)
	at org.apache.maven.lifecycle.internal.LifecycleStarter.execute(LifecycleStarter.java:161)
	at org.apache.maven.DefaultMaven.doExecute(DefaultMaven.java:320)
	at org.apache.maven.DefaultMaven.execute(DefaultMaven.java:156)
	at org.jvnet.hudson.maven3.launcher.Maven3Launcher.main(Maven3Launcher.java:79)
	at sun.reflect.NativeMethodAccessorImpl.invoke0(Native Method)
	at sun.reflect.NativeMethodAccessorImpl.invoke(NativeMethodAccessorImpl.java:39)
	at sun.reflect.DelegatingMethodAccessorImpl.invoke(DelegatingMethodAccessorImpl.java:25)
	at java.lang.reflect.Method.invoke(Method.java:597)
	at org.codehaus.plexus.classworlds.launcher.Launcher.launchStandard(Launcher.java:329)
	at org.codehaus.plexus.classworlds.launcher.Launcher.launch(Launcher.java:239)
	at org.jvnet.hudson.maven3.agent.Maven3Main.launch(Maven3Main.java:158)
	at hudson.maven.Maven3Builder.call(Maven3Builder.java:100)
	at hudson.maven.Maven3Builder.call(Maven3Builder.java:66)
	at hudson.remoting.UserRequest.perform(UserRequest.java:118)
	at hudson.remoting.UserRequest.perform(UserRequest.java:48)
	at hudson.remoting.Request$2.run(Request.java:326)
	at hudson.remoting.InterceptingExecutorService$1.call(InterceptingExecutorService.java:72)
	at java.util.concurrent.FutureTask$Sync.innerRun(FutureTask.java:303)
	at java.util.concurrent.FutureTask.run(FutureTask.java:138)
	at java.util.concurrent.ThreadPoolExecutor$Worker.runTask(ThreadPoolExecutor.java:886)
	at java.util.concurrent.ThreadPoolExecutor$Worker.run(ThreadPoolExecutor.java:908)
	at java.lang.Thread.run(Thread.java:662)
Caused by: java.lang.reflect.UndeclaredThrowableException
	at $Proxy2.setExecutedMojos(Unknown Source)
	at hudson.maven.MavenBuildProxy$Filter.setExecutedMojos(MavenBuildProxy.java:243)
	at hudson.maven.Maven3Builder$MavenExecutionListener.recordMojoEnded(Maven3Builder.java:437)
	at hudson.maven.Maven3Builder$MavenExecutionListener.mojoSucceeded(Maven3Builder.java:423)
	at org.apache.maven.lifecycle.internal.DefaultExecutionEventCatapult.fire(DefaultExecutionEventCatapult.java:87)
	at org.apache.maven.lifecycle.internal.DefaultExecutionEventCatapult.fire(DefaultExecutionEventCatapult.java:42)
	at org.apache.maven.lifecycle.internal.MojoExecutor.execute(MojoExecutor.java:228)
	at org.apache.maven.lifecycle.internal.MojoExecutor.execute(MojoExecutor.java:153)
	at org.apache.maven.lifecycle.internal.MojoExecutor.execute(MojoExecutor.java:145)
	at org.apache.maven.lifecycle.internal.LifecycleModuleBuilder.buildProject(LifecycleModuleBuilder.java:84)
	... 24 more
Caused by: java.io.UTFDataFormatException
	at java.io.ObjectInputStream$BlockDataInputStream.readUTFSpan(ObjectInputStream.java:3105)
	at java.io.ObjectInputStream$BlockDataInputStream.readUTFBody(ObjectInputStream.java:3030)
	at java.io.ObjectInputStream$BlockDataInputStream.readUTF(ObjectInputStream.java:2843)
	at java.io.ObjectInputStream.readString(ObjectInputStream.java:1617)
	at java.io.ObjectInputStream.readObject0(ObjectInputStream.java:1338)
	at java.io.ObjectInputStream.defaultReadFields(ObjectInputStream.java:1970)
	at java.io.ObjectInputStream.readSerialData(ObjectInputStream.java:1894)
	at java.io.ObjectInputStream.readOrdinaryObject(ObjectInputStream.java:1777)
	at java.io.ObjectInputStream.readObject0(ObjectInputStream.java:1347)
	at java.io.ObjectInputStream.readArray(ObjectInputStream.java:1685)
	at java.io.ObjectInputStream.readObject0(ObjectInputStream.java:1341)
	at java.io.ObjectInputStream.defaultReadFields(ObjectInputStream.java:1970)
	at java.io.ObjectInputStream.defaultReadObject(ObjectInputStream.java:498)
	at java.lang.Throwable.readObject(Throwable.java:913)
	at sun.reflect.GeneratedMethodAccessor126.invoke(Unknown Source)
	at sun.reflect.DelegatingMethodAccessorImpl.invoke(DelegatingMethodAccessorImpl.java:43)
	at java.lang.reflect.Method.invoke(Method.java:601)
	at java.io.ObjectStreamClass.invokeReadObject(ObjectStreamClass.java:1004)
	at java.io.ObjectInputStream.readSerialData(ObjectInputStream.java:1872)
	at java.io.ObjectInputStream.readOrdinaryObject(ObjectInputStream.java:1777)
	at java.io.ObjectInputStream.readObject0(ObjectInputStream.java:1347)
	at java.io.ObjectInputStream.defaultReadFields(ObjectInputStream.java:1970)
	at java.io.ObjectInputStream.readSerialData(ObjectInputStream.java:1894)
	at java.io.ObjectInputStream.readOrdinaryObject(ObjectInputStream.java:1777)
	at java.io.ObjectInputStream.readObject0(ObjectInputStream.java:1347)
	at java.io.ObjectInputStream.readObject(ObjectInputStream.java:369)
	at hudson.remoting.UserRequest.deserialize(UserRequest.java:182)
	at hudson.remoting.UserRequest.perform(UserRequest.java:98)
	at hudson.remoting.UserRequest.perform(UserRequest.java:48)
	at hudson.remoting.Request$2.run(Request.java:326)
	at hudson.remoting.InterceptingExecutorService$1.call(InterceptingExecutorService.java:72)
	at java.util.concurrent.FutureTask$Sync.innerRun(FutureTask.java:334)
	at java.util.concurrent.FutureTask.run(FutureTask.java:166)
	at java.util.concurrent.ThreadPoolExecutor.runWorker(ThreadPoolExecutor.java:1145)
	at java.util.concurrent.ThreadPoolExecutor$Worker.run(ThreadPoolExecutor.java:615)
	at java.lang.Thread.run(Thread.java:722)
Sending e-mails to: notifications@accumulo.apache.org
channel stopped
Updating ACCUMULO-1049
Updating ACCUMULO-1001

Mime
View raw message