accumulo-dev mailing list archives

Site index · List index
Message view « Date » · « Thread »
Top « Date » · « Thread »
From Apache Jenkins Server <jenk...@builds.apache.org>
Subject Build failed in Jenkins: Accumulo-Trunk #500
Date Wed, 10 Oct 2012 19:57:20 GMT
See <https://builds.apache.org/job/Accumulo-Trunk/500/changes>

Changes:

[ecn] ACCUMULO-786: move server-side timestamp setting to server-only code

------------------------------------------
[...truncated 2925 lines...]
Running org.apache.accumulo.core.iterators.user.CombinerTest
Tests run: 13, Failures: 0, Errors: 0, Skipped: 0, Time elapsed: 0.038 sec
Running org.apache.accumulo.core.iterators.user.RegExFilterTest
Tests run: 1, Failures: 0, Errors: 0, Skipped: 0, Time elapsed: 0.003 sec
Running org.apache.accumulo.core.iterators.user.IndexedDocIteratorTest
Tests run: 5, Failures: 0, Errors: 0, Skipped: 0, Time elapsed: 3.427 sec
Running org.apache.accumulo.core.iterators.user.RowDeletingIteratorTest
Tests run: 4, Failures: 0, Errors: 0, Skipped: 0, Time elapsed: 0.005 sec
Running org.apache.accumulo.core.iterators.user.WholeRowIteratorTest
Tests run: 3, Failures: 0, Errors: 0, Skipped: 0, Time elapsed: 0.004 sec
Running org.apache.accumulo.core.iterators.user.IntersectingIteratorTest
Tests run: 6, Failures: 0, Errors: 0, Skipped: 0, Time elapsed: 9.217 sec
Running org.apache.accumulo.core.iterators.user.RowFilterTest
Tests run: 1, Failures: 0, Errors: 0, Skipped: 0, Time elapsed: 0.045 sec
Running org.apache.accumulo.core.iterators.user.VersioningIteratorTest
Tests run: 6, Failures: 0, Errors: 0, Skipped: 0, Time elapsed: 0.039 sec
Running org.apache.accumulo.core.iterators.AggregatingIteratorTest
Tests run: 7, Failures: 0, Errors: 0, Skipped: 0, Time elapsed: 0.007 sec
Running org.apache.accumulo.core.iterators.IterUtilTest
Tests run: 5, Failures: 0, Errors: 0, Skipped: 0, Time elapsed: 0.007 sec
Running org.apache.accumulo.core.iterators.FirstEntryInRowIteratorTest
Tests run: 1, Failures: 0, Errors: 0, Skipped: 0, Time elapsed: 0.002 sec
Running org.apache.accumulo.core.conf.PropertyTest
Tests run: 3, Failures: 0, Errors: 0, Skipped: 0, Time elapsed: 0.004 sec
Running org.apache.accumulo.core.file.blockfile.cache.TestCachedBlockQueue
Tests run: 2, Failures: 0, Errors: 0, Skipped: 0, Time elapsed: 0.001 sec
Running org.apache.accumulo.core.file.blockfile.cache.TestLruBlockCache
Tests run: 7, Failures: 0, Errors: 0, Skipped: 0, Time elapsed: 1.031 sec
Running org.apache.accumulo.core.file.rfile.RFileTest
Tests run: 19, Failures: 0, Errors: 0, Skipped: 0, Time elapsed: 14.054 sec
Running org.apache.accumulo.core.file.rfile.RelativeKeyTest
Tests run: 1, Failures: 0, Errors: 0, Skipped: 0, Time elapsed: 0 sec
Running org.apache.accumulo.core.file.rfile.MultiLevelIndexTest
Tests run: 1, Failures: 0, Errors: 0, Skipped: 0, Time elapsed: 1.635 sec
Flushing results...
Flushing results done
Cobertura: Loaded information on 1748 classes.
Cobertura: Saved information on 1748 classes.

Results :

mojoSucceeded org.apache.maven.plugins:maven-surefire-plugin:2.12(default-test)Tests run:
288, Failures: 0, Errors: 0, Skipped: 0


[JENKINS] Recording test results
forkedProjectSucceeded org.apache.accumulo:accumulo-core:1.5.0-SNAPSHOT
mojoStarted org.codehaus.mojo:cobertura-maven-plugin:2.5.2(default-cli)
[INFO] 
[INFO] --- cobertura-maven-plugin:2.5.2:cobertura (default-cli) @ accumulo-core ---
mojoSucceeded org.codehaus.mojo:cobertura-maven-plugin:2.5.2(default-cli)[INFO] Cobertura
1.9.4.1 - GNU GPL License (NO WARRANTY) - See COPYRIGHT file
Cobertura: Loaded information on 1748 classes.
Report time: 7606ms

[INFO] Cobertura Report generation was successful.

projectSucceeded org.apache.accumulo:accumulo-core:1.5.0-SNAPSHOT
projectStarted org.apache.accumulo:accumulo-server:1.5.0-SNAPSHOT
[INFO] [INFO] Deleting <https://builds.apache.org/job/Accumulo-Trunk/ws/accumulo-trunk/server>
(includes = [**/*.pyc], excludes = [])
                                                                        
[INFO] ------------------------------------------------------------------------
[INFO] Building accumulo-server 1.5.0-SNAPSHOT
[INFO] ------------------------------------------------------------------------
mojoStarted org.apache.maven.plugins:maven-clean-plugin:2.4.1(default-clean)
[INFO] 
[INFO] --- maven-clean-plugin:2.4.1:clean (default-clean) @ accumulo-server ---
mojoSucceeded org.apache.maven.plugins:maven-clean-plugin:2.4.1(default-clean)
[INFO] Checking for local modifications: skipped.
mojoStarted org.codehaus.mojo:buildnumber-maven-plugin:1.1(default)[INFO] Updating project
files from SCM: skipped.
[INFO] Executing: /bin/sh -c cd <https://builds.apache.org/job/Accumulo-Trunk/ws/accumulo-trunk/server>
&& svn --non-interactive info
[INFO] Working directory: <https://builds.apache.org/job/Accumulo-Trunk/ws/accumulo-trunk/server>
[INFO] Storing buildNumber: 1396759 at timestamp: 1349898788093
[INFO] Executing: /bin/sh -c cd <https://builds.apache.org/job/Accumulo-Trunk/ws/accumulo-trunk/server>
&& svn --non-interactive info
[INFO] Working directory: <https://builds.apache.org/job/Accumulo-Trunk/ws/accumulo-trunk/server>
[INFO] Storing buildScmBranch: trunk

[INFO] 
[INFO] --- buildnumber-maven-plugin:1.1:create (default) @ accumulo-server ---
mojoSucceeded org.codehaus.mojo:buildnumber-maven-plugin:1.1(default)
mojoStarted org.apache.maven.plugins:maven-enforcer-plugin:1.0.1(enforce-mvn)
[INFO] 
[INFO] --- maven-enforcer-plugin:1.0.1:enforce (enforce-mvn) @ accumulo-server ---
mojoSucceeded org.apache.maven.plugins:maven-enforcer-plugin:1.0.1(enforce-mvn)
mojoStarted org.apache.maven.plugins:maven-remote-resources-plugin:1.2.1(default)
[INFO] 
[INFO] --- maven-remote-resources-plugin:1.2.1:process (default) @ accumulo-server ---
mojoSucceeded org.apache.maven.plugins:maven-remote-resources-plugin:1.2.1(default)
[debug] execute contextualize
mojoStarted org.apache.maven.plugins:maven-resources-plugin:2.5(default-resources)[INFO] Using
'UTF-8' encoding to copy filtered resources.
[INFO] Copying 38 resources
[INFO] Copying 3 resources

[INFO] 
[INFO] --- maven-resources-plugin:2.5:resources (default-resources) @ accumulo-server ---
mojoSucceeded org.apache.maven.plugins:maven-resources-plugin:2.5(default-resources)
[INFO] Copying commons-configuration-1.5.jar to <https://builds.apache.org/job/Accumulo-Trunk/ws/accumulo-trunk/lib/commons-configuration-1.5.jar>
mojoStarted org.apache.maven.plugins:maven-dependency-plugin:2.3(copy-dependencies)[INFO]
commons-collections-3.2.jar already exists in destination.
[INFO] commons-lang-2.4.jar already exists in destination.
[INFO] commons-io-1.4.jar already exists in destination.
[INFO] libthrift-0.8.0.jar already exists in destination.
[INFO] log4j-1.2.16.jar already exists in destination.
[INFO] jline-0.9.94.jar already exists in destination.

[INFO] 
[INFO] --- maven-dependency-plugin:2.3:copy-dependencies (copy-dependencies) @ accumulo-server
---
mojoSucceeded org.apache.maven.plugins:maven-dependency-plugin:2.3(copy-dependencies)
mojoStarted org.apache.maven.plugins:maven-compiler-plugin:2.3.2(default-compile)
[INFO] 
[INFO] --- maven-compiler-plugin:2.3.2:compile (default-compile) @ accumulo-server ---
[INFO] Compiling 400 source files to <https://builds.apache.org/job/Accumulo-Trunk/ws/accumulo-trunk/server/target/classes>
mojoFailed org.apache.maven.plugins:maven-compiler-plugin:2.3.2(default-compile)[INFO] -------------------------------------------------------------
[ERROR] COMPILATION ERROR : 
[INFO] -------------------------------------------------------------
[ERROR] <https://builds.apache.org/job/Accumulo-Trunk/ws/accumulo-trunk/server/src/main/java/org/apache/accumulo/server/tabletserver/TabletServer.java>:[147,38]
package org.apache.accumulo.server.data does not exist
[ERROR] <https://builds.apache.org/job/Accumulo-Trunk/ws/accumulo-trunk/server/src/main/java/org/apache/accumulo/server/tabletserver/TabletTime.java>:[27,38]
package org.apache.accumulo.server.data does not exist
[ERROR] <https://builds.apache.org/job/Accumulo-Trunk/ws/accumulo-trunk/server/src/main/java/org/apache/accumulo/server/tabletserver/log/DfsLogger.java>:[40,44]
cannot find symbol
symbol  : class TabletMutations
location: package org.apache.accumulo.core.tabletserver
[ERROR] <https://builds.apache.org/job/Accumulo-Trunk/ws/accumulo-trunk/server/src/main/java/org/apache/accumulo/server/tabletserver/MutationLog.java>:[26,38]
package org.apache.accumulo.server.data does not exist
[ERROR] <https://builds.apache.org/job/Accumulo-Trunk/ws/accumulo-trunk/server/src/main/java/org/apache/accumulo/server/tabletserver/log/TabletServerLogger.java>:[36,44]
cannot find symbol
symbol  : class TabletMutations
location: package org.apache.accumulo.core.tabletserver
[ERROR] <https://builds.apache.org/job/Accumulo-Trunk/ws/accumulo-trunk/server/src/main/java/org/apache/accumulo/server/logger/LogFileValue.java>:[31,38]
package org.apache.accumulo.server.data does not exist
[ERROR] <https://builds.apache.org/job/Accumulo-Trunk/ws/accumulo-trunk/server/src/main/java/org/apache/accumulo/server/tabletserver/log/DfsLogger.java>:[316,45]
cannot find symbol
symbol  : class TabletMutations
location: class org.apache.accumulo.server.tabletserver.log.DfsLogger
[ERROR] <https://builds.apache.org/job/Accumulo-Trunk/ws/accumulo-trunk/server/src/main/java/org/apache/accumulo/server/tabletserver/log/DfsLogger.java>:[134,9]
cannot find symbol
symbol  : class TabletMutations
location: class org.apache.accumulo.server.tabletserver.log.DfsLogger.LogWork
[ERROR] <https://builds.apache.org/job/Accumulo-Trunk/ws/accumulo-trunk/server/src/main/java/org/apache/accumulo/server/tabletserver/log/DfsLogger.java>:[138,24]
cannot find symbol
symbol  : class TabletMutations
location: class org.apache.accumulo.server.tabletserver.log.DfsLogger.LogWork
[ERROR] <https://builds.apache.org/job/Accumulo-Trunk/ws/accumulo-trunk/server/src/main/java/org/apache/accumulo/server/tabletserver/TabletServer.java>:[1461,36]
cannot find symbol
symbol  : class ServerMutation
location: class org.apache.accumulo.server.tabletserver.TabletServer.ThriftClientHandler
[ERROR] <https://builds.apache.org/job/Accumulo-Trunk/ws/accumulo-trunk/server/src/main/java/org/apache/accumulo/server/tabletserver/TabletServer.java>:[1676,32]
cannot find symbol
symbol  : class ServerMutation
location: class org.apache.accumulo.server.tabletserver.TabletServer.ThriftClientHandler
[ERROR] <https://builds.apache.org/job/Accumulo-Trunk/ws/accumulo-trunk/server/src/main/java/org/apache/accumulo/server/tabletserver/TabletTime.java>:[59,4]
cannot find symbol
symbol  : class ServerMutation
location: class org.apache.accumulo.server.tabletserver.TabletTime
[ERROR] <https://builds.apache.org/job/Accumulo-Trunk/ws/accumulo-trunk/server/src/main/java/org/apache/accumulo/server/tabletserver/TabletTime.java>:[59,24]
cannot find symbol
symbol  : class ServerMutation
location: class org.apache.accumulo.server.tabletserver.TabletTime
[ERROR] <https://builds.apache.org/job/Accumulo-Trunk/ws/accumulo-trunk/server/src/main/java/org/apache/accumulo/server/tabletserver/log/DfsLogger.java>:[313,56]
cannot find symbol
symbol  : class TabletMutations
location: class org.apache.accumulo.server.tabletserver.log.DfsLogger
[ERROR] <https://builds.apache.org/job/Accumulo-Trunk/ws/accumulo-trunk/server/src/main/java/org/apache/accumulo/server/tabletserver/log/DfsLogger.java>:[321,13]
cannot find symbol
symbol  : class TabletMutations
location: class org.apache.accumulo.server.tabletserver.log.DfsLogger
[ERROR] <https://builds.apache.org/job/Accumulo-Trunk/ws/accumulo-trunk/server/src/main/java/org/apache/accumulo/server/tabletserver/MutationLog.java>:[69,34]
cannot find symbol
symbol  : class ServerMutation
location: class org.apache.accumulo.server.tabletserver.MutationLog
[ERROR] <https://builds.apache.org/job/Accumulo-Trunk/ws/accumulo-trunk/server/src/main/java/org/apache/accumulo/server/tabletserver/log/TabletServerLogger.java>:[365,13]
cannot find symbol
symbol: class TabletMutations
        List<TabletMutations> copy = new ArrayList<TabletMutations>(loggables.size());
[ERROR] <https://builds.apache.org/job/Accumulo-Trunk/ws/accumulo-trunk/server/src/main/java/org/apache/accumulo/server/tabletserver/log/TabletServerLogger.java>:[365,51]
cannot find symbol
symbol: class TabletMutations
        List<TabletMutations> copy = new ArrayList<TabletMutations>(loggables.size());
[ERROR] <https://builds.apache.org/job/Accumulo-Trunk/ws/accumulo-trunk/server/src/main/java/org/apache/accumulo/server/tabletserver/log/TabletServerLogger.java>:[368,23]
cannot find symbol
symbol: class TabletMutations
          copy.add(new TabletMutations(cs.getLogId(), cs.getWALogSeq(), entry.getValue()));
[ERROR] <https://builds.apache.org/job/Accumulo-Trunk/ws/accumulo-trunk/server/src/main/java/org/apache/accumulo/server/logger/LogFileValue.java>:[45,6]
cannot find symbol
symbol  : class ServerMutation
location: class org.apache.accumulo.server.logger.LogFileValue
[ERROR] <https://builds.apache.org/job/Accumulo-Trunk/ws/accumulo-trunk/server/src/main/java/org/apache/accumulo/server/logger/LogFileValue.java>:[45,36]
cannot find symbol
symbol  : class ServerMutation
location: class org.apache.accumulo.server.logger.LogFileValue
[INFO] 21 errors 
[INFO] -------------------------------------------------------------

projectFailed org.apache.accumulo:accumulo-server:1.5.0-SNAPSHOT
sessionEnded
[INFO] ------------------------------------------------------------------------
[INFO] Reactor Summary:
[INFO] 
[INFO] accumulo .......................................... SUCCESS [1:56.605s]
[INFO] cloudtrace ........................................ SUCCESS [1:22.406s]
[INFO] accumulo-start .................................... SUCCESS [55.506s]
[INFO] accumulo-fate ..................................... SUCCESS [27.783s]
[INFO] accumulo-core ..................................... SUCCESS [2:50.932s]
[INFO] accumulo-server ................................... FAILURE [14.770s]
[INFO] accumulo-examples ................................. SKIPPED
[INFO] examples-simple ................................... SKIPPED
[INFO] accumulo-assemble ................................. SKIPPED
[INFO] ------------------------------------------------------------------------
[INFO] BUILD FAILURE
[INFO] ------------------------------------------------------------------------
[INFO] Total time: 7:57.505s
[INFO] Finished at: Wed Oct 10 19:53:22 UTC 2012
[INFO] Final Memory: 57M/238M
[INFO] ------------------------------------------------------------------------
Projects to build: [MavenProject: org.apache.accumulo:accumulo:1.5.0-SNAPSHOT @ <https://builds.apache.org/job/Accumulo-Trunk/ws/accumulo-trunk/pom.xml,>
MavenProject: org.apache.accumulo:cloudtrace:1.5.0-SNAPSHOT @ <https://builds.apache.org/job/Accumulo-Trunk/ws/accumulo-trunk/trace/pom.xml,>
MavenProject: org.apache.accumulo:accumulo-start:1.5.0-SNAPSHOT @ <https://builds.apache.org/job/Accumulo-Trunk/ws/accumulo-trunk/start/pom.xml,>
MavenProject: org.apache.accumulo:accumulo-fate:1.5.0-SNAPSHOT @ <https://builds.apache.org/job/Accumulo-Trunk/ws/accumulo-trunk/fate/pom.xml,>
MavenProject: org.apache.accumulo:accumulo-core:1.5.0-SNAPSHOT @ <https://builds.apache.org/job/Accumulo-Trunk/ws/accumulo-trunk/core/pom.xml,>
MavenProject: org.apache.accumulo:accumulo-server:1.5.0-SNAPSHOT @ <https://builds.apache.org/job/Accumulo-Trunk/ws/accumulo-trunk/server/pom.xml,>
MavenProject: org.apache.accumulo:accumulo-examples:1.5.0-SNAPSHOT @ <https://builds.apache.org/job/Accumulo-Trunk/ws/accumulo-trunk/examples/pom.xml,>
MavenProject: org.apache.accumulo:examples-simple:1.5.0-SNAPSHOT @ <https://builds.apache.org/job/Accumulo-Trunk/ws/accumulo-trunk/examples/simple/pom.xml,>
MavenProject: org.apache.accumulo:accumulo-assemble:1.5.0-SNAPSHOT @ <https://builds.apache.org/job/Accumulo-Trunk/ws/accumulo-trunk/assemble/pom.xml]>
[JENKINS] Archiving <https://builds.apache.org/job/Accumulo-Trunk/ws/accumulo-trunk/assemble/pom.xml>
to /home/hudson/hudson/jobs/Accumulo-Trunk/modules/org.apache.accumulo$accumulo-assemble/builds/2012-10-10_19-43-32/archive/org.apache.accumulo/accumulo-assemble/1.5.0-SNAPSHOT/accumulo-assemble-1.5.0-SNAPSHOT.pom
[JENKINS] Archiving <https://builds.apache.org/job/Accumulo-Trunk/ws/accumulo-trunk/server/pom.xml>
to /home/hudson/hudson/jobs/Accumulo-Trunk/modules/org.apache.accumulo$accumulo-server/builds/2012-10-10_19-43-32/archive/org.apache.accumulo/accumulo-server/1.5.0-SNAPSHOT/accumulo-server-1.5.0-SNAPSHOT.pom
[JENKINS] Archiving <https://builds.apache.org/job/Accumulo-Trunk/ws/accumulo-trunk/trace/pom.xml>
to /home/hudson/hudson/jobs/Accumulo-Trunk/modules/org.apache.accumulo$cloudtrace/builds/2012-10-10_19-43-31/archive/org.apache.accumulo/cloudtrace/1.5.0-SNAPSHOT/cloudtrace-1.5.0-SNAPSHOT.pom
[JENKINS] Archiving <https://builds.apache.org/job/Accumulo-Trunk/ws/accumulo-trunk/lib/cloudtrace-1.5.0-SNAPSHOT.jar>
to /home/hudson/hudson/jobs/Accumulo-Trunk/modules/org.apache.accumulo$cloudtrace/builds/2012-10-10_19-43-31/archive/org.apache.accumulo/cloudtrace/1.5.0-SNAPSHOT/cloudtrace-1.5.0-SNAPSHOT.jar
[JENKINS] Archiving <https://builds.apache.org/job/Accumulo-Trunk/ws/accumulo-trunk/examples/pom.xml>
to /home/hudson/hudson/jobs/Accumulo-Trunk/modules/org.apache.accumulo$accumulo-examples/builds/2012-10-10_19-43-32/archive/org.apache.accumulo/accumulo-examples/1.5.0-SNAPSHOT/accumulo-examples-1.5.0-SNAPSHOT.pom
[JENKINS] Archiving <https://builds.apache.org/job/Accumulo-Trunk/ws/accumulo-trunk/examples/simple/pom.xml>
to /home/hudson/hudson/jobs/Accumulo-Trunk/modules/org.apache.accumulo$examples-simple/builds/2012-10-10_19-43-32/archive/org.apache.accumulo/examples-simple/1.5.0-SNAPSHOT/examples-simple-1.5.0-SNAPSHOT.pom
[JENKINS] Archiving <https://builds.apache.org/job/Accumulo-Trunk/ws/accumulo-trunk/pom.xml>
to /home/hudson/hudson/jobs/Accumulo-Trunk/modules/org.apache.accumulo$accumulo/builds/2012-10-10_19-43-31/archive/org.apache.accumulo/accumulo/1.5.0-SNAPSHOT/accumulo-1.5.0-SNAPSHOT.pom
[JENKINS] Archiving <https://builds.apache.org/job/Accumulo-Trunk/ws/accumulo-trunk/target/accumulo-1.5.0-SNAPSHOT-site.xml>
to /home/hudson/hudson/jobs/Accumulo-Trunk/modules/org.apache.accumulo$accumulo/builds/2012-10-10_19-43-31/archive/org.apache.accumulo/accumulo/1.5.0-SNAPSHOT/accumulo-1.5.0-SNAPSHOT-site.xml
[JENKINS] Archiving <https://builds.apache.org/job/Accumulo-Trunk/ws/accumulo-trunk/start/pom.xml>
to /home/hudson/hudson/jobs/Accumulo-Trunk/modules/org.apache.accumulo$accumulo-start/builds/2012-10-10_19-43-32/archive/org.apache.accumulo/accumulo-start/1.5.0-SNAPSHOT/accumulo-start-1.5.0-SNAPSHOT.pom
[JENKINS] Archiving <https://builds.apache.org/job/Accumulo-Trunk/ws/accumulo-trunk/lib/accumulo-start-1.5.0-SNAPSHOT.jar>
to /home/hudson/hudson/jobs/Accumulo-Trunk/modules/org.apache.accumulo$accumulo-start/builds/2012-10-10_19-43-32/archive/org.apache.accumulo/accumulo-start/1.5.0-SNAPSHOT/accumulo-start-1.5.0-SNAPSHOT.jar
[JENKINS] Archiving <https://builds.apache.org/job/Accumulo-Trunk/ws/accumulo-trunk/fate/pom.xml>
to /home/hudson/hudson/jobs/Accumulo-Trunk/modules/org.apache.accumulo$accumulo-fate/builds/2012-10-10_19-43-31/archive/org.apache.accumulo/accumulo-fate/1.5.0-SNAPSHOT/accumulo-fate-1.5.0-SNAPSHOT.pom
[JENKINS] Archiving <https://builds.apache.org/job/Accumulo-Trunk/ws/accumulo-trunk/lib/accumulo-fate-1.5.0-SNAPSHOT.jar>
to /home/hudson/hudson/jobs/Accumulo-Trunk/modules/org.apache.accumulo$accumulo-fate/builds/2012-10-10_19-43-31/archive/org.apache.accumulo/accumulo-fate/1.5.0-SNAPSHOT/accumulo-fate-1.5.0-SNAPSHOT.jar
[JENKINS] Archiving <https://builds.apache.org/job/Accumulo-Trunk/ws/accumulo-trunk/core/pom.xml>
to /home/hudson/hudson/jobs/Accumulo-Trunk/modules/org.apache.accumulo$accumulo-core/builds/2012-10-10_19-43-31/archive/org.apache.accumulo/accumulo-core/1.5.0-SNAPSHOT/accumulo-core-1.5.0-SNAPSHOT.pom
[JENKINS] Archiving <https://builds.apache.org/job/Accumulo-Trunk/ws/accumulo-trunk/lib/accumulo-core-1.5.0-SNAPSHOT.jar>
to /home/hudson/hudson/jobs/Accumulo-Trunk/modules/org.apache.accumulo$accumulo-core/builds/2012-10-10_19-43-31/archive/org.apache.accumulo/accumulo-core/1.5.0-SNAPSHOT/accumulo-core-1.5.0-SNAPSHOT.jar
Waiting for Jenkins to finish collecting data
mavenExecutionResult exceptions not empty
message : Failed to execute goal org.apache.maven.plugins:maven-compiler-plugin:2.3.2:compile
(default-compile) on project accumulo-server: Compilation failure
cause : Compilation failure
Stack trace : 
org.apache.maven.lifecycle.LifecycleExecutionException: Failed to execute goal org.apache.maven.plugins:maven-compiler-plugin:2.3.2:compile
(default-compile) on project accumulo-server: Compilation failure
	at org.apache.maven.lifecycle.internal.MojoExecutor.execute(MojoExecutor.java:213)
	at org.apache.maven.lifecycle.internal.MojoExecutor.execute(MojoExecutor.java:153)
	at org.apache.maven.lifecycle.internal.MojoExecutor.execute(MojoExecutor.java:145)
	at org.apache.maven.lifecycle.internal.LifecycleModuleBuilder.buildProject(LifecycleModuleBuilder.java:84)
	at org.apache.maven.lifecycle.internal.LifecycleModuleBuilder.buildProject(LifecycleModuleBuilder.java:59)
	at org.apache.maven.lifecycle.internal.LifecycleStarter.singleThreadedBuild(LifecycleStarter.java:183)
	at org.apache.maven.lifecycle.internal.LifecycleStarter.execute(LifecycleStarter.java:161)
	at org.apache.maven.DefaultMaven.doExecute(DefaultMaven.java:319)
	at org.apache.maven.DefaultMaven.execute(DefaultMaven.java:156)
	at org.jvnet.hudson.maven3.launcher.Maven3Launcher.main(Maven3Launcher.java:79)
	at sun.reflect.NativeMethodAccessorImpl.invoke0(Native Method)
	at sun.reflect.NativeMethodAccessorImpl.invoke(NativeMethodAccessorImpl.java:39)
	at sun.reflect.DelegatingMethodAccessorImpl.invoke(DelegatingMethodAccessorImpl.java:25)
	at java.lang.reflect.Method.invoke(Method.java:597)
	at org.codehaus.plexus.classworlds.launcher.Launcher.launchStandard(Launcher.java:329)
	at org.codehaus.plexus.classworlds.launcher.Launcher.launch(Launcher.java:239)
	at org.jvnet.hudson.maven3.agent.Maven3Main.launch(Maven3Main.java:158)
	at hudson.maven.Maven3Builder.call(Maven3Builder.java:98)
	at hudson.maven.Maven3Builder.call(Maven3Builder.java:64)
	at hudson.remoting.UserRequest.perform(UserRequest.java:118)
	at hudson.remoting.UserRequest.perform(UserRequest.java:48)
	at hudson.remoting.Request$2.run(Request.java:326)
	at hudson.remoting.InterceptingExecutorService$1.call(InterceptingExecutorService.java:72)
	at java.util.concurrent.FutureTask$Sync.innerRun(FutureTask.java:303)
	at java.util.concurrent.FutureTask.run(FutureTask.java:138)
	at java.util.concurrent.ThreadPoolExecutor$Worker.runTask(ThreadPoolExecutor.java:886)
	at java.util.concurrent.ThreadPoolExecutor$Worker.run(ThreadPoolExecutor.java:908)
	at java.lang.Thread.run(Thread.java:662)
Caused by: org.apache.maven.plugin.CompilationFailureException: Compilation failure
	at org.apache.maven.plugin.AbstractCompilerMojo.execute(AbstractCompilerMojo.java:656)
	at org.apache.maven.plugin.CompilerMojo.execute(CompilerMojo.java:128)
	at org.apache.maven.plugin.DefaultBuildPluginManager.executeMojo(DefaultBuildPluginManager.java:101)
	at org.apache.maven.lifecycle.internal.MojoExecutor.execute(MojoExecutor.java:209)
	... 27 more
Sending e-mails to: dev@accumulo.apache.org
channel stopped
Skipping Cobertura coverage report as build was not UNSTABLE or better ...

Mime
View raw message