accumulo-dev mailing list archives

Site index · List index
Message view « Date » · « Thread »
Top « Date » · « Thread »
From Apache Jenkins Server <jenk...@builds.apache.org>
Subject Build failed in Jenkins: Accumulo-1.4.x #239
Date Tue, 16 Oct 2012 14:07:12 GMT
See <https://builds.apache.org/job/Accumulo-1.4.x/239/changes>

Changes:

[kturner] ACCUMULO-784 applied patch from Chris McCubbin to fix bug in agitator

------------------------------------------
[...truncated 2066 lines...]
-------------------------------------------------------
 T E S T S
-------------------------------------------------------

[INFO] 
[INFO] --- maven-surefire-plugin:2.9:test (default-test) @ wikisearch-query ---
Running org.apache.accumulo.examples.wikisearch.logic.TestQueryLogic
Tests run: 1, Failures: 0, Errors: 0, Skipped: 0, Time elapsed: 0.977 sec
Flushing results...
Flushing results done
Cobertura: Loaded information on 61 classes.
Cobertura: Saved information on 61 classes.

Results :

Tests run: 1, Failures: 0, Errors: 0, Skipped: 0

mojoSucceeded org.apache.maven.plugins:maven-surefire-plugin:2.9(default-test)
[JENKINS] Recording test results
forkedProjectSucceeded org.apache.accumulo:wikisearch-query:1.4.2-SNAPSHOT
mojoStarted org.codehaus.mojo:cobertura-maven-plugin:2.5.2(default-cli)
[INFO] 
[INFO] --- cobertura-maven-plugin:2.5.2:cobertura (default-cli) @ wikisearch-query ---
[INFO] Cobertura 1.9.4.1 - GNU GPL License (NO WARRANTY) - See COPYRIGHT file
Cobertura: Loaded information on 61 classes.
Report time: 2531ms

[INFO] Cobertura Report generation was successful.
mojoSucceeded org.codehaus.mojo:cobertura-maven-plugin:2.5.2(default-cli)
projectSucceeded org.apache.accumulo:wikisearch-query:1.4.2-SNAPSHOT
projectStarted org.apache.accumulo:wikisearch-query-war:1.4.2-SNAPSHOT
[INFO]                                                                         
[INFO] ------------------------------------------------------------------------
[INFO] Building wikisearch-query-war 1.4.2-SNAPSHOT
[INFO] ------------------------------------------------------------------------
mojoStarted org.apache.maven.plugins:maven-clean-plugin:2.4.1(default-clean)[INFO] Deleting
<https://builds.apache.org/job/Accumulo-1.4.x/ws/1.4/src/examples/wikisearch/query-war/target>

[INFO] 
[INFO] --- maven-clean-plugin:2.4.1:clean (default-clean) @ wikisearch-query-war ---
mojoSucceeded org.apache.maven.plugins:maven-clean-plugin:2.4.1(default-clean)
mojoStarted org.apache.maven.plugins:maven-enforcer-plugin:1.0.1(enforce-mvn)
[INFO] 
[INFO] --- maven-enforcer-plugin:1.0.1:enforce (enforce-mvn) @ wikisearch-query-war ---
mojoSucceeded org.apache.maven.plugins:maven-enforcer-plugin:1.0.1(enforce-mvn)
mojoStarted org.apache.maven.plugins:maven-remote-resources-plugin:1.2.1(default)
[INFO] 
[INFO] --- maven-remote-resources-plugin:1.2.1:process (default) @ wikisearch-query-war ---
mojoSucceeded org.apache.maven.plugins:maven-remote-resources-plugin:1.2.1(default)
[debug] execute contextualize
mojoStarted org.apache.maven.plugins:maven-resources-plugin:2.5(default-resources)[INFO] Using
'UTF-8' encoding to copy filtered resources.
[INFO] skip non existing resourceDirectory <https://builds.apache.org/job/Accumulo-1.4.x/ws/1.4/src/examples/wikisearch/query-war/src/main/resources>
[INFO] Copying 3 resources

[INFO] 
[INFO] --- maven-resources-plugin:2.5:resources (default-resources) @ wikisearch-query-war
---
mojoSucceeded org.apache.maven.plugins:maven-resources-plugin:2.5(default-resources)
mojoStarted org.apache.maven.plugins:maven-compiler-plugin:2.3.2(default-compile)[INFO] No
sources to compile

[INFO] 
[INFO] --- maven-compiler-plugin:2.3.2:compile (default-compile) @ wikisearch-query-war ---
mojoSucceeded org.apache.maven.plugins:maven-compiler-plugin:2.3.2(default-compile)
[debug] execute contextualize
mojoStarted org.apache.maven.plugins:maven-resources-plugin:2.5(default-testResources)[INFO]
Using 'UTF-8' encoding to copy filtered resources.
[INFO] Copying 1 resource
[INFO] Copying 3 resources

[INFO] 
[INFO] --- maven-resources-plugin:2.5:testResources (default-testResources) @ wikisearch-query-war
---
mojoSucceeded org.apache.maven.plugins:maven-resources-plugin:2.5(default-testResources)
mojoStarted org.apache.maven.plugins:maven-compiler-plugin:2.3.2(default-testCompile)[INFO]
No sources to compile

[INFO] 
[INFO] --- maven-compiler-plugin:2.3.2:testCompile (default-testCompile) @ wikisearch-query-war
---
mojoSucceeded org.apache.maven.plugins:maven-compiler-plugin:2.3.2(default-testCompile)
mojoStarted org.apache.maven.plugins:maven-surefire-plugin:2.9(default-test)[INFO] Surefire
report directory: <https://builds.apache.org/job/Accumulo-1.4.x/ws/1.4/src/examples/wikisearch/query-war/target/surefire-reports>

-------------------------------------------------------
 T E S T S
-------------------------------------------------------

[INFO] 
[INFO] --- maven-surefire-plugin:2.9:test (default-test) @ wikisearch-query-war ---

Results :

Tests run: 0, Failures: 0, Errors: 0, Skipped: 0

mojoSucceeded org.apache.maven.plugins:maven-surefire-plugin:2.9(default-test)
[JENKINS] Recording test results
mojoStarted org.apache.maven.plugins:maven-war-plugin:2.1.1(default-war)
[INFO] 
[INFO] --- maven-war-plugin:2.1.1:war (default-war) @ wikisearch-query-war ---
[INFO] Packaging webapp
[INFO] Assembling webapp [wikisearch-query-war] in [<https://builds.apache.org/job/Accumulo-1.4.x/ws/1.4/src/examples/wikisearch/query-war/target/wikisearch-query-war-1.4.2-SNAPSHOT]>
[INFO] Processing war project
[INFO] Copying webapp resources [<https://builds.apache.org/job/Accumulo-1.4.x/ws/1.4/src/examples/wikisearch/query-war/src/main/webapp]>
[INFO] Webapp assembled in [48 msecs]
[INFO] Building war: <https://builds.apache.org/job/Accumulo-1.4.x/ws/1.4/src/examples/wikisearch/query-war/target/wikisearch-query-war-1.4.2-SNAPSHOT.war>
[INFO] WEB-INF/web.xml already added, skipping
mojoSucceeded org.apache.maven.plugins:maven-war-plugin:2.1.1(default-war)
mojoStarted org.apache.maven.plugins:maven-site-plugin:3.0(attach-descriptor)
[INFO] 
[INFO] --- maven-site-plugin:3.0:attach-descriptor (attach-descriptor) @ wikisearch-query-war
---
mojoSucceeded org.apache.maven.plugins:maven-site-plugin:3.0(attach-descriptor)
forkedProjectStarted org.apache.accumulo:wikisearch-query-war:1.4.2-SNAPSHOT
mojoStarted org.apache.maven.plugins:maven-enforcer-plugin:1.0.1(enforce-mvn)
[INFO] 
[INFO] --- maven-enforcer-plugin:1.0.1:enforce (enforce-mvn) @ wikisearch-query-war ---
mojoSucceeded org.apache.maven.plugins:maven-enforcer-plugin:1.0.1(enforce-mvn)
mojoStarted org.apache.maven.plugins:maven-remote-resources-plugin:1.2.1(default)
[INFO] 
[INFO] --- maven-remote-resources-plugin:1.2.1:process (default) @ wikisearch-query-war ---
mojoSucceeded org.apache.maven.plugins:maven-remote-resources-plugin:1.2.1(default)
[debug] execute contextualize
mojoStarted org.apache.maven.plugins:maven-resources-plugin:2.5(default-resources)[INFO] Using
'UTF-8' encoding to copy filtered resources.
[INFO] skip non existing resourceDirectory <https://builds.apache.org/job/Accumulo-1.4.x/ws/1.4/src/examples/wikisearch/query-war/src/main/resources>
[INFO] Copying 3 resources
[INFO] Copying 3 resources

[INFO] 
[INFO] --- maven-resources-plugin:2.5:resources (default-resources) @ wikisearch-query-war
---
mojoSucceeded org.apache.maven.plugins:maven-resources-plugin:2.5(default-resources)
mojoStarted org.apache.maven.plugins:maven-compiler-plugin:2.3.2(default-compile)[INFO] No
sources to compile

[INFO] 
[INFO] --- maven-compiler-plugin:2.3.2:compile (default-compile) @ wikisearch-query-war ---
mojoSucceeded org.apache.maven.plugins:maven-compiler-plugin:2.3.2(default-compile)
mojoStarted org.codehaus.mojo:cobertura-maven-plugin:2.5.2(default-cli)[WARNING] No files
to instrument.
[INFO] NOT adding cobertura ser file to attached artifacts list.

[INFO] 
[INFO] --- cobertura-maven-plugin:2.5.2:instrument (default-cli) @ wikisearch-query-war ---
mojoSucceeded org.codehaus.mojo:cobertura-maven-plugin:2.5.2(default-cli)
[debug] execute contextualize
mojoStarted org.apache.maven.plugins:maven-resources-plugin:2.5(default-testResources)[INFO]
Using 'UTF-8' encoding to copy filtered resources.
[INFO] Copying 1 resource
[INFO] Copying 3 resources
[INFO] Copying 3 resources

[INFO] 
[INFO] --- maven-resources-plugin:2.5:testResources (default-testResources) @ wikisearch-query-war
---
mojoSucceeded org.apache.maven.plugins:maven-resources-plugin:2.5(default-testResources)
mojoStarted org.apache.maven.plugins:maven-compiler-plugin:2.3.2(default-testCompile)[INFO]
No sources to compile

[INFO] 
[INFO] --- maven-compiler-plugin:2.3.2:testCompile (default-testCompile) @ wikisearch-query-war
---
mojoSucceeded org.apache.maven.plugins:maven-compiler-plugin:2.3.2(default-testCompile)
mojoStarted org.apache.maven.plugins:maven-surefire-plugin:2.9(default-test)[INFO] Surefire
report directory: <https://builds.apache.org/job/Accumulo-1.4.x/ws/1.4/src/examples/wikisearch/query-war/target/surefire-reports>

-------------------------------------------------------
 T E S T S
-------------------------------------------------------

[INFO] 
[INFO] --- maven-surefire-plugin:2.9:test (default-test) @ wikisearch-query-war ---

Results :

Tests run: 0, Failures: 0, Errors: 0, Skipped: 0

mojoSucceeded org.apache.maven.plugins:maven-surefire-plugin:2.9(default-test)
[JENKINS] Recording test results
forkedProjectSucceeded org.apache.accumulo:wikisearch-query-war:1.4.2-SNAPSHOT
mojoStarted org.codehaus.mojo:cobertura-maven-plugin:2.5.2(default-cli)
[INFO] 
[INFO] --- cobertura-maven-plugin:2.5.2:cobertura (default-cli) @ wikisearch-query-war ---
mojoSucceeded org.codehaus.mojo:cobertura-maven-plugin:2.5.2(default-cli)
projectSucceeded org.apache.accumulo:wikisearch-query-war:1.4.2-SNAPSHOT
sessionEnded
[INFO] ------------------------------------------------------------------------
[INFO] Reactor Summary:
[INFO] 
[INFO] accumulo .......................................... SUCCESS [24.111s]
[INFO] cloudtrace ........................................ SUCCESS [24.260s]
[INFO] accumulo-start .................................... SUCCESS [43.038s]
[INFO] accumulo-core ..................................... SUCCESS [1:56.806s]
[INFO] accumulo-server ................................... SUCCESS [32.214s]
[INFO] accumulo-examples ................................. SUCCESS [1.681s]
[INFO] examples-simple ................................... SUCCESS [12.129s]
[INFO] accumulo-wikisearch ............................... SUCCESS [1.591s]
[INFO] wikisearch-ingest ................................. SUCCESS [12.952s]
[INFO] wikisearch-query .................................. SUCCESS [15.051s]
[INFO] wikisearch-query-war .............................. SUCCESS [3.604s]
[INFO] ------------------------------------------------------------------------
[INFO] BUILD SUCCESS
[INFO] ------------------------------------------------------------------------
[INFO] Total time: 4:52.704s
[INFO] Finished at: Tue Oct 16 14:06:27 UTC 2012
[INFO] Final Memory: 88M/275M
[INFO] ------------------------------------------------------------------------
Projects to build: [MavenProject: org.apache.accumulo:accumulo:1.4.2-SNAPSHOT @ <https://builds.apache.org/job/Accumulo-1.4.x/ws/1.4/pom.xml,>
MavenProject: org.apache.accumulo:cloudtrace:1.4.2-SNAPSHOT @ <https://builds.apache.org/job/Accumulo-1.4.x/ws/1.4/src/trace/pom.xml,>
MavenProject: org.apache.accumulo:accumulo-start:1.4.2-SNAPSHOT @ <https://builds.apache.org/job/Accumulo-1.4.x/ws/1.4/src/start/pom.xml,>
MavenProject: org.apache.accumulo:accumulo-core:1.4.2-SNAPSHOT @ <https://builds.apache.org/job/Accumulo-1.4.x/ws/1.4/src/core/pom.xml,>
MavenProject: org.apache.accumulo:accumulo-server:1.4.2-SNAPSHOT @ <https://builds.apache.org/job/Accumulo-1.4.x/ws/1.4/src/server/pom.xml,>
MavenProject: org.apache.accumulo:accumulo-examples:1.4.2-SNAPSHOT @ <https://builds.apache.org/job/Accumulo-1.4.x/ws/1.4/src/examples/pom.xml,>
MavenProject: org.apache.accumulo:examples-simple:1.4.2-SNAPSHOT @ <https://builds.apache.org/job/Accumulo-1.4.x/ws/1.4/src/examples/simple/pom.xml,>
MavenProject: org.apache.accumulo:accumulo-wikisearch:1.4.2-SNAPSHOT @ <https://builds.apache.org/job/Accumulo-1.4.x/ws/1.4/src/examples/wikisearch/pom.xml,>
MavenProject: org.apache.accumulo:wikisearch-ingest:1.4.2-SNAPSHOT @ <https://builds.apache.org/job/Accumulo-1.4.x/ws/1.4/src/examples/wikisearch/ingest/pom.xml,>
MavenProject: org.apache.accumulo:wikisearch-query:1.4.2-SNAPSHOT @ <https://builds.apache.org/job/Accumulo-1.4.x/ws/1.4/src/examples/wikisearch/query/pom.xml,>
MavenProject: org.apache.accumulo:wikisearch-query-war:1.4.2-SNAPSHOT @ <https://builds.apache.org/job/Accumulo-1.4.x/ws/1.4/src/examples/wikisearch/query-war/pom.xml]>
[JENKINS] Archiving <https://builds.apache.org/job/Accumulo-1.4.x/ws/1.4/src/examples/wikisearch/ingest/pom.xml>
to /home/hudson/hudson/jobs/Accumulo-1.4.x/modules/org.apache.accumulo$wikisearch-ingest/builds/2012-10-16_14-01-22/archive/org.apache.accumulo/wikisearch-ingest/1.4.2-SNAPSHOT/wikisearch-ingest-1.4.2-SNAPSHOT.pom
[JENKINS] Archiving <https://builds.apache.org/job/Accumulo-1.4.x/ws/1.4/src/examples/wikisearch/ingest/lib/wikisearch-ingest-1.4.2-SNAPSHOT.jar>
to /home/hudson/hudson/jobs/Accumulo-1.4.x/modules/org.apache.accumulo$wikisearch-ingest/builds/2012-10-16_14-01-22/archive/org.apache.accumulo/wikisearch-ingest/1.4.2-SNAPSHOT/wikisearch-ingest-1.4.2-SNAPSHOT.jar
[JENKINS] Archiving <https://builds.apache.org/job/Accumulo-1.4.x/ws/1.4/src/server/pom.xml>
to /home/hudson/hudson/jobs/Accumulo-1.4.x/modules/org.apache.accumulo$accumulo-server/builds/2012-10-16_14-01-22/archive/org.apache.accumulo/accumulo-server/1.4.2-SNAPSHOT/accumulo-server-1.4.2-SNAPSHOT.pom
[JENKINS] Archiving <https://builds.apache.org/job/Accumulo-1.4.x/ws/1.4/lib/accumulo-server-1.4.2-SNAPSHOT.jar>
to /home/hudson/hudson/jobs/Accumulo-1.4.x/modules/org.apache.accumulo$accumulo-server/builds/2012-10-16_14-01-22/archive/org.apache.accumulo/accumulo-server/1.4.2-SNAPSHOT/accumulo-server-1.4.2-SNAPSHOT.jar
[JENKINS] Archiving <https://builds.apache.org/job/Accumulo-1.4.x/ws/1.4/src/trace/pom.xml>
to /home/hudson/hudson/jobs/Accumulo-1.4.x/modules/org.apache.accumulo$cloudtrace/builds/2012-10-16_14-01-22/archive/org.apache.accumulo/cloudtrace/1.4.2-SNAPSHOT/cloudtrace-1.4.2-SNAPSHOT.pom
[JENKINS] Archiving <https://builds.apache.org/job/Accumulo-1.4.x/ws/1.4/lib/cloudtrace-1.4.2-SNAPSHOT.jar>
to /home/hudson/hudson/jobs/Accumulo-1.4.x/modules/org.apache.accumulo$cloudtrace/builds/2012-10-16_14-01-22/archive/org.apache.accumulo/cloudtrace/1.4.2-SNAPSHOT/cloudtrace-1.4.2-SNAPSHOT.jar
[JENKINS] Archiving <https://builds.apache.org/job/Accumulo-1.4.x/ws/1.4/src/examples/pom.xml>
to /home/hudson/hudson/jobs/Accumulo-1.4.x/modules/org.apache.accumulo$accumulo-examples/builds/2012-10-16_14-01-22/archive/org.apache.accumulo/accumulo-examples/1.4.2-SNAPSHOT/accumulo-examples-1.4.2-SNAPSHOT.pom
[JENKINS] Archiving <https://builds.apache.org/job/Accumulo-1.4.x/ws/1.4/src/examples/wikisearch/query/pom.xml>
to /home/hudson/hudson/jobs/Accumulo-1.4.x/modules/org.apache.accumulo$wikisearch-query/builds/2012-10-16_14-01-22/archive/org.apache.accumulo/wikisearch-query/1.4.2-SNAPSHOT/wikisearch-query-1.4.2-SNAPSHOT.pom
[JENKINS] Archiving <https://builds.apache.org/job/Accumulo-1.4.x/ws/1.4/src/examples/wikisearch/query/target/wikisearch-query-1.4.2-SNAPSHOT.jar>
to /home/hudson/hudson/jobs/Accumulo-1.4.x/modules/org.apache.accumulo$wikisearch-query/builds/2012-10-16_14-01-22/archive/org.apache.accumulo/wikisearch-query/1.4.2-SNAPSHOT/wikisearch-query-1.4.2-SNAPSHOT.jar
[JENKINS] Archiving <https://builds.apache.org/job/Accumulo-1.4.x/ws/1.4/src/examples/simple/pom.xml>
to /home/hudson/hudson/jobs/Accumulo-1.4.x/modules/org.apache.accumulo$examples-simple/builds/2012-10-16_14-01-22/archive/org.apache.accumulo/examples-simple/1.4.2-SNAPSHOT/examples-simple-1.4.2-SNAPSHOT.pom
[JENKINS] Archiving <https://builds.apache.org/job/Accumulo-1.4.x/ws/1.4/lib/examples-simple-1.4.2-SNAPSHOT.jar>
to /home/hudson/hudson/jobs/Accumulo-1.4.x/modules/org.apache.accumulo$examples-simple/builds/2012-10-16_14-01-22/archive/org.apache.accumulo/examples-simple/1.4.2-SNAPSHOT/examples-simple-1.4.2-SNAPSHOT.jar
[JENKINS] Archiving <https://builds.apache.org/job/Accumulo-1.4.x/ws/1.4/pom.xml> to
/home/hudson/hudson/jobs/Accumulo-1.4.x/modules/org.apache.accumulo$accumulo/builds/2012-10-16_14-01-22/archive/org.apache.accumulo/accumulo/1.4.2-SNAPSHOT/accumulo-1.4.2-SNAPSHOT.pom
[JENKINS] Archiving <https://builds.apache.org/job/Accumulo-1.4.x/ws/1.4/src/start/pom.xml>
to /home/hudson/hudson/jobs/Accumulo-1.4.x/modules/org.apache.accumulo$accumulo-start/builds/2012-10-16_14-01-22/archive/org.apache.accumulo/accumulo-start/1.4.2-SNAPSHOT/accumulo-start-1.4.2-SNAPSHOT.pom
[JENKINS] Archiving <https://builds.apache.org/job/Accumulo-1.4.x/ws/1.4/lib/accumulo-start-1.4.2-SNAPSHOT.jar>
to /home/hudson/hudson/jobs/Accumulo-1.4.x/modules/org.apache.accumulo$accumulo-start/builds/2012-10-16_14-01-22/archive/org.apache.accumulo/accumulo-start/1.4.2-SNAPSHOT/accumulo-start-1.4.2-SNAPSHOT.jar
[JENKINS] Archiving <https://builds.apache.org/job/Accumulo-1.4.x/ws/1.4/src/examples/wikisearch/pom.xml>
to /home/hudson/hudson/jobs/Accumulo-1.4.x/modules/org.apache.accumulo$accumulo-wikisearch/builds/2012-10-16_14-01-22/archive/org.apache.accumulo/accumulo-wikisearch/1.4.2-SNAPSHOT/accumulo-wikisearch-1.4.2-SNAPSHOT.pom
[JENKINS] Archiving <https://builds.apache.org/job/Accumulo-1.4.x/ws/1.4/src/examples/wikisearch/query-war/pom.xml>
to /home/hudson/hudson/jobs/Accumulo-1.4.x/modules/org.apache.accumulo$wikisearch-query-war/builds/2012-10-16_14-01-22/archive/org.apache.accumulo/wikisearch-query-war/1.4.2-SNAPSHOT/wikisearch-query-war-1.4.2-SNAPSHOT.pom
[JENKINS] Archiving <https://builds.apache.org/job/Accumulo-1.4.x/ws/1.4/src/examples/wikisearch/query-war/target/wikisearch-query-war-1.4.2-SNAPSHOT.war>
to /home/hudson/hudson/jobs/Accumulo-1.4.x/modules/org.apache.accumulo$wikisearch-query-war/builds/2012-10-16_14-01-22/archive/org.apache.accumulo/wikisearch-query-war/1.4.2-SNAPSHOT/wikisearch-query-war-1.4.2-SNAPSHOT.war
[JENKINS] Archiving <https://builds.apache.org/job/Accumulo-1.4.x/ws/1.4/src/core/pom.xml>
to /home/hudson/hudson/jobs/Accumulo-1.4.x/modules/org.apache.accumulo$accumulo-core/builds/2012-10-16_14-01-22/archive/org.apache.accumulo/accumulo-core/1.4.2-SNAPSHOT/accumulo-core-1.4.2-SNAPSHOT.pom
[JENKINS] Archiving <https://builds.apache.org/job/Accumulo-1.4.x/ws/1.4/lib/accumulo-core-1.4.2-SNAPSHOT.jar>
to /home/hudson/hudson/jobs/Accumulo-1.4.x/modules/org.apache.accumulo$accumulo-core/builds/2012-10-16_14-01-22/archive/org.apache.accumulo/accumulo-core/1.4.2-SNAPSHOT/accumulo-core-1.4.2-SNAPSHOT.jar
Waiting for Jenkins to finish collecting data
channel stopped
Publishing Cobertura coverage report...
FATAL: Unable to find coverage results
hudson.util.IOException2: remote file operation failed: <https://builds.apache.org/job/Accumulo-1.4.x/ws/1.4>
at hudson.remoting.Channel@1abe219d:ubuntu2
	at hudson.FilePath.act(FilePath.java:838)
	at hudson.FilePath.act(FilePath.java:824)
	at hudson.plugins.cobertura.CoberturaPublisher.perform(CoberturaPublisher.java:335)
	at hudson.tasks.BuildStepMonitor$3.perform(BuildStepMonitor.java:36)
	at hudson.model.AbstractBuild$AbstractBuildExecution.perform(AbstractBuild.java:717)
	at hudson.model.AbstractBuild$AbstractBuildExecution.performAllBuildSteps(AbstractBuild.java:692)
	at hudson.maven.MavenModuleSetBuild$MavenModuleSetBuildExecution.post2(MavenModuleSetBuild.java:994)
	at hudson.model.AbstractBuild$AbstractBuildExecution.post(AbstractBuild.java:639)
	at hudson.model.Run.execute(Run.java:1527)
	at hudson.maven.MavenModuleSetBuild.run(MavenModuleSetBuild.java:477)
	at hudson.model.ResourceController.execute(ResourceController.java:88)
	at hudson.model.Executor.run(Executor.java:236)
Caused by: java.io.IOException: Unable to serialize hudson.FilePath$FileCallableWrapper@16af633a
	at hudson.remoting.UserRequest.serialize(UserRequest.java:166)
	at hudson.remoting.UserRequest.<init>(UserRequest.java:62)
	at hudson.remoting.Channel.call(Channel.java:663)
	at hudson.FilePath.act(FilePath.java:831)
	... 11 more
Caused by: java.io.NotSerializableException: hudson.plugins.cobertura.CoberturaPublisher
	at java.io.ObjectOutputStream.writeObject0(ObjectOutputStream.java:1180)
	at java.io.ObjectOutputStream.defaultWriteFields(ObjectOutputStream.java:1528)
	at java.io.ObjectOutputStream.writeSerialData(ObjectOutputStream.java:1493)
	at java.io.ObjectOutputStream.writeOrdinaryObject(ObjectOutputStream.java:1416)
	at java.io.ObjectOutputStream.writeObject0(ObjectOutputStream.java:1174)
	at java.io.ObjectOutputStream.defaultWriteFields(ObjectOutputStream.java:1528)
	at java.io.ObjectOutputStream.writeSerialData(ObjectOutputStream.java:1493)
	at java.io.ObjectOutputStream.writeOrdinaryObject(ObjectOutputStream.java:1416)
	at java.io.ObjectOutputStream.writeObject0(ObjectOutputStream.java:1174)
	at java.io.ObjectOutputStream.writeObject(ObjectOutputStream.java:346)
	at hudson.remoting.UserRequest._serialize(UserRequest.java:155)
	at hudson.remoting.UserRequest.serialize(UserRequest.java:164)
	... 14 more
No coverage results were found using the pattern '**/src/*/target/site/cobertura/coverage.xml'
relative to '<https://builds.apache.org/job/Accumulo-1.4.x/ws/1.4'.>  Did you enter
a pattern relative to the correct directory?  Did you generate the XML report(s) for Cobertura?
Build step 'Publish Cobertura Coverage Report' changed build result to FAILURE

Mime
View raw message