accumulo-dev mailing list archives

Site index · List index
Message view « Date » · « Thread »
Top « Date » · « Thread »
From Apache Jenkins Server <jenk...@builds.apache.org>
Subject Build failed in Jenkins: Accumulo-Trunk #522
Date Tue, 16 Oct 2012 14:06:59 GMT
See <https://builds.apache.org/job/Accumulo-Trunk/522/changes>

Changes:

[kturner] ACCUMULO-784 commiting prop changes from merge

[kturner] ACCUMULO-784 applied patch from Chris McCubbin to fix bug in agitator (merged from
1.4)

------------------------------------------
[...truncated 3774 lines...]
mojoStarted org.apache.maven.plugins:maven-remote-resources-plugin:1.2.1(default)
[INFO] 
[INFO] --- maven-remote-resources-plugin:1.2.1:process (default) @ examples-simple ---
mojoSucceeded org.apache.maven.plugins:maven-remote-resources-plugin:1.2.1(default)
mojoStarted org.apache.maven.plugins:maven-resources-plugin:2.5(default-resources)[debug]
execute contextualize
[INFO] Using 'UTF-8' encoding to copy filtered resources.
[INFO] skip non existing resourceDirectory <https://builds.apache.org/job/Accumulo-Trunk/ws/accumulo-trunk/examples/simple/src/main/resources>
[INFO] Copying 3 resources
[INFO] Copying 3 resources

[INFO] 
[INFO] --- maven-resources-plugin:2.5:resources (default-resources) @ examples-simple ---
mojoSucceeded org.apache.maven.plugins:maven-resources-plugin:2.5(default-resources)
[INFO] log4j-1.2.16.jar already exists in destination.
mojoStarted org.apache.maven.plugins:maven-dependency-plugin:2.3(copy-dependencies)
[INFO] 
[INFO] --- maven-dependency-plugin:2.3:copy-dependencies (copy-dependencies) @ examples-simple
---
mojoSucceeded org.apache.maven.plugins:maven-dependency-plugin:2.3(copy-dependencies)
mojoStarted org.apache.maven.plugins:maven-compiler-plugin:2.3.2(default-compile)[INFO] Nothing
to compile - all classes are up to date

[INFO] 
[INFO] --- maven-compiler-plugin:2.3.2:compile (default-compile) @ examples-simple ---
mojoSucceeded org.apache.maven.plugins:maven-compiler-plugin:2.3.2(default-compile)
mojoStarted org.codehaus.mojo:cobertura-maven-plugin:2.5.2(default-cli)
[INFO] 
[INFO] --- cobertura-maven-plugin:2.5.2:instrument (default-cli) @ examples-simple ---
[INFO] Cobertura 1.9.4.1 - GNU GPL License (NO WARRANTY) - See COPYRIGHT file
Instrumenting 62 files to <https://builds.apache.org/job/Accumulo-Trunk/ws/accumulo-trunk/examples/simple/target/generated-classes/cobertura>
[cobertura] WARN  [main] net.sourceforge.cobertura.instrument.ClassInstrumenter - No line
number information found for class org.apache.accumulo.examples.simple.dirlist.FileCount$1.
 Perhaps you need to compile with debug=true?
Cobertura: Saved information on 62 classes.
Instrument time: 384ms

[INFO] Instrumentation was successful.
[INFO] NOT adding cobertura ser file to attached artifacts list.
mojoSucceeded org.codehaus.mojo:cobertura-maven-plugin:2.5.2(default-cli)
[debug] execute contextualize
mojoStarted org.apache.maven.plugins:maven-resources-plugin:2.5(default-testResources)[INFO]
Using 'UTF-8' encoding to copy filtered resources.
[INFO] skip non existing resourceDirectory <https://builds.apache.org/job/Accumulo-Trunk/ws/accumulo-trunk/examples/simple/src/test/resources>
[INFO] Copying 3 resources
[INFO] Copying 3 resources

[INFO] 
[INFO] --- maven-resources-plugin:2.5:testResources (default-testResources) @ examples-simple
---
mojoSucceeded org.apache.maven.plugins:maven-resources-plugin:2.5(default-testResources)
mojoStarted org.apache.maven.plugins:maven-compiler-plugin:2.3.2(default-testCompile)[INFO]
Nothing to compile - all classes are up to date

[INFO] 
[INFO] --- maven-compiler-plugin:2.3.2:testCompile (default-testCompile) @ examples-simple
---
mojoSucceeded org.apache.maven.plugins:maven-compiler-plugin:2.3.2(default-testCompile)
mojoStarted org.apache.maven.plugins:maven-surefire-plugin:2.12(default-test)[INFO] Surefire
report directory: <https://builds.apache.org/job/Accumulo-Trunk/ws/accumulo-trunk/examples/simple/target/surefire-reports>

-------------------------------------------------------
 T E S T S
-------------------------------------------------------

[INFO] 
[INFO] --- maven-surefire-plugin:2.12:test (default-test) @ examples-simple ---
Running org.apache.accumulo.examples.simple.dirlist.CountTest
Max depth              : 3
Time to find max depth : 3 ms
Time to compute counts : 5 ms
Entries scanned        : 30 
Counts inserted        : 4 
Tests run: 1, Failures: 0, Errors: 0, Skipped: 0, Time elapsed: 0.473 sec
Running org.apache.accumulo.examples.simple.filedata.ChunkInputFormatTest
12/10/16 14:06:16 WARN util.NativeCodeLoader: Unable to load native-hadoop library for your
platform... using builtin-java classes where applicable
Tests run: 3, Failures: 0, Errors: 0, Skipped: 0, Time elapsed: 0.125 sec
Running org.apache.accumulo.examples.simple.filedata.ChunkCombinerTest
Tests run: 1, Failures: 0, Errors: 0, Skipped: 0, Time elapsed: 0.023 sec
Running org.apache.accumulo.examples.simple.filedata.ChunkInputStreamTest
Tests run: 9, Failures: 0, Errors: 0, Skipped: 0, Time elapsed: 0.067 sec
Running org.apache.accumulo.examples.simple.filedata.KeyUtilTest
Tests run: 1, Failures: 0, Errors: 0, Skipped: 0, Time elapsed: 0.001 sec
Flushing results...
Flushing results done
Cobertura: Loaded information on 62 classes.
Cobertura: Saved information on 62 classes.

Results :

Tests run: 15, Failures: 0, Errors: 0, Skipped: 0

mojoSucceeded org.apache.maven.plugins:maven-surefire-plugin:2.12(default-test)
[JENKINS] Recording test results
forkedProjectSucceeded org.apache.accumulo:examples-simple:1.5.0-SNAPSHOT
mojoStarted org.codehaus.mojo:cobertura-maven-plugin:2.5.2(default-cli)
[INFO] 
[INFO] --- cobertura-maven-plugin:2.5.2:cobertura (default-cli) @ examples-simple ---
[INFO] Cobertura 1.9.4.1 - GNU GPL License (NO WARRANTY) - See COPYRIGHT file
Cobertura: Loaded information on 62 classes.
Report time: 1347ms

[INFO] Cobertura Report generation was successful.
mojoSucceeded org.codehaus.mojo:cobertura-maven-plugin:2.5.2(default-cli)
projectSucceeded org.apache.accumulo:examples-simple:1.5.0-SNAPSHOT
projectStarted org.apache.accumulo:accumulo-assemble:1.5.0-SNAPSHOT
[INFO] [INFO] Deleting <https://builds.apache.org/job/Accumulo-Trunk/ws/accumulo-trunk/assemble>
(includes = [**/*.pyc], excludes = [])
                                                                        
[INFO] ------------------------------------------------------------------------
[INFO] Building accumulo-assemble 1.5.0-SNAPSHOT
[INFO] ------------------------------------------------------------------------
mojoStarted org.apache.maven.plugins:maven-clean-plugin:2.4.1(default-clean)
[INFO] 
[INFO] --- maven-clean-plugin:2.4.1:clean (default-clean) @ accumulo-assemble ---
mojoSucceeded org.apache.maven.plugins:maven-clean-plugin:2.4.1(default-clean)
mojoStarted org.codehaus.mojo:buildnumber-maven-plugin:1.1(default)[INFO] Checking for local
modifications: skipped.
[INFO] Updating project files from SCM: skipped.
[INFO] Executing: /bin/sh -c cd <https://builds.apache.org/job/Accumulo-Trunk/ws/accumulo-trunk/assemble>
&& svn --non-interactive info
[INFO] Working directory: <https://builds.apache.org/job/Accumulo-Trunk/ws/accumulo-trunk/assemble>
[INFO] Storing buildNumber: 1398805 at timestamp: 1350396379719
[INFO] Executing: /bin/sh -c cd <https://builds.apache.org/job/Accumulo-Trunk/ws/accumulo-trunk/assemble>
&& svn --non-interactive info
[INFO] Working directory: <https://builds.apache.org/job/Accumulo-Trunk/ws/accumulo-trunk/assemble>
[INFO] Storing buildScmBranch: trunk

[INFO] 
[INFO] --- buildnumber-maven-plugin:1.1:create (default) @ accumulo-assemble ---
mojoSucceeded org.codehaus.mojo:buildnumber-maven-plugin:1.1(default)
mojoStarted org.apache.maven.plugins:maven-enforcer-plugin:1.0.1(enforce-mvn)
[INFO] 
[INFO] --- maven-enforcer-plugin:1.0.1:enforce (enforce-mvn) @ accumulo-assemble ---
mojoSucceeded org.apache.maven.plugins:maven-enforcer-plugin:1.0.1(enforce-mvn)
mojoStarted org.apache.maven.plugins:maven-remote-resources-plugin:1.2.1(default)
[INFO] 
[INFO] --- maven-remote-resources-plugin:1.2.1:process (default) @ accumulo-assemble ---
mojoSucceeded org.apache.maven.plugins:maven-remote-resources-plugin:1.2.1(default)
mojoStarted org.apache.maven.plugins:maven-dependency-plugin:2.3(copy-dependencies)
[INFO] 
[INFO] --- maven-dependency-plugin:2.3:copy-dependencies (copy-dependencies) @ accumulo-assemble
---
mojoSucceeded org.apache.maven.plugins:maven-dependency-plugin:2.3(copy-dependencies)
mojoStarted org.apache.maven.plugins:maven-site-plugin:3.0(attach-descriptor)
[INFO] 
[INFO] --- maven-site-plugin:3.0:attach-descriptor (attach-descriptor) @ accumulo-assemble
---
mojoSucceeded org.apache.maven.plugins:maven-site-plugin:3.0(attach-descriptor)
mojoStarted org.codehaus.mojo:exec-maven-plugin:1.2.1(config webpage)
[INFO] 
[INFO] --- exec-maven-plugin:1.2.1:exec (config webpage) @ accumulo-assemble ---
mojoSucceeded org.codehaus.mojo:exec-maven-plugin:1.2.1(config webpage)
forkedProjectStarted org.apache.accumulo:accumulo-assemble:1.5.0-SNAPSHOT[INFO] Checking for
local modifications: skipped.
[INFO] Updating project files from SCM: skipped.
[INFO] Executing: /bin/sh -c cd <https://builds.apache.org/job/Accumulo-Trunk/ws/accumulo-trunk/assemble>
&& svn --non-interactive info
[INFO] Working directory: <https://builds.apache.org/job/Accumulo-Trunk/ws/accumulo-trunk/assemble>
[INFO] Storing buildNumber: 1398805 at timestamp: 1350396380856
[INFO] Executing: /bin/sh -c cd <https://builds.apache.org/job/Accumulo-Trunk/ws/accumulo-trunk/assemble>
&& svn --non-interactive info
[INFO] Working directory: <https://builds.apache.org/job/Accumulo-Trunk/ws/accumulo-trunk/assemble>

[INFO] Storing buildScmBranch: trunk
mojoStarted org.codehaus.mojo:buildnumber-maven-plugin:1.1(default)
[INFO] 
[INFO] --- buildnumber-maven-plugin:1.1:create (default) @ accumulo-assemble ---
mojoSucceeded org.codehaus.mojo:buildnumber-maven-plugin:1.1(default)
mojoStarted org.apache.maven.plugins:maven-enforcer-plugin:1.0.1(enforce-mvn)
[INFO] 
[INFO] --- maven-enforcer-plugin:1.0.1:enforce (enforce-mvn) @ accumulo-assemble ---
mojoSucceeded org.apache.maven.plugins:maven-enforcer-plugin:1.0.1(enforce-mvn)
mojoStarted org.apache.maven.plugins:maven-remote-resources-plugin:1.2.1(default)
[INFO] 
[INFO] --- maven-remote-resources-plugin:1.2.1:process (default) @ accumulo-assemble ---
mojoSucceeded org.apache.maven.plugins:maven-remote-resources-plugin:1.2.1(default)
mojoStarted org.apache.maven.plugins:maven-dependency-plugin:2.3(copy-dependencies)
[INFO] 
[INFO] --- maven-dependency-plugin:2.3:copy-dependencies (copy-dependencies) @ accumulo-assemble
---
mojoSucceeded org.apache.maven.plugins:maven-dependency-plugin:2.3(copy-dependencies)
mojoStarted org.codehaus.mojo:cobertura-maven-plugin:2.5.2(default-cli)[INFO] Skipping cobertura
mojo for project with packaging type 'pom'

[INFO] 
[INFO] --- cobertura-maven-plugin:2.5.2:instrument (default-cli) @ accumulo-assemble ---
mojoSucceeded org.codehaus.mojo:cobertura-maven-plugin:2.5.2(default-cli)
forkedProjectSucceeded org.apache.accumulo:accumulo-assemble:1.5.0-SNAPSHOT
mojoStarted org.codehaus.mojo:cobertura-maven-plugin:2.5.2(default-cli)
[INFO] 
[INFO] --- cobertura-maven-plugin:2.5.2:cobertura (default-cli) @ accumulo-assemble ---
mojoSucceeded org.codehaus.mojo:cobertura-maven-plugin:2.5.2(default-cli)
projectSucceeded org.apache.accumulo:accumulo-assemble:1.5.0-SNAPSHOT
sessionEnded
[INFO] ------------------------------------------------------------------------
[INFO] Reactor Summary:
[INFO] 
[INFO] accumulo .......................................... SUCCESS [21.647s]
[INFO] cloudtrace ........................................ SUCCESS [24.609s]
[INFO] accumulo-start .................................... SUCCESS [44.227s]
[INFO] accumulo-fate ..................................... SUCCESS [7.534s]
[INFO] accumulo-core ..................................... SUCCESS [1:45.640s]
[INFO] accumulo-server ................................... SUCCESS [29.609s]
[INFO] accumulo-examples ................................. SUCCESS [2.008s]
[INFO] examples-simple ................................... SUCCESS [12.857s]
[INFO] accumulo-assemble ................................. SUCCESS [2.426s]
[INFO] ------------------------------------------------------------------------
[INFO] BUILD SUCCESS
[INFO] ------------------------------------------------------------------------
[INFO] Total time: 4:15.748s
[INFO] Finished at: Tue Oct 16 14:06:21 UTC 2012
[INFO] Final Memory: 77M/280M
[INFO] ------------------------------------------------------------------------
Projects to build: [MavenProject: org.apache.accumulo:accumulo:1.5.0-SNAPSHOT @ <https://builds.apache.org/job/Accumulo-Trunk/ws/accumulo-trunk/pom.xml,>
MavenProject: org.apache.accumulo:cloudtrace:1.5.0-SNAPSHOT @ <https://builds.apache.org/job/Accumulo-Trunk/ws/accumulo-trunk/trace/pom.xml,>
MavenProject: org.apache.accumulo:accumulo-start:1.5.0-SNAPSHOT @ <https://builds.apache.org/job/Accumulo-Trunk/ws/accumulo-trunk/start/pom.xml,>
MavenProject: org.apache.accumulo:accumulo-fate:1.5.0-SNAPSHOT @ <https://builds.apache.org/job/Accumulo-Trunk/ws/accumulo-trunk/fate/pom.xml,>
MavenProject: org.apache.accumulo:accumulo-core:1.5.0-SNAPSHOT @ <https://builds.apache.org/job/Accumulo-Trunk/ws/accumulo-trunk/core/pom.xml,>
MavenProject: org.apache.accumulo:accumulo-server:1.5.0-SNAPSHOT @ <https://builds.apache.org/job/Accumulo-Trunk/ws/accumulo-trunk/server/pom.xml,>
MavenProject: org.apache.accumulo:accumulo-examples:1.5.0-SNAPSHOT @ <https://builds.apache.org/job/Accumulo-Trunk/ws/accumulo-trunk/examples/pom.xml,>
MavenProject: org.apache.accumulo:examples-simple:1.5.0-SNAPSHOT @ <https://builds.apache.org/job/Accumulo-Trunk/ws/accumulo-trunk/examples/simple/pom.xml,>
MavenProject: org.apache.accumulo:accumulo-assemble:1.5.0-SNAPSHOT @ <https://builds.apache.org/job/Accumulo-Trunk/ws/accumulo-trunk/assemble/pom.xml]>
[JENKINS] Archiving <https://builds.apache.org/job/Accumulo-Trunk/ws/accumulo-trunk/assemble/pom.xml>
to /home/hudson/hudson/jobs/Accumulo-Trunk/modules/org.apache.accumulo$accumulo-assemble/builds/2012-10-16_14-01-49/archive/org.apache.accumulo/accumulo-assemble/1.5.0-SNAPSHOT/accumulo-assemble-1.5.0-SNAPSHOT.pom
[JENKINS] Archiving <https://builds.apache.org/job/Accumulo-Trunk/ws/accumulo-trunk/server/pom.xml>
to /home/hudson/hudson/jobs/Accumulo-Trunk/modules/org.apache.accumulo$accumulo-server/builds/2012-10-16_14-01-49/archive/org.apache.accumulo/accumulo-server/1.5.0-SNAPSHOT/accumulo-server-1.5.0-SNAPSHOT.pom
[JENKINS] Archiving <https://builds.apache.org/job/Accumulo-Trunk/ws/accumulo-trunk/lib/accumulo-server-1.5.0-SNAPSHOT.jar>
to /home/hudson/hudson/jobs/Accumulo-Trunk/modules/org.apache.accumulo$accumulo-server/builds/2012-10-16_14-01-49/archive/org.apache.accumulo/accumulo-server/1.5.0-SNAPSHOT/accumulo-server-1.5.0-SNAPSHOT.jar
[JENKINS] Archiving <https://builds.apache.org/job/Accumulo-Trunk/ws/accumulo-trunk/trace/pom.xml>
to /home/hudson/hudson/jobs/Accumulo-Trunk/modules/org.apache.accumulo$cloudtrace/builds/2012-10-16_14-01-49/archive/org.apache.accumulo/cloudtrace/1.5.0-SNAPSHOT/cloudtrace-1.5.0-SNAPSHOT.pom
[JENKINS] Archiving <https://builds.apache.org/job/Accumulo-Trunk/ws/accumulo-trunk/lib/cloudtrace-1.5.0-SNAPSHOT.jar>
to /home/hudson/hudson/jobs/Accumulo-Trunk/modules/org.apache.accumulo$cloudtrace/builds/2012-10-16_14-01-49/archive/org.apache.accumulo/cloudtrace/1.5.0-SNAPSHOT/cloudtrace-1.5.0-SNAPSHOT.jar
[JENKINS] Archiving <https://builds.apache.org/job/Accumulo-Trunk/ws/accumulo-trunk/examples/pom.xml>
to /home/hudson/hudson/jobs/Accumulo-Trunk/modules/org.apache.accumulo$accumulo-examples/builds/2012-10-16_14-01-49/archive/org.apache.accumulo/accumulo-examples/1.5.0-SNAPSHOT/accumulo-examples-1.5.0-SNAPSHOT.pom
[JENKINS] Archiving <https://builds.apache.org/job/Accumulo-Trunk/ws/accumulo-trunk/examples/simple/pom.xml>
to /home/hudson/hudson/jobs/Accumulo-Trunk/modules/org.apache.accumulo$examples-simple/builds/2012-10-16_14-01-49/archive/org.apache.accumulo/examples-simple/1.5.0-SNAPSHOT/examples-simple-1.5.0-SNAPSHOT.pom
[JENKINS] Archiving <https://builds.apache.org/job/Accumulo-Trunk/ws/accumulo-trunk/lib/examples-simple-1.5.0-SNAPSHOT.jar>
to /home/hudson/hudson/jobs/Accumulo-Trunk/modules/org.apache.accumulo$examples-simple/builds/2012-10-16_14-01-49/archive/org.apache.accumulo/examples-simple/1.5.0-SNAPSHOT/examples-simple-1.5.0-SNAPSHOT.jar
[JENKINS] Archiving <https://builds.apache.org/job/Accumulo-Trunk/ws/accumulo-trunk/pom.xml>
to /home/hudson/hudson/jobs/Accumulo-Trunk/modules/org.apache.accumulo$accumulo/builds/2012-10-16_14-01-48/archive/org.apache.accumulo/accumulo/1.5.0-SNAPSHOT/accumulo-1.5.0-SNAPSHOT.pom
[JENKINS] Archiving <https://builds.apache.org/job/Accumulo-Trunk/ws/accumulo-trunk/target/accumulo-1.5.0-SNAPSHOT-site.xml>
to /home/hudson/hudson/jobs/Accumulo-Trunk/modules/org.apache.accumulo$accumulo/builds/2012-10-16_14-01-48/archive/org.apache.accumulo/accumulo/1.5.0-SNAPSHOT/accumulo-1.5.0-SNAPSHOT-site.xml
[JENKINS] Archiving <https://builds.apache.org/job/Accumulo-Trunk/ws/accumulo-trunk/start/pom.xml>
to /home/hudson/hudson/jobs/Accumulo-Trunk/modules/org.apache.accumulo$accumulo-start/builds/2012-10-16_14-01-49/archive/org.apache.accumulo/accumulo-start/1.5.0-SNAPSHOT/accumulo-start-1.5.0-SNAPSHOT.pom
[JENKINS] Archiving <https://builds.apache.org/job/Accumulo-Trunk/ws/accumulo-trunk/lib/accumulo-start-1.5.0-SNAPSHOT.jar>
to /home/hudson/hudson/jobs/Accumulo-Trunk/modules/org.apache.accumulo$accumulo-start/builds/2012-10-16_14-01-49/archive/org.apache.accumulo/accumulo-start/1.5.0-SNAPSHOT/accumulo-start-1.5.0-SNAPSHOT.jar
[JENKINS] Archiving <https://builds.apache.org/job/Accumulo-Trunk/ws/accumulo-trunk/fate/pom.xml>
to /home/hudson/hudson/jobs/Accumulo-Trunk/modules/org.apache.accumulo$accumulo-fate/builds/2012-10-16_14-01-49/archive/org.apache.accumulo/accumulo-fate/1.5.0-SNAPSHOT/accumulo-fate-1.5.0-SNAPSHOT.pom
[JENKINS] Archiving <https://builds.apache.org/job/Accumulo-Trunk/ws/accumulo-trunk/lib/accumulo-fate-1.5.0-SNAPSHOT.jar>
to /home/hudson/hudson/jobs/Accumulo-Trunk/modules/org.apache.accumulo$accumulo-fate/builds/2012-10-16_14-01-49/archive/org.apache.accumulo/accumulo-fate/1.5.0-SNAPSHOT/accumulo-fate-1.5.0-SNAPSHOT.jar
[JENKINS] Archiving <https://builds.apache.org/job/Accumulo-Trunk/ws/accumulo-trunk/core/pom.xml>
to /home/hudson/hudson/jobs/Accumulo-Trunk/modules/org.apache.accumulo$accumulo-core/builds/2012-10-16_14-01-49/archive/org.apache.accumulo/accumulo-core/1.5.0-SNAPSHOT/accumulo-core-1.5.0-SNAPSHOT.pom
[JENKINS] Archiving <https://builds.apache.org/job/Accumulo-Trunk/ws/accumulo-trunk/lib/accumulo-core-1.5.0-SNAPSHOT.jar>
to /home/hudson/hudson/jobs/Accumulo-Trunk/modules/org.apache.accumulo$accumulo-core/builds/2012-10-16_14-01-49/archive/org.apache.accumulo/accumulo-core/1.5.0-SNAPSHOT/accumulo-core-1.5.0-SNAPSHOT.jar
Waiting for Jenkins to finish collecting data
channel stopped
Publishing Cobertura coverage report...
FATAL: Unable to find coverage results
hudson.util.IOException2: remote file operation failed: <https://builds.apache.org/job/Accumulo-Trunk/ws/accumulo-trunk>
at hudson.remoting.Channel@3e17967b:ubuntu4
	at hudson.FilePath.act(FilePath.java:838)
	at hudson.FilePath.act(FilePath.java:824)
	at hudson.plugins.cobertura.CoberturaPublisher.perform(CoberturaPublisher.java:335)
	at hudson.tasks.BuildStepMonitor$3.perform(BuildStepMonitor.java:36)
	at hudson.model.AbstractBuild$AbstractBuildExecution.perform(AbstractBuild.java:717)
	at hudson.model.AbstractBuild$AbstractBuildExecution.performAllBuildSteps(AbstractBuild.java:692)
	at hudson.maven.MavenModuleSetBuild$MavenModuleSetBuildExecution.post2(MavenModuleSetBuild.java:994)
	at hudson.model.AbstractBuild$AbstractBuildExecution.post(AbstractBuild.java:639)
	at hudson.model.Run.execute(Run.java:1527)
	at hudson.maven.MavenModuleSetBuild.run(MavenModuleSetBuild.java:477)
	at hudson.model.ResourceController.execute(ResourceController.java:88)
	at hudson.model.Executor.run(Executor.java:236)
Caused by: java.io.IOException: Unable to serialize hudson.FilePath$FileCallableWrapper@188a9836
	at hudson.remoting.UserRequest.serialize(UserRequest.java:166)
	at hudson.remoting.UserRequest.<init>(UserRequest.java:62)
	at hudson.remoting.Channel.call(Channel.java:663)
	at hudson.FilePath.act(FilePath.java:831)
	... 11 more
Caused by: java.io.NotSerializableException: hudson.plugins.cobertura.CoberturaPublisher
	at java.io.ObjectOutputStream.writeObject0(ObjectOutputStream.java:1180)
	at java.io.ObjectOutputStream.defaultWriteFields(ObjectOutputStream.java:1528)
	at java.io.ObjectOutputStream.writeSerialData(ObjectOutputStream.java:1493)
	at java.io.ObjectOutputStream.writeOrdinaryObject(ObjectOutputStream.java:1416)
	at java.io.ObjectOutputStream.writeObject0(ObjectOutputStream.java:1174)
	at java.io.ObjectOutputStream.defaultWriteFields(ObjectOutputStream.java:1528)
	at java.io.ObjectOutputStream.writeSerialData(ObjectOutputStream.java:1493)
	at java.io.ObjectOutputStream.writeOrdinaryObject(ObjectOutputStream.java:1416)
	at java.io.ObjectOutputStream.writeObject0(ObjectOutputStream.java:1174)
	at java.io.ObjectOutputStream.writeObject(ObjectOutputStream.java:346)
	at hudson.remoting.UserRequest._serialize(UserRequest.java:155)
	at hudson.remoting.UserRequest.serialize(UserRequest.java:164)
	... 14 more
No coverage results were found using the pattern '**/*/target/site/cobertura/coverage.xml'
relative to '<https://builds.apache.org/job/Accumulo-Trunk/ws/accumulo-trunk'.>  Did
you enter a pattern relative to the correct directory?  Did you generate the XML report(s)
for Cobertura?
Build step 'Publish Cobertura Coverage Report' changed build result to FAILURE

Mime
View raw message