accumulo-dev mailing list archives

Site index · List index
Message view « Date » · « Thread »
Top « Date » · « Thread »
From Apache Jenkins Server <jenk...@builds.apache.org>
Subject Build failed in Jenkins: Accumulo-Trunk #419
Date Wed, 11 Jul 2012 11:31:14 GMT
See <https://builds.apache.org/job/Accumulo-Trunk/419/changes>

Changes:

[jtrost] ACCUMULO-685 fixed minimum stack size in all example accumulo-env.sh's

------------------------------------------
[...truncated 3051 lines...]
Running org.apache.accumulo.core.client.mapreduce.AccumuloRowInputFormatTest
Tests run: 1, Failures: 0, Errors: 0, Skipped: 0, Time elapsed: 0.042 sec
Running org.apache.accumulo.core.client.mapreduce.lib.partition.RangePartitionerTest
Tests run: 2, Failures: 0, Errors: 0, Skipped: 0, Time elapsed: 0.725 sec
Running org.apache.accumulo.core.client.mapreduce.AccumuloInputFormatTest
Tests run: 10, Failures: 0, Errors: 0, Skipped: 0, Time elapsed: 0.143 sec
Running org.apache.accumulo.core.client.impl.ScannerOptionsTest
Tests run: 2, Failures: 0, Errors: 0, Skipped: 0, Time elapsed: 0.002 sec
Running org.apache.accumulo.core.client.impl.TabletLocatorImplTest
Tests run: 16, Failures: 0, Errors: 0, Skipped: 0, Time elapsed: 0.076 sec
Running org.apache.accumulo.core.client.admin.TableOperationsHelperTest
Tests run: 1, Failures: 0, Errors: 0, Skipped: 0, Time elapsed: 0.004 sec
Running org.apache.accumulo.core.client.admin.FindMaxTest
Tests run: 1, Failures: 0, Errors: 0, Skipped: 0, Time elapsed: 19.799 sec
Running org.apache.accumulo.core.iterators.system.DeletingIteratorTest
Tests run: 4, Failures: 0, Errors: 0, Skipped: 0, Time elapsed: 0.005 sec
Running org.apache.accumulo.core.iterators.system.MultiIteratorTest
Tests run: 7, Failures: 0, Errors: 0, Skipped: 0, Time elapsed: 0.901 sec
Running org.apache.accumulo.core.iterators.system.SourceSwitchingIteratorTest
Tests run: 5, Failures: 0, Errors: 0, Skipped: 0, Time elapsed: 0.022 sec
Running org.apache.accumulo.core.iterators.system.ColumnFilterTest
Tests run: 3, Failures: 0, Errors: 0, Skipped: 0, Time elapsed: 0.002 sec
Running org.apache.accumulo.core.iterators.system.ColumnFamilySkippingIteratorTest
Tests run: 3, Failures: 0, Errors: 0, Skipped: 0, Time elapsed: 7.656 sec
Running org.apache.accumulo.core.iterators.system.TimeSettingIteratorTest
Tests run: 1, Failures: 0, Errors: 0, Skipped: 0, Time elapsed: 0.003 sec
Running org.apache.accumulo.core.iterators.user.RowDeletingIteratorTest
Tests run: 4, Failures: 0, Errors: 0, Skipped: 0, Time elapsed: 0.007 sec
Running org.apache.accumulo.core.iterators.user.GrepIteratorTest
Tests run: 1, Failures: 0, Errors: 0, Skipped: 0, Time elapsed: 0.004 sec
Running org.apache.accumulo.core.iterators.user.FilterTest
Tests run: 11, Failures: 0, Errors: 0, Skipped: 0, Time elapsed: 0.503 sec
Running org.apache.accumulo.core.iterators.user.WholeRowIteratorTest
Tests run: 3, Failures: 0, Errors: 0, Skipped: 0, Time elapsed: 0.013 sec
Running org.apache.accumulo.core.iterators.user.RegExFilterTest
Tests run: 1, Failures: 0, Errors: 0, Skipped: 0, Time elapsed: 0.007 sec
Running org.apache.accumulo.core.iterators.user.LargeRowFilterTest
Tests run: 5, Failures: 0, Errors: 0, Skipped: 0, Time elapsed: 0.569 sec
Running org.apache.accumulo.core.iterators.user.IntersectingIteratorTest
Tests run: 6, Failures: 0, Errors: 0, Skipped: 0, Time elapsed: 11.35 sec
Running org.apache.accumulo.core.iterators.user.VersioningIteratorTest
Tests run: 6, Failures: 0, Errors: 0, Skipped: 0, Time elapsed: 0.044 sec
Running org.apache.accumulo.core.iterators.user.CombinerTest
Tests run: 13, Failures: 0, Errors: 0, Skipped: 0, Time elapsed: 0.043 sec
Running org.apache.accumulo.core.iterators.user.IndexedDocIteratorTest
Tests run: 5, Failures: 0, Errors: 0, Skipped: 0, Time elapsed: 3.948 sec
Running org.apache.accumulo.core.iterators.user.RowFilterTest
Tests run: 1, Failures: 0, Errors: 0, Skipped: 0, Time elapsed: 0.104 sec
Running org.apache.accumulo.core.iterators.aggregation.NumSummationTest
Tests run: 5, Failures: 0, Errors: 0, Skipped: 0, Time elapsed: 0.007 sec
Running org.apache.accumulo.core.iterators.aggregation.conf.AggregatorConfigurationTest
Tests run: 2, Failures: 0, Errors: 0, Skipped: 0, Time elapsed: 0.006 sec
Running org.apache.accumulo.core.iterators.IterUtilTest
Tests run: 5, Failures: 0, Errors: 0, Skipped: 0, Time elapsed: 0.007 sec
Running org.apache.accumulo.core.iterators.AggregatingIteratorTest
Tests run: 7, Failures: 0, Errors: 0, Skipped: 0, Time elapsed: 0.007 sec
Running org.apache.accumulo.core.iterators.FirstEntryInRowTest
Tests run: 2, Failures: 0, Errors: 0, Skipped: 0, Time elapsed: 0.05 sec
Running org.apache.accumulo.core.conf.PropertyTest
Tests run: 3, Failures: 0, Errors: 0, Skipped: 0, Time elapsed: 0.016 sec
Flushing results...
Flushing results done
Cobertura: Loaded information on 1737 classes.
Cobertura: Saved information on 1737 classes.

Results :

Tests run: 281, Failures: 0, Errors: 0, Skipped: 0

mojoSucceeded org.apache.maven.plugins:maven-surefire-plugin:2.12(default-test)
[JENKINS] Recording test results
forkedProjectSucceeded org.apache.accumulo:accumulo-core:1.5.0-SNAPSHOT
mojoStarted org.codehaus.mojo:cobertura-maven-plugin:2.5.1(default-cli)
[JENKINS] cobertura-maven-plugin already configured with xml reports enabled
[INFO] 
[INFO] --- cobertura-maven-plugin:2.5.1:cobertura (default-cli) @ accumulo-core ---
[INFO] Cobertura 1.9.4.1 - GNU GPL License (NO WARRANTY) - See COPYRIGHT file
Cobertura: Loaded information on 1737 classes.
Report time: 13353ms

[INFO] Cobertura Report generation was successful.
mojoSucceeded org.codehaus.mojo:cobertura-maven-plugin:2.5.1(default-cli)
[JENKINS] Recording coverage results
projectSucceeded org.apache.accumulo:accumulo-core:1.5.0-SNAPSHOT
projectStarted org.apache.accumulo:accumulo-server:1.5.0-SNAPSHOT
Downloading: http://repo1.maven.org/maven2/org/eclipse/m2e/lifecycle-mapping/1.0.0/lifecycle-mapping-1.0.0.pom
[INFO] [WARNING] The POM for org.eclipse.m2e:lifecycle-mapping:jar:1.0.0 is missing, no dependency
information available
[WARNING] Failed to retrieve plugin descriptor for org.eclipse.m2e:lifecycle-mapping:1.0.0:
Plugin org.eclipse.m2e:lifecycle-mapping:1.0.0 or one of its dependencies could not be resolved:
Failed to read artifact descriptor for org.eclipse.m2e:lifecycle-mapping:jar:1.0.0
                                                                        
[INFO] ------------------------------------------------------------------------
[INFO] Building accumulo-server 1.5.0-SNAPSHOT
[INFO] ------------------------------------------------------------------------
mojoStarted org.apache.maven.plugins:maven-clean-plugin:2.4.1(default-clean)[INFO] Deleting
<https://builds.apache.org/job/Accumulo-Trunk/ws/accumulo-trunk/server> (includes =
[**/*.pyc], excludes = [])

[INFO] 
[INFO] --- maven-clean-plugin:2.4.1:clean (default-clean) @ accumulo-server ---
mojoSucceeded org.apache.maven.plugins:maven-clean-plugin:2.4.1(default-clean)
mojoStarted org.codehaus.mojo:buildnumber-maven-plugin:1.1(default)[INFO] Checking for local
modifications: skipped.
[INFO] Updating project files from SCM: skipped.
[INFO] Executing: /bin/sh -c cd <https://builds.apache.org/job/Accumulo-Trunk/ws/accumulo-trunk/server>
&& svn --non-interactive info
[INFO] Working directory: <https://builds.apache.org/job/Accumulo-Trunk/ws/accumulo-trunk/server>

[INFO] 
[INFO] --- buildnumber-maven-plugin:1.1:create (default) @ accumulo-server ---
[INFO] Storing buildNumber: 1360123 at timestamp: 1342006240794
[INFO] Executing: /bin/sh -c cd <https://builds.apache.org/job/Accumulo-Trunk/ws/accumulo-trunk/server>
&& svn --non-interactive info
[INFO] Working directory: <https://builds.apache.org/job/Accumulo-Trunk/ws/accumulo-trunk/server>
[INFO] Storing buildScmBranch: trunk
mojoSucceeded org.codehaus.mojo:buildnumber-maven-plugin:1.1(default)
mojoStarted org.apache.maven.plugins:maven-enforcer-plugin:1.0.1(enforce-mvn)
[INFO] 
[INFO] --- maven-enforcer-plugin:1.0.1:enforce (enforce-mvn) @ accumulo-server ---
mojoSucceeded org.apache.maven.plugins:maven-enforcer-plugin:1.0.1(enforce-mvn)
mojoStarted org.apache.maven.plugins:maven-remote-resources-plugin:1.2.1(default)
[INFO] 
[INFO] --- maven-remote-resources-plugin:1.2.1:process (default) @ accumulo-server ---
mojoSucceeded org.apache.maven.plugins:maven-remote-resources-plugin:1.2.1(default)
[debug] execute contextualize
mojoStarted org.apache.maven.plugins:maven-resources-plugin:2.5(default-resources)[INFO] Using
'UTF-8' encoding to copy filtered resources.
[INFO] Copying 38 resources

[INFO] 
[INFO] --- maven-resources-plugin:2.5:resources (default-resources) @ accumulo-server ---
[INFO] Copying 3 resources
mojoSucceeded org.apache.maven.plugins:maven-resources-plugin:2.5(default-resources)
[INFO] Copying commons-configuration-1.5.jar to <https://builds.apache.org/job/Accumulo-Trunk/ws/accumulo-trunk/lib/commons-configuration-1.5.jar>
[INFO] commons-collections-3.2.jar already exists in destination.
[INFO] commons-lang-2.4.jar already exists in destination.
[INFO] commons-io-1.4.jar already exists in destination.
[INFO] libthrift-0.8.0.jar already exists in destination.
[INFO] log4j-1.2.16.jar already exists in destination.
[INFO] jline-0.9.94.jar already exists in destination.
mojoStarted org.apache.maven.plugins:maven-dependency-plugin:2.3(copy-dependencies)
[INFO] 
[INFO] --- maven-dependency-plugin:2.3:copy-dependencies (copy-dependencies) @ accumulo-server
---
mojoSucceeded org.apache.maven.plugins:maven-dependency-plugin:2.3(copy-dependencies)
mojoStarted org.apache.maven.plugins:maven-compiler-plugin:2.3.2(default-compile)
[INFO] 
[INFO] --- maven-compiler-plugin:2.3.2:compile (default-compile) @ accumulo-server ---
[INFO] Compiling 394 source files to <https://builds.apache.org/job/Accumulo-Trunk/ws/accumulo-trunk/server/target/classes>
[INFO] -------------------------------------------------------------
[ERROR] COMPILATION ERROR : 
[INFO] -------------------------------------------------------------
[ERROR] <https://builds.apache.org/job/Accumulo-Trunk/ws/accumulo-trunk/server/src/main/java/org/apache/accumulo/server/util/EmbeddedWebServer.java>:[26,33]
package org.mortbay.jetty.security does not exist
[ERROR] <https://builds.apache.org/job/Accumulo-Trunk/ws/accumulo-trunk/server/src/main/java/org/apache/accumulo/server/util/EmbeddedWebServer.java>:[78,19]
cannot find symbol
symbol  : class SslSocketConnector
location: class org.apache.accumulo.server.util.EmbeddedWebServer.EmbeddedWebServer6_1
[ERROR] <https://builds.apache.org/job/Accumulo-Trunk/ws/accumulo-trunk/server/src/main/java/org/apache/accumulo/server/util/EmbeddedWebServer.java>:[79,10]
cannot find symbol
symbol  : class SslSocketConnector
location: class org.apache.accumulo.server.util.EmbeddedWebServer.EmbeddedWebServer6_1
[ERROR] <https://builds.apache.org/job/Accumulo-Trunk/ws/accumulo-trunk/server/src/main/java/org/apache/accumulo/server/util/EmbeddedWebServer.java>:[80,10]
cannot find symbol
symbol  : class SslSocketConnector
location: class org.apache.accumulo.server.util.EmbeddedWebServer.EmbeddedWebServer6_1
mojoFailed org.apache.maven.plugins:maven-compiler-plugin:2.3.2(default-compile)[ERROR] <https://builds.apache.org/job/Accumulo-Trunk/ws/accumulo-trunk/server/src/main/java/org/apache/accumulo/server/util/EmbeddedWebServer.java>:[81,10]
cannot find symbol
symbol  : class SslSocketConnector
location: class org.apache.accumulo.server.util.EmbeddedWebServer.EmbeddedWebServer6_1
[ERROR] <https://builds.apache.org/job/Accumulo-Trunk/ws/accumulo-trunk/server/src/main/java/org/apache/accumulo/server/util/EmbeddedWebServer.java>:[82,10]
cannot find symbol
symbol  : class SslSocketConnector
location: class org.apache.accumulo.server.util.EmbeddedWebServer.EmbeddedWebServer6_1
[INFO] 6 errors 
[INFO] -------------------------------------------------------------

projectFailed org.apache.accumulo:accumulo-server:1.5.0-SNAPSHOT
sessionEnded
[INFO] ------------------------------------------------------------------------
[INFO] Reactor Summary:
[INFO] 
[INFO] accumulo .......................................... SUCCESS [29.167s]
[INFO] cloudtrace ........................................ SUCCESS [38.562s]
[INFO] accumulo-start .................................... SUCCESS [47.656s]
[INFO] accumulo-fate ..................................... SUCCESS [15.179s]
[INFO] accumulo-core ..................................... SUCCESS [6:40.427s]
[INFO] accumulo-server ................................... FAILURE [8.410s]
[INFO] accumulo-examples ................................. SKIPPED
[INFO] examples-simple ................................... SKIPPED
[INFO] accumulo-wikisearch ............................... SKIPPED
[INFO] wikisearch-ingest ................................. SKIPPED
[INFO] wikisearch-query .................................. SKIPPED
[INFO] wikisearch-query-war .............................. SKIPPED
[INFO] accumulo-assemble ................................. SKIPPED
[INFO] ------------------------------------------------------------------------
[INFO] BUILD FAILURE
[INFO] ------------------------------------------------------------------------
[INFO] Total time: 9:08.670s
[INFO] Finished at: Wed Jul 11 11:30:48 UTC 2012
[INFO] Final Memory: 63M/424M
[INFO] ------------------------------------------------------------------------
Projects to build: [MavenProject: org.apache.accumulo:accumulo:1.5.0-SNAPSHOT @ <https://builds.apache.org/job/Accumulo-Trunk/ws/accumulo-trunk/pom.xml,>
MavenProject: org.apache.accumulo:cloudtrace:1.5.0-SNAPSHOT @ <https://builds.apache.org/job/Accumulo-Trunk/ws/accumulo-trunk/trace/pom.xml,>
MavenProject: org.apache.accumulo:accumulo-start:1.5.0-SNAPSHOT @ <https://builds.apache.org/job/Accumulo-Trunk/ws/accumulo-trunk/start/pom.xml,>
MavenProject: org.apache.accumulo:accumulo-fate:1.5.0-SNAPSHOT @ <https://builds.apache.org/job/Accumulo-Trunk/ws/accumulo-trunk/fate/pom.xml,>
MavenProject: org.apache.accumulo:accumulo-core:1.5.0-SNAPSHOT @ <https://builds.apache.org/job/Accumulo-Trunk/ws/accumulo-trunk/core/pom.xml,>
MavenProject: org.apache.accumulo:accumulo-server:1.5.0-SNAPSHOT @ <https://builds.apache.org/job/Accumulo-Trunk/ws/accumulo-trunk/server/pom.xml,>
MavenProject: org.apache.accumulo:accumulo-examples:1.5.0-SNAPSHOT @ <https://builds.apache.org/job/Accumulo-Trunk/ws/accumulo-trunk/examples/pom.xml,>
MavenProject: org.apache.accumulo:examples-simple:1.5.0-SNAPSHOT @ <https://builds.apache.org/job/Accumulo-Trunk/ws/accumulo-trunk/examples/simple/pom.xml,>
MavenProject: org.apache.accumulo:accumulo-wikisearch:1.5.0-SNAPSHOT @ <https://builds.apache.org/job/Accumulo-Trunk/ws/accumulo-trunk/examples/wikisearch/pom.xml,>
MavenProject: org.apache.accumulo:wikisearch-ingest:1.5.0-SNAPSHOT @ <https://builds.apache.org/job/Accumulo-Trunk/ws/accumulo-trunk/examples/wikisearch/ingest/pom.xml,>
MavenProject: org.apache.accumulo:wikisearch-query:1.5.0-SNAPSHOT @ <https://builds.apache.org/job/Accumulo-Trunk/ws/accumulo-trunk/examples/wikisearch/query/pom.xml,>
MavenProject: org.apache.accumulo:wikisearch-query-war:1.5.0-SNAPSHOT @ <https://builds.apache.org/job/Accumulo-Trunk/ws/accumulo-trunk/examples/wikisearch/query-war/pom.xml,>
MavenProject: org.apache.accumulo:accumulo-assemble:1.5.0-SNAPSHOT @ <https://builds.apache.org/job/Accumulo-Trunk/ws/accumulo-trunk/assemble/pom.xml]>
[JENKINS] Archiving <https://builds.apache.org/job/Accumulo-Trunk/ws/accumulo-trunk/server/pom.xml>
to /home/hudson/hudson/jobs/Accumulo-Trunk/modules/org.apache.accumulo$accumulo-server/builds/2012-07-11_11-21-25/archive/org.apache.accumulo/accumulo-server/1.5.0-SNAPSHOT/accumulo-server-1.5.0-SNAPSHOT.pom
[JENKINS] Archiving <https://builds.apache.org/job/Accumulo-Trunk/ws/accumulo-trunk/assemble/pom.xml>
to /home/hudson/hudson/jobs/Accumulo-Trunk/modules/org.apache.accumulo$accumulo-assemble/builds/2012-07-11_11-21-25/archive/org.apache.accumulo/accumulo-assemble/1.5.0-SNAPSHOT/accumulo-assemble-1.5.0-SNAPSHOT.pom
[JENKINS] Archiving <https://builds.apache.org/job/Accumulo-Trunk/ws/accumulo-trunk/examples/wikisearch/ingest/pom.xml>
to /home/hudson/hudson/jobs/Accumulo-Trunk/modules/org.apache.accumulo$wikisearch-ingest/builds/2012-07-11_11-21-25/archive/org.apache.accumulo/wikisearch-ingest/1.5.0-SNAPSHOT/wikisearch-ingest-1.5.0-SNAPSHOT.pom
[JENKINS] Archiving <https://builds.apache.org/job/Accumulo-Trunk/ws/accumulo-trunk/trace/pom.xml>
to /home/hudson/hudson/jobs/Accumulo-Trunk/modules/org.apache.accumulo$cloudtrace/builds/2012-07-11_11-21-25/archive/org.apache.accumulo/cloudtrace/1.5.0-SNAPSHOT/cloudtrace-1.5.0-SNAPSHOT.pom
[JENKINS] Archiving <https://builds.apache.org/job/Accumulo-Trunk/ws/accumulo-trunk/lib/cloudtrace-1.5.0-SNAPSHOT.jar>
to /home/hudson/hudson/jobs/Accumulo-Trunk/modules/org.apache.accumulo$cloudtrace/builds/2012-07-11_11-21-25/archive/org.apache.accumulo/cloudtrace/1.5.0-SNAPSHOT/cloudtrace-1.5.0-SNAPSHOT.jar
[JENKINS] Archiving <https://builds.apache.org/job/Accumulo-Trunk/ws/accumulo-trunk/examples/pom.xml>
to /home/hudson/hudson/jobs/Accumulo-Trunk/modules/org.apache.accumulo$accumulo-examples/builds/2012-07-11_11-21-25/archive/org.apache.accumulo/accumulo-examples/1.5.0-SNAPSHOT/accumulo-examples-1.5.0-SNAPSHOT.pom
[JENKINS] Archiving <https://builds.apache.org/job/Accumulo-Trunk/ws/accumulo-trunk/examples/wikisearch/query/pom.xml>
to /home/hudson/hudson/jobs/Accumulo-Trunk/modules/org.apache.accumulo$wikisearch-query/builds/2012-07-11_11-21-25/archive/org.apache.accumulo/wikisearch-query/1.5.0-SNAPSHOT/wikisearch-query-1.5.0-SNAPSHOT.pom
[JENKINS] Archiving <https://builds.apache.org/job/Accumulo-Trunk/ws/accumulo-trunk/examples/simple/pom.xml>
to /home/hudson/hudson/jobs/Accumulo-Trunk/modules/org.apache.accumulo$examples-simple/builds/2012-07-11_11-21-25/archive/org.apache.accumulo/examples-simple/1.5.0-SNAPSHOT/examples-simple-1.5.0-SNAPSHOT.pom
[JENKINS] Archiving <https://builds.apache.org/job/Accumulo-Trunk/ws/accumulo-trunk/pom.xml>
to /home/hudson/hudson/jobs/Accumulo-Trunk/modules/org.apache.accumulo$accumulo/builds/2012-07-11_11-21-25/archive/org.apache.accumulo/accumulo/1.5.0-SNAPSHOT/accumulo-1.5.0-SNAPSHOT.pom
[JENKINS] Archiving <https://builds.apache.org/job/Accumulo-Trunk/ws/accumulo-trunk/target/accumulo-1.5.0-SNAPSHOT-site.xml>
to /home/hudson/hudson/jobs/Accumulo-Trunk/modules/org.apache.accumulo$accumulo/builds/2012-07-11_11-21-25/archive/org.apache.accumulo/accumulo/1.5.0-SNAPSHOT/accumulo-1.5.0-SNAPSHOT-site.xml
[JENKINS] Archiving <https://builds.apache.org/job/Accumulo-Trunk/ws/accumulo-trunk/start/pom.xml>
to /home/hudson/hudson/jobs/Accumulo-Trunk/modules/org.apache.accumulo$accumulo-start/builds/2012-07-11_11-21-25/archive/org.apache.accumulo/accumulo-start/1.5.0-SNAPSHOT/accumulo-start-1.5.0-SNAPSHOT.pom
[JENKINS] Archiving <https://builds.apache.org/job/Accumulo-Trunk/ws/accumulo-trunk/lib/accumulo-start-1.5.0-SNAPSHOT.jar>
to /home/hudson/hudson/jobs/Accumulo-Trunk/modules/org.apache.accumulo$accumulo-start/builds/2012-07-11_11-21-25/archive/org.apache.accumulo/accumulo-start/1.5.0-SNAPSHOT/accumulo-start-1.5.0-SNAPSHOT.jar
[JENKINS] Archiving <https://builds.apache.org/job/Accumulo-Trunk/ws/accumulo-trunk/examples/wikisearch/pom.xml>
to /home/hudson/hudson/jobs/Accumulo-Trunk/modules/org.apache.accumulo$accumulo-wikisearch/builds/2012-07-11_11-21-25/archive/org.apache.accumulo/accumulo-wikisearch/1.5.0-SNAPSHOT/accumulo-wikisearch-1.5.0-SNAPSHOT.pom
[JENKINS] Archiving <https://builds.apache.org/job/Accumulo-Trunk/ws/accumulo-trunk/examples/wikisearch/query-war/pom.xml>
to /home/hudson/hudson/jobs/Accumulo-Trunk/modules/org.apache.accumulo$wikisearch-query-war/builds/2012-07-11_11-21-25/archive/org.apache.accumulo/wikisearch-query-war/1.5.0-SNAPSHOT/wikisearch-query-war-1.5.0-SNAPSHOT.pom
[JENKINS] Archiving <https://builds.apache.org/job/Accumulo-Trunk/ws/accumulo-trunk/fate/pom.xml>
to /home/hudson/hudson/jobs/Accumulo-Trunk/modules/org.apache.accumulo$accumulo-fate/builds/2012-07-11_11-21-25/archive/org.apache.accumulo/accumulo-fate/1.5.0-SNAPSHOT/accumulo-fate-1.5.0-SNAPSHOT.pom
[JENKINS] Archiving <https://builds.apache.org/job/Accumulo-Trunk/ws/accumulo-trunk/lib/accumulo-fate-1.5.0-SNAPSHOT.jar>
to /home/hudson/hudson/jobs/Accumulo-Trunk/modules/org.apache.accumulo$accumulo-fate/builds/2012-07-11_11-21-25/archive/org.apache.accumulo/accumulo-fate/1.5.0-SNAPSHOT/accumulo-fate-1.5.0-SNAPSHOT.jar
[JENKINS] Archiving <https://builds.apache.org/job/Accumulo-Trunk/ws/accumulo-trunk/core/pom.xml>
to /home/hudson/hudson/jobs/Accumulo-Trunk/modules/org.apache.accumulo$accumulo-core/builds/2012-07-11_11-21-25/archive/org.apache.accumulo/accumulo-core/1.5.0-SNAPSHOT/accumulo-core-1.5.0-SNAPSHOT.pom
[JENKINS] Archiving <https://builds.apache.org/job/Accumulo-Trunk/ws/accumulo-trunk/lib/accumulo-core-1.5.0-SNAPSHOT.jar>
to /home/hudson/hudson/jobs/Accumulo-Trunk/modules/org.apache.accumulo$accumulo-core/builds/2012-07-11_11-21-25/archive/org.apache.accumulo/accumulo-core/1.5.0-SNAPSHOT/accumulo-core-1.5.0-SNAPSHOT.jar
Waiting for Jenkins to finish collecting data
mavenExecutionResult exceptions not empty
message : Failed to execute goal org.apache.maven.plugins:maven-compiler-plugin:2.3.2:compile
(default-compile) on project accumulo-server: Compilation failure
cause : Compilation failure
Stack trace : 
org.apache.maven.lifecycle.LifecycleExecutionException: Failed to execute goal org.apache.maven.plugins:maven-compiler-plugin:2.3.2:compile
(default-compile) on project accumulo-server: Compilation failure
	at org.apache.maven.lifecycle.internal.MojoExecutor.execute(MojoExecutor.java:213)
	at org.apache.maven.lifecycle.internal.MojoExecutor.execute(MojoExecutor.java:153)
	at org.apache.maven.lifecycle.internal.MojoExecutor.execute(MojoExecutor.java:145)
	at org.apache.maven.lifecycle.internal.LifecycleModuleBuilder.buildProject(LifecycleModuleBuilder.java:84)
	at org.apache.maven.lifecycle.internal.LifecycleModuleBuilder.buildProject(LifecycleModuleBuilder.java:59)
	at org.apache.maven.lifecycle.internal.LifecycleStarter.singleThreadedBuild(LifecycleStarter.java:183)
	at org.apache.maven.lifecycle.internal.LifecycleStarter.execute(LifecycleStarter.java:161)
	at org.apache.maven.DefaultMaven.doExecute(DefaultMaven.java:319)
	at org.apache.maven.DefaultMaven.execute(DefaultMaven.java:156)
	at org.jvnet.hudson.maven3.launcher.Maven3Launcher.main(Maven3Launcher.java:79)
	at sun.reflect.NativeMethodAccessorImpl.invoke0(Native Method)
	at sun.reflect.NativeMethodAccessorImpl.invoke(NativeMethodAccessorImpl.java:39)
	at sun.reflect.DelegatingMethodAccessorImpl.invoke(DelegatingMethodAccessorImpl.java:25)
	at java.lang.reflect.Method.invoke(Method.java:597)
	at org.codehaus.plexus.classworlds.launcher.Launcher.launchStandard(Launcher.java:329)
	at org.codehaus.plexus.classworlds.launcher.Launcher.launch(Launcher.java:239)
	at org.jvnet.hudson.maven3.agent.Maven3Main.launch(Maven3Main.java:158)
	at hudson.maven.Maven3Builder.call(Maven3Builder.java:98)
	at hudson.maven.Maven3Builder.call(Maven3Builder.java:64)
	at hudson.remoting.UserRequest.perform(UserRequest.java:118)
	at hudson.remoting.UserRequest.perform(UserRequest.java:48)
	at hudson.remoting.Request$2.run(Request.java:326)
	at hudson.remoting.InterceptingExecutorService$1.call(InterceptingExecutorService.java:72)
	at java.util.concurrent.FutureTask$Sync.innerRun(FutureTask.java:303)
	at java.util.concurrent.FutureTask.run(FutureTask.java:138)
	at java.util.concurrent.ThreadPoolExecutor$Worker.runTask(ThreadPoolExecutor.java:886)
	at java.util.concurrent.ThreadPoolExecutor$Worker.run(ThreadPoolExecutor.java:908)
	at java.lang.Thread.run(Thread.java:662)
Caused by: org.apache.maven.plugin.CompilationFailureException: Compilation failure
	at org.apache.maven.plugin.AbstractCompilerMojo.execute(AbstractCompilerMojo.java:656)
	at org.apache.maven.plugin.CompilerMojo.execute(CompilerMojo.java:128)
	at org.apache.maven.plugin.DefaultBuildPluginManager.executeMojo(DefaultBuildPluginManager.java:101)
	at org.apache.maven.lifecycle.internal.MojoExecutor.execute(MojoExecutor.java:209)
	... 27 more
Sending e-mails to: dev@accumulo.apache.org
channel stopped
Skipping Cobertura coverage report as build was not UNSTABLE or better ...

Mime
View raw message