accumulo-dev mailing list archives

Site index · List index
Message view « Date » · « Thread »
Top « Date » · « Thread »
From Apache Jenkins Server <jenk...@builds.apache.org>
Subject Build failed in Jenkins: Accumulo-Trunk » accumulo-core #395
Date Mon, 18 Jun 2012 19:08:23 GMT
See <https://builds.apache.org/job/Accumulo-Trunk/org.apache.accumulo$accumulo-core/395/changes>

Changes:

[kturner] ACCUMULO-637 closed batch writer before continuous ingest exits (merged from 1.4)

------------------------------------------
projectStarted org.apache.accumulo:accumulo-core:1.5.0-SNAPSHOT
[INFO] Downloading: http://repo1.maven.org/maven2/org/eclipse/m2e/lifecycle-mapping/1.0.0/lifecycle-mapping-1.0.0.pom
                                                                        
[INFO] ------------------------------------------------------------------------
[INFO] Building accumulo-core 1.5.0-SNAPSHOT
[INFO] ------------------------------------------------------------------------
[WARNING] The POM for org.eclipse.m2e:lifecycle-mapping:jar:1.0.0 is missing, no dependency
information available
[WARNING] Failed to retrieve plugin descriptor for org.eclipse.m2e:lifecycle-mapping:1.0.0:
Plugin org.eclipse.m2e:lifecycle-mapping:1.0.0 or one of its dependencies could not be resolved:
Failed to read artifact descriptor for org.eclipse.m2e:lifecycle-mapping:jar:1.0.0
Downloading: http://repository.apache.org/snapshots/org/mortbay/jetty/jetty/maven-metadata.xml
Downloading: http://repo1.maven.org/maven2/org/mortbay/jetty/jetty/maven-metadata.xml
Downloaded: http://repo1.maven.org/maven2/org/mortbay/jetty/jetty/maven-metadata.xml (688
B at 1.9 KB/sec)
mojoStarted org.apache.maven.plugins:maven-clean-plugin:2.4.1(default-clean)[INFO] Deleting
<https://builds.apache.org/job/Accumulo-Trunk/org.apache.accumulo$accumulo-core/ws/target>

[INFO] 
[INFO] --- maven-clean-plugin:2.4.1:clean (default-clean) @ accumulo-core ---
[INFO] Deleting <https://builds.apache.org/job/Accumulo-Trunk/org.apache.accumulo$accumulo-core/ws/>
(includes = [**/*.pyc], excludes = [])
mojoSucceeded org.apache.maven.plugins:maven-clean-plugin:2.4.1(default-clean)
mojoStarted org.codehaus.mojo:buildnumber-maven-plugin:1.1(default)[INFO] Checking for local
modifications: skipped.
[INFO] Updating project files from SCM: skipped.
[INFO] Executing: /bin/sh -c cd <https://builds.apache.org/job/Accumulo-Trunk/org.apache.accumulo$accumulo-core/ws/>
&& svn --non-interactive info
[INFO] Working directory: <https://builds.apache.org/job/Accumulo-Trunk/org.apache.accumulo$accumulo-core/ws/>
[INFO] Storing buildNumber: 1351460 at timestamp: 1340046482300
[INFO] Executing: /bin/sh -c cd <https://builds.apache.org/job/Accumulo-Trunk/org.apache.accumulo$accumulo-core/ws/>
&& svn --non-interactive info
[INFO] Working directory: <https://builds.apache.org/job/Accumulo-Trunk/org.apache.accumulo$accumulo-core/ws/>
[INFO] Storing buildScmBranch: trunk

[INFO] 
[INFO] --- buildnumber-maven-plugin:1.1:create (default) @ accumulo-core ---
mojoSucceeded org.codehaus.mojo:buildnumber-maven-plugin:1.1(default)
mojoStarted org.apache.maven.plugins:maven-enforcer-plugin:1.0.1(enforce-mvn)
[INFO] 
[INFO] --- maven-enforcer-plugin:1.0.1:enforce (enforce-mvn) @ accumulo-core ---
mojoSucceeded org.apache.maven.plugins:maven-enforcer-plugin:1.0.1(enforce-mvn)
mojoStarted org.codehaus.mojo:exec-maven-plugin:1.2.1(generate-core-thrift)thrift is not available

[INFO] 
[INFO] --- exec-maven-plugin:1.2.1:exec (generate-core-thrift) @ accumulo-core ---
mojoSucceeded org.codehaus.mojo:exec-maven-plugin:1.2.1(generate-core-thrift)
mojoStarted org.apache.maven.plugins:maven-remote-resources-plugin:1.2.1(default)
[INFO] 
[INFO] --- maven-remote-resources-plugin:1.2.1:process (default) @ accumulo-core ---
mojoSucceeded org.apache.maven.plugins:maven-remote-resources-plugin:1.2.1(default)
[debug] execute contextualize
mojoStarted org.apache.maven.plugins:maven-resources-plugin:2.5(default-resources)[INFO] Using
'UTF-8' encoding to copy filtered resources.
[INFO] Copying 1 resource
[INFO] Copying 3 resources

[INFO] 
[INFO] --- maven-resources-plugin:2.5:resources (default-resources) @ accumulo-core ---
mojoSucceeded org.apache.maven.plugins:maven-resources-plugin:2.5(default-resources)
mojoStarted org.apache.maven.plugins:maven-dependency-plugin:2.3(copy-dependencies)[INFO]
Copying commons-collections-3.2.jar to /home/jenkins/jenkins-slave/workspace/Accumulo-Trunk/accumulo-trunk/lib/commons-collections-3.2.jar
[INFO] Copying commons-lang-2.4.jar to /home/jenkins/jenkins-slave/workspace/Accumulo-Trunk/accumulo-trunk/lib/commons-lang-2.4.jar
[INFO] Copying jline-0.9.94.jar to /home/jenkins/jenkins-slave/workspace/Accumulo-Trunk/accumulo-trunk/lib/jline-0.9.94.jar
[INFO] log4j-1.2.16.jar already exists in destination.
[INFO] commons-logging-1.0.4.jar already exists in destination.
[INFO] libthrift-0.6.1.jar already exists in destination.

[INFO] 
[INFO] --- maven-dependency-plugin:2.3:copy-dependencies (copy-dependencies) @ accumulo-core
---
mojoSucceeded org.apache.maven.plugins:maven-dependency-plugin:2.3(copy-dependencies)
mojoStarted org.apache.maven.plugins:maven-compiler-plugin:2.3.2(default-compile)
[INFO] 
[INFO] --- maven-compiler-plugin:2.3.2:compile (default-compile) @ accumulo-core ---
[INFO] Compiling 427 source files to <https://builds.apache.org/job/Accumulo-Trunk/org.apache.accumulo$accumulo-core/ws/target/classes>
mojoSucceeded org.apache.maven.plugins:maven-compiler-plugin:2.3.2(default-compile)
[debug] execute contextualize
mojoStarted org.apache.maven.plugins:maven-resources-plugin:2.5(default-testResources)[INFO]
Using 'UTF-8' encoding to copy filtered resources.
[INFO] Copying 2 resources
[INFO] Copying 3 resources

[INFO] 
[INFO] --- maven-resources-plugin:2.5:testResources (default-testResources) @ accumulo-core
---
mojoSucceeded org.apache.maven.plugins:maven-resources-plugin:2.5(default-testResources)
mojoStarted org.apache.maven.plugins:maven-compiler-plugin:2.3.2(default-testCompile)
[INFO] 
[INFO] --- maven-compiler-plugin:2.3.2:testCompile (default-testCompile) @ accumulo-core ---
[INFO] Compiling 60 source files to <https://builds.apache.org/job/Accumulo-Trunk/org.apache.accumulo$accumulo-core/ws/target/test-classes>
[INFO] -------------------------------------------------------------
[ERROR] COMPILATION ERROR : 
[INFO] -------------------------------------------------------------
[ERROR] <https://builds.apache.org/job/Accumulo-Trunk/org.apache.accumulo$accumulo-core/ws/src/test/java/org/apache/accumulo/core/iterators/FirstEntryInRowTest.java>:[143,0]
class, interface, or enum expected
[ERROR] <https://builds.apache.org/job/Accumulo-Trunk/org.apache.accumulo$accumulo-core/ws/src/test/java/org/apache/accumulo/core/iterators/FirstEntryInRowTest.java>:[145,0]
class, interface, or enum expected
[ERROR] <https://builds.apache.org/job/Accumulo-Trunk/org.apache.accumulo$accumulo-core/ws/src/test/java/org/apache/accumulo/core/iterators/FirstEntryInRowTest.java>:[146,0]
class, interface, or enum expected
[ERROR] <https://builds.apache.org/job/Accumulo-Trunk/org.apache.accumulo$accumulo-core/ws/src/test/java/org/apache/accumulo/core/iterators/FirstEntryInRowTest.java>:[147,0]
class, interface, or enum expected
[ERROR] <https://builds.apache.org/job/Accumulo-Trunk/org.apache.accumulo$accumulo-core/ws/src/test/java/org/apache/accumulo/core/iterators/FirstEntryInRowTest.java>:[149,0]
class, interface, or enum expected
[ERROR] <https://builds.apache.org/job/Accumulo-Trunk/org.apache.accumulo$accumulo-core/ws/src/test/java/org/apache/accumulo/core/iterators/FirstEntryInRowTest.java>:[150,0]
class, interface, or enum expected
[ERROR] <https://builds.apache.org/job/Accumulo-Trunk/org.apache.accumulo$accumulo-core/ws/src/test/java/org/apache/accumulo/core/iterators/FirstEntryInRowTest.java>:[151,0]
class, interface, or enum expected
[ERROR] <https://builds.apache.org/job/Accumulo-Trunk/org.apache.accumulo$accumulo-core/ws/src/test/java/org/apache/accumulo/core/iterators/FirstEntryInRowTest.java>:[152,0]
class, interface, or enum expected
[ERROR] <https://builds.apache.org/job/Accumulo-Trunk/org.apache.accumulo$accumulo-core/ws/src/test/java/org/apache/accumulo/core/iterators/FirstEntryInRowTest.java>:[153,0]
class, interface, or enum expected
[ERROR] <https://builds.apache.org/job/Accumulo-Trunk/org.apache.accumulo$accumulo-core/ws/src/test/java/org/apache/accumulo/core/iterators/FirstEntryInRowTest.java>:[155,0]
class, interface, or enum expected
[ERROR] <https://builds.apache.org/job/Accumulo-Trunk/org.apache.accumulo$accumulo-core/ws/src/test/java/org/apache/accumulo/core/iterators/FirstEntryInRowTest.java>:[156,0]
class, interface, or enum expected
[ERROR] <https://builds.apache.org/job/Accumulo-Trunk/org.apache.accumulo$accumulo-core/ws/src/test/java/org/apache/accumulo/core/iterators/FirstEntryInRowTest.java>:[157,0]
class, interface, or enum expected
[ERROR] <https://builds.apache.org/job/Accumulo-Trunk/org.apache.accumulo$accumulo-core/ws/src/test/java/org/apache/accumulo/core/iterators/FirstEntryInRowTest.java>:[158,0]
class, interface, or enum expected
[ERROR] <https://builds.apache.org/job/Accumulo-Trunk/org.apache.accumulo$accumulo-core/ws/src/test/java/org/apache/accumulo/core/iterators/FirstEntryInRowTest.java>:[159,0]
class, interface, or enum expected
[ERROR] <https://builds.apache.org/job/Accumulo-Trunk/org.apache.accumulo$accumulo-core/ws/src/test/java/org/apache/accumulo/core/iterators/FirstEntryInRowTest.java>:[160,0]
class, interface, or enum expected
[INFO] 15 errors 
mojoFailed org.apache.maven.plugins:maven-compiler-plugin:2.3.2(default-testCompile)[INFO]
-------------------------------------------------------------

projectFailed org.apache.accumulo:accumulo-core:1.5.0-SNAPSHOT

Mime
View raw message