accumulo-dev mailing list archives

Site index · List index
Message view « Date » · « Thread »
Top « Date » · « Thread »
From Apache Jenkins Server <jenk...@builds.apache.org>
Subject Build failed in Jenkins: Accumulo-Trunk #396
Date Tue, 19 Jun 2012 13:03:40 GMT
See <https://builds.apache.org/job/Accumulo-Trunk/396/changes>

Changes:

[ecn] ACCUMULO-643 allow the tablet count to be within 20% of the average

------------------------------------------
[...truncated 477 lines...]
[INFO] commons-jci-fam-1.0.jar already exists in destination.

[INFO] --- maven-dependency-plugin:2.3:copy-dependencies (copy-dependencies) @ accumulo-start
---
mojoSucceeded org.apache.maven.plugins:maven-dependency-plugin:2.3(copy-dependencies)
mojoStarted org.apache.maven.plugins:maven-compiler-plugin:2.3.2(default-compile)
[INFO] 
[INFO] --- maven-compiler-plugin:2.3.2:compile (default-compile) @ accumulo-start ---
[INFO] Nothing to compile - all classes are up to date
mojoSucceeded org.apache.maven.plugins:maven-compiler-plugin:2.3.2(default-compile)
mojoStarted org.codehaus.mojo:cobertura-maven-plugin:2.5.1(default-cli)
[INFO] 
[INFO] --- cobertura-maven-plugin:2.5.1:instrument (default-cli) @ accumulo-start ---
[INFO] Cobertura 1.9.4.1 - GNU GPL License (NO WARRANTY) - See COPYRIGHT file
Instrumenting 9 files to <https://builds.apache.org/job/Accumulo-Trunk/ws/accumulo-trunk/start/target/generated-classes/cobertura>
Cobertura: Saved information on 9 classes.
Instrument time: 95ms

[INFO] Instrumentation was successful.
[INFO] NOT adding cobertura ser file to attached artifacts list.
mojoSucceeded org.codehaus.mojo:cobertura-maven-plugin:2.5.1(default-cli)
mojoStarted org.apache.maven.plugins:maven-resources-plugin:2.5(default-testResources)[debug]
execute contextualize
[INFO] Using 'UTF-8' encoding to copy filtered resources.

[INFO] 
[INFO] --- maven-resources-plugin:2.5:testResources (default-testResources) @ accumulo-start
---
[INFO] Copying 3 resources
[INFO] Copying 3 resources
[INFO] Copying 3 resources
mojoSucceeded org.apache.maven.plugins:maven-resources-plugin:2.5(default-testResources)
mojoStarted org.apache.maven.plugins:maven-compiler-plugin:2.3.2(default-testCompile)
[INFO] 
[INFO] --- maven-compiler-plugin:2.3.2:testCompile (default-testCompile) @ accumulo-start
---
[INFO] Nothing to compile - all classes are up to date
mojoSucceeded org.apache.maven.plugins:maven-compiler-plugin:2.3.2(default-testCompile)
mojoStarted org.apache.maven.plugins:maven-surefire-plugin:2.12(default-test)
[INFO] Surefire report directory: <https://builds.apache.org/job/Accumulo-Trunk/ws/accumulo-trunk/start/target/surefire-reports>
[INFO] 
[INFO] --- maven-surefire-plugin:2.12:test (default-test) @ accumulo-start ---

-------------------------------------------------------
 T E S T S
-------------------------------------------------------
Running org.apache.accumulo.start.Test
Tests run: 2, Failures: 0, Errors: 0, Skipped: 0, Time elapsed: 18.36 sec
Flushing results...
Flushing results done
Cobertura: Loaded information on 9 classes.
Cobertura: Saved information on 9 classes.

Results :

Tests run: 2, Failures: 0, Errors: 0, Skipped: 0

mojoSucceeded org.apache.maven.plugins:maven-surefire-plugin:2.12(default-test)
[JENKINS] Recording test results
forkedProjectSucceeded org.apache.accumulo:accumulo-start:1.5.0-SNAPSHOT
mojoStarted org.codehaus.mojo:cobertura-maven-plugin:2.5.1(default-cli)
[JENKINS] cobertura-maven-plugin already configured with xml reports enabled
[INFO] 
[INFO] --- cobertura-maven-plugin:2.5.1:cobertura (default-cli) @ accumulo-start ---
[INFO] Cobertura 1.9.4.1 - GNU GPL License (NO WARRANTY) - See COPYRIGHT file
Cobertura: Loaded information on 9 classes.
Report time: 208ms

[INFO] Cobertura Report generation was successful.
mojoSucceeded org.codehaus.mojo:cobertura-maven-plugin:2.5.1(default-cli)
[JENKINS] Recording coverage results
projectSucceeded org.apache.accumulo:accumulo-start:1.5.0-SNAPSHOT
projectStarted org.apache.accumulo:accumulo-core:1.5.0-SNAPSHOT
[INFO] Downloading: http://repo1.maven.org/maven2/org/eclipse/m2e/lifecycle-mapping/1.0.0/lifecycle-mapping-1.0.0.pom
                                                                        
[INFO] ------------------------------------------------------------------------
[INFO] Building accumulo-core 1.5.0-SNAPSHOT
[INFO] ------------------------------------------------------------------------
[WARNING] The POM for org.eclipse.m2e:lifecycle-mapping:jar:1.0.0 is missing, no dependency
information available
[WARNING] Failed to retrieve plugin descriptor for org.eclipse.m2e:lifecycle-mapping:1.0.0:
Plugin org.eclipse.m2e:lifecycle-mapping:1.0.0 or one of its dependencies could not be resolved:
Failed to read artifact descriptor for org.eclipse.m2e:lifecycle-mapping:jar:1.0.0
Downloading: http://repo1.maven.org/maven2/org/mortbay/jetty/jetty/maven-metadata.xml
Downloading: http://repository.apache.org/snapshots/org/mortbay/jetty/jetty/maven-metadata.xml
Downloaded: http://repo1.maven.org/maven2/org/mortbay/jetty/jetty/maven-metadata.xml (688
B at 1.9 KB/sec)
mojoStarted org.apache.maven.plugins:maven-clean-plugin:2.4.1(default-clean)
[INFO] Deleting <https://builds.apache.org/job/Accumulo-Trunk/ws/accumulo-trunk/core/target>
[INFO] 
[INFO] --- maven-clean-plugin:2.4.1:clean (default-clean) @ accumulo-core ---
[INFO] Deleting <https://builds.apache.org/job/Accumulo-Trunk/ws/accumulo-trunk/core>
(includes = [**/*.pyc], excludes = [])
mojoSucceeded org.apache.maven.plugins:maven-clean-plugin:2.4.1(default-clean)
mojoStarted org.codehaus.mojo:buildnumber-maven-plugin:1.1(default)[INFO] Checking for local
modifications: skipped.
[INFO] Updating project files from SCM: skipped.
[INFO] Executing: /bin/sh -c cd <https://builds.apache.org/job/Accumulo-Trunk/ws/accumulo-trunk/core>
&& svn --non-interactive info
[INFO] Working directory: <https://builds.apache.org/job/Accumulo-Trunk/ws/accumulo-trunk/core>

[INFO] 
[INFO] --- buildnumber-maven-plugin:1.1:create (default) @ accumulo-core ---
[INFO] Storing buildNumber: 1351694 at timestamp: 1340111005884
[INFO] Executing: /bin/sh -c cd <https://builds.apache.org/job/Accumulo-Trunk/ws/accumulo-trunk/core>
&& svn --non-interactive info
[INFO] Working directory: <https://builds.apache.org/job/Accumulo-Trunk/ws/accumulo-trunk/core>
[INFO] Storing buildScmBranch: trunk
mojoSucceeded org.codehaus.mojo:buildnumber-maven-plugin:1.1(default)
mojoStarted org.apache.maven.plugins:maven-enforcer-plugin:1.0.1(enforce-mvn)
[INFO] 
[INFO] --- maven-enforcer-plugin:1.0.1:enforce (enforce-mvn) @ accumulo-core ---
mojoSucceeded org.apache.maven.plugins:maven-enforcer-plugin:1.0.1(enforce-mvn)
mojoStarted org.codehaus.mojo:exec-maven-plugin:1.2.1(generate-core-thrift)
[INFO] 
[INFO] --- exec-maven-plugin:1.2.1:exec (generate-core-thrift) @ accumulo-core ---
thrift is not available
mojoSucceeded org.codehaus.mojo:exec-maven-plugin:1.2.1(generate-core-thrift)
mojoStarted org.apache.maven.plugins:maven-remote-resources-plugin:1.2.1(default)
[INFO] 
[INFO] --- maven-remote-resources-plugin:1.2.1:process (default) @ accumulo-core ---
mojoSucceeded org.apache.maven.plugins:maven-remote-resources-plugin:1.2.1(default)
[debug] execute contextualize
mojoStarted org.apache.maven.plugins:maven-resources-plugin:2.5(default-resources)[INFO] Using
'UTF-8' encoding to copy filtered resources.

[INFO] 
[INFO] --- maven-resources-plugin:2.5:resources (default-resources) @ accumulo-core ---
[INFO] Copying 1 resource
[INFO] Copying 3 resources
mojoSucceeded org.apache.maven.plugins:maven-resources-plugin:2.5(default-resources)
mojoStarted org.apache.maven.plugins:maven-dependency-plugin:2.3(copy-dependencies)
[INFO] Copying commons-collections-3.2.jar to <https://builds.apache.org/job/Accumulo-Trunk/ws/accumulo-trunk/lib/commons-collections-3.2.jar>
[INFO] Copying commons-lang-2.4.jar to <https://builds.apache.org/job/Accumulo-Trunk/ws/accumulo-trunk/lib/commons-lang-2.4.jar>
[INFO] [INFO] Copying jline-0.9.94.jar to <https://builds.apache.org/job/Accumulo-Trunk/ws/accumulo-trunk/lib/jline-0.9.94.jar>

[INFO] --- maven-dependency-plugin:2.3:copy-dependencies (copy-dependencies) @ accumulo-core
---[INFO] log4j-1.2.16.jar already exists in destination.

[INFO] commons-logging-1.0.4.jar already exists in destination.
mojoSucceeded org.apache.maven.plugins:maven-dependency-plugin:2.3(copy-dependencies)[INFO]
libthrift-0.6.1.jar already exists in destination.

mojoStarted org.apache.maven.plugins:maven-compiler-plugin:2.3.2(default-compile)
[INFO] 
[INFO] --- maven-compiler-plugin:2.3.2:compile (default-compile) @ accumulo-core ---
[INFO] Compiling 427 source files to <https://builds.apache.org/job/Accumulo-Trunk/ws/accumulo-trunk/core/target/classes>
mojoSucceeded org.apache.maven.plugins:maven-compiler-plugin:2.3.2(default-compile)
[debug] execute contextualize
mojoStarted org.apache.maven.plugins:maven-resources-plugin:2.5(default-testResources)[INFO]
Using 'UTF-8' encoding to copy filtered resources.

[INFO] 
[INFO] --- maven-resources-plugin:2.5:testResources (default-testResources) @ accumulo-core
---
[INFO] Copying 2 resources
[INFO] Copying 3 resources
mojoSucceeded org.apache.maven.plugins:maven-resources-plugin:2.5(default-testResources)
mojoStarted org.apache.maven.plugins:maven-compiler-plugin:2.3.2(default-testCompile)
[INFO] 
[INFO] --- maven-compiler-plugin:2.3.2:testCompile (default-testCompile) @ accumulo-core ---
[INFO] Compiling 60 source files to <https://builds.apache.org/job/Accumulo-Trunk/ws/accumulo-trunk/core/target/test-classes>
[INFO] -------------------------------------------------------------
[ERROR] COMPILATION ERROR : 
[INFO] -------------------------------------------------------------
[ERROR] <https://builds.apache.org/job/Accumulo-Trunk/ws/accumulo-trunk/core/src/test/java/org/apache/accumulo/core/iterators/FirstEntryInRowTest.java>:[143,0]
class, interface, or enum expected
[ERROR] <https://builds.apache.org/job/Accumulo-Trunk/ws/accumulo-trunk/core/src/test/java/org/apache/accumulo/core/iterators/FirstEntryInRowTest.java>:[145,0]
class, interface, or enum expected
[ERROR] <https://builds.apache.org/job/Accumulo-Trunk/ws/accumulo-trunk/core/src/test/java/org/apache/accumulo/core/iterators/FirstEntryInRowTest.java>:[146,0]
class, interface, or enum expected
[ERROR] <https://builds.apache.org/job/Accumulo-Trunk/ws/accumulo-trunk/core/src/test/java/org/apache/accumulo/core/iterators/FirstEntryInRowTest.java>:[147,0]
class, interface, or enum expected
mojoFailed org.apache.maven.plugins:maven-compiler-plugin:2.3.2(default-testCompile)[ERROR]
<https://builds.apache.org/job/Accumulo-Trunk/ws/accumulo-trunk/core/src/test/java/org/apache/accumulo/core/iterators/FirstEntryInRowTest.java>:[149,0]
class, interface, or enum expected
[ERROR] <https://builds.apache.org/job/Accumulo-Trunk/ws/accumulo-trunk/core/src/test/java/org/apache/accumulo/core/iterators/FirstEntryInRowTest.java>:[150,0]
class, interface, or enum expected
[ERROR] <https://builds.apache.org/job/Accumulo-Trunk/ws/accumulo-trunk/core/src/test/java/org/apache/accumulo/core/iterators/FirstEntryInRowTest.java>:[151,0]
class, interface, or enum expected
[ERROR] <https://builds.apache.org/job/Accumulo-Trunk/ws/accumulo-trunk/core/src/test/java/org/apache/accumulo/core/iterators/FirstEntryInRowTest.java>:[152,0]
class, interface, or enum expected

[ERROR] <https://builds.apache.org/job/Accumulo-Trunk/ws/accumulo-trunk/core/src/test/java/org/apache/accumulo/core/iterators/FirstEntryInRowTest.java>:[153,0]
class, interface, or enum expected
[ERROR] <https://builds.apache.org/job/Accumulo-Trunk/ws/accumulo-trunk/core/src/test/java/org/apache/accumulo/core/iterators/FirstEntryInRowTest.java>:[155,0]
class, interface, or enum expected
[ERROR] <https://builds.apache.org/job/Accumulo-Trunk/ws/accumulo-trunk/core/src/test/java/org/apache/accumulo/core/iterators/FirstEntryInRowTest.java>:[156,0]
class, interface, or enum expected
[ERROR] <https://builds.apache.org/job/Accumulo-Trunk/ws/accumulo-trunk/core/src/test/java/org/apache/accumulo/core/iterators/FirstEntryInRowTest.java>:[157,0]
class, interface, or enum expected
[ERROR] <https://builds.apache.org/job/Accumulo-Trunk/ws/accumulo-trunk/core/src/test/java/org/apache/accumulo/core/iterators/FirstEntryInRowTest.java>:[158,0]
class, interface, or enum expected
[ERROR] <https://builds.apache.org/job/Accumulo-Trunk/ws/accumulo-trunk/core/src/test/java/org/apache/accumulo/core/iterators/FirstEntryInRowTest.java>:[159,0]
class, interface, or enum expected
[ERROR] <https://builds.apache.org/job/Accumulo-Trunk/ws/accumulo-trunk/core/src/test/java/org/apache/accumulo/core/iterators/FirstEntryInRowTest.java>:[160,0]
class, interface, or enum expected
[INFO] 15 errors 
[INFO] -------------------------------------------------------------
projectFailed org.apache.accumulo:accumulo-core:1.5.0-SNAPSHOT
sessionEnded
[INFO] ------------------------------------------------------------------------
[INFO] Reactor Summary:
[INFO] 
[INFO] accumulo .......................................... SUCCESS [17.578s]
[INFO] cloudtrace ........................................ SUCCESS [12.154s]
[INFO] accumulo-start .................................... SUCCESS [40.794s]
[INFO] accumulo-core ..................................... FAILURE [12.219s]
[INFO] accumulo-server ................................... SKIPPED
[INFO] accumulo-examples ................................. SKIPPED
[INFO] examples-simple ................................... SKIPPED
[INFO] accumulo-wikisearch ............................... SKIPPED
[INFO] wikisearch-ingest ................................. SKIPPED
[INFO] wikisearch-query .................................. SKIPPED
[INFO] wikisearch-query-war .............................. SKIPPED
[INFO] accumulo-assemble ................................. SKIPPED
[INFO] ------------------------------------------------------------------------
[INFO] BUILD FAILURE
[INFO] ------------------------------------------------------------------------
[INFO] Total time: 1:25.915s
[INFO] Finished at: Tue Jun 19 13:03:36 UTC 2012
[INFO] Final Memory: 43M/145M
[INFO] ------------------------------------------------------------------------
Projects to build: [MavenProject: org.apache.accumulo:accumulo:1.5.0-SNAPSHOT @ <https://builds.apache.org/job/Accumulo-Trunk/ws/accumulo-trunk/pom.xml,>
MavenProject: org.apache.accumulo:cloudtrace:1.5.0-SNAPSHOT @ <https://builds.apache.org/job/Accumulo-Trunk/ws/accumulo-trunk/trace/pom.xml,>
MavenProject: org.apache.accumulo:accumulo-start:1.5.0-SNAPSHOT @ <https://builds.apache.org/job/Accumulo-Trunk/ws/accumulo-trunk/start/pom.xml,>
MavenProject: org.apache.accumulo:accumulo-core:1.5.0-SNAPSHOT @ <https://builds.apache.org/job/Accumulo-Trunk/ws/accumulo-trunk/core/pom.xml,>
MavenProject: org.apache.accumulo:accumulo-server:1.5.0-SNAPSHOT @ <https://builds.apache.org/job/Accumulo-Trunk/ws/accumulo-trunk/server/pom.xml,>
MavenProject: org.apache.accumulo:accumulo-examples:1.5.0-SNAPSHOT @ <https://builds.apache.org/job/Accumulo-Trunk/ws/accumulo-trunk/examples/pom.xml,>
MavenProject: org.apache.accumulo:examples-simple:1.5.0-SNAPSHOT @ <https://builds.apache.org/job/Accumulo-Trunk/ws/accumulo-trunk/examples/simple/pom.xml,>
MavenProject: org.apache.accumulo:accumulo-wikisearch:1.5.0-SNAPSHOT @ <https://builds.apache.org/job/Accumulo-Trunk/ws/accumulo-trunk/examples/wikisearch/pom.xml,>
MavenProject: org.apache.accumulo:wikisearch-ingest:1.5.0-SNAPSHOT @ <https://builds.apache.org/job/Accumulo-Trunk/ws/accumulo-trunk/examples/wikisearch/ingest/pom.xml,>
MavenProject: org.apache.accumulo:wikisearch-query:1.5.0-SNAPSHOT @ <https://builds.apache.org/job/Accumulo-Trunk/ws/accumulo-trunk/examples/wikisearch/query/pom.xml,>
MavenProject: org.apache.accumulo:wikisearch-query-war:1.5.0-SNAPSHOT @ <https://builds.apache.org/job/Accumulo-Trunk/ws/accumulo-trunk/examples/wikisearch/query-war/pom.xml,>
MavenProject: org.apache.accumulo:accumulo-assemble:1.5.0-SNAPSHOT @ <https://builds.apache.org/job/Accumulo-Trunk/ws/accumulo-trunk/assemble/pom.xml]>
[JENKINS] Archiving <https://builds.apache.org/job/Accumulo-Trunk/ws/accumulo-trunk/server/pom.xml>
to /home/hudson/hudson/jobs/Accumulo-Trunk/modules/org.apache.accumulo$accumulo-server/builds/2012-06-19_13-02-05/archive/org.apache.accumulo/accumulo-server/1.5.0-SNAPSHOT/accumulo-server-1.5.0-SNAPSHOT.pom
[JENKINS] Archiving <https://builds.apache.org/job/Accumulo-Trunk/ws/accumulo-trunk/assemble/pom.xml>
to /home/hudson/hudson/jobs/Accumulo-Trunk/modules/org.apache.accumulo$accumulo-assemble/builds/2012-06-19_13-02-06/archive/org.apache.accumulo/accumulo-assemble/1.5.0-SNAPSHOT/accumulo-assemble-1.5.0-SNAPSHOT.pom
[JENKINS] Archiving <https://builds.apache.org/job/Accumulo-Trunk/ws/accumulo-trunk/examples/wikisearch/ingest/pom.xml>
to /home/hudson/hudson/jobs/Accumulo-Trunk/modules/org.apache.accumulo$wikisearch-ingest/builds/2012-06-19_13-02-06/archive/org.apache.accumulo/wikisearch-ingest/1.5.0-SNAPSHOT/wikisearch-ingest-1.5.0-SNAPSHOT.pom
[JENKINS] Archiving <https://builds.apache.org/job/Accumulo-Trunk/ws/accumulo-trunk/trace/pom.xml>
to /home/hudson/hudson/jobs/Accumulo-Trunk/modules/org.apache.accumulo$cloudtrace/builds/2012-06-19_13-02-05/archive/org.apache.accumulo/cloudtrace/1.5.0-SNAPSHOT/cloudtrace-1.5.0-SNAPSHOT.pom
[JENKINS] Archiving <https://builds.apache.org/job/Accumulo-Trunk/ws/accumulo-trunk/lib/cloudtrace-1.5.0-SNAPSHOT.jar>
to /home/hudson/hudson/jobs/Accumulo-Trunk/modules/org.apache.accumulo$cloudtrace/builds/2012-06-19_13-02-05/archive/org.apache.accumulo/cloudtrace/1.5.0-SNAPSHOT/cloudtrace-1.5.0-SNAPSHOT.jar
[JENKINS] Archiving <https://builds.apache.org/job/Accumulo-Trunk/ws/accumulo-trunk/examples/pom.xml>
to /home/hudson/hudson/jobs/Accumulo-Trunk/modules/org.apache.accumulo$accumulo-examples/builds/2012-06-19_13-02-06/archive/org.apache.accumulo/accumulo-examples/1.5.0-SNAPSHOT/accumulo-examples-1.5.0-SNAPSHOT.pom
[JENKINS] Archiving <https://builds.apache.org/job/Accumulo-Trunk/ws/accumulo-trunk/examples/wikisearch/query/pom.xml>
to /home/hudson/hudson/jobs/Accumulo-Trunk/modules/org.apache.accumulo$wikisearch-query/builds/2012-06-19_13-02-06/archive/org.apache.accumulo/wikisearch-query/1.5.0-SNAPSHOT/wikisearch-query-1.5.0-SNAPSHOT.pom
[JENKINS] Archiving <https://builds.apache.org/job/Accumulo-Trunk/ws/accumulo-trunk/examples/simple/pom.xml>
to /home/hudson/hudson/jobs/Accumulo-Trunk/modules/org.apache.accumulo$examples-simple/builds/2012-06-19_13-02-06/archive/org.apache.accumulo/examples-simple/1.5.0-SNAPSHOT/examples-simple-1.5.0-SNAPSHOT.pom
[JENKINS] Archiving <https://builds.apache.org/job/Accumulo-Trunk/ws/accumulo-trunk/pom.xml>
to /home/hudson/hudson/jobs/Accumulo-Trunk/modules/org.apache.accumulo$accumulo/builds/2012-06-19_13-02-05/archive/org.apache.accumulo/accumulo/1.5.0-SNAPSHOT/accumulo-1.5.0-SNAPSHOT.pom
[JENKINS] Archiving <https://builds.apache.org/job/Accumulo-Trunk/ws/accumulo-trunk/target/accumulo-1.5.0-SNAPSHOT-site.xml>
to /home/hudson/hudson/jobs/Accumulo-Trunk/modules/org.apache.accumulo$accumulo/builds/2012-06-19_13-02-05/archive/org.apache.accumulo/accumulo/1.5.0-SNAPSHOT/accumulo-1.5.0-SNAPSHOT-site.xml
[JENKINS] Archiving <https://builds.apache.org/job/Accumulo-Trunk/ws/accumulo-trunk/start/pom.xml>
to /home/hudson/hudson/jobs/Accumulo-Trunk/modules/org.apache.accumulo$accumulo-start/builds/2012-06-19_13-02-06/archive/org.apache.accumulo/accumulo-start/1.5.0-SNAPSHOT/accumulo-start-1.5.0-SNAPSHOT.pom
[JENKINS] Archiving <https://builds.apache.org/job/Accumulo-Trunk/ws/accumulo-trunk/lib/accumulo-start-1.5.0-SNAPSHOT.jar>
to /home/hudson/hudson/jobs/Accumulo-Trunk/modules/org.apache.accumulo$accumulo-start/builds/2012-06-19_13-02-06/archive/org.apache.accumulo/accumulo-start/1.5.0-SNAPSHOT/accumulo-start-1.5.0-SNAPSHOT.jar
[JENKINS] Archiving <https://builds.apache.org/job/Accumulo-Trunk/ws/accumulo-trunk/examples/wikisearch/pom.xml>
to /home/hudson/hudson/jobs/Accumulo-Trunk/modules/org.apache.accumulo$accumulo-wikisearch/builds/2012-06-19_13-02-06/archive/org.apache.accumulo/accumulo-wikisearch/1.5.0-SNAPSHOT/accumulo-wikisearch-1.5.0-SNAPSHOT.pom
[JENKINS] Archiving <https://builds.apache.org/job/Accumulo-Trunk/ws/accumulo-trunk/examples/wikisearch/query-war/pom.xml>
to /home/hudson/hudson/jobs/Accumulo-Trunk/modules/org.apache.accumulo$wikisearch-query-war/builds/2012-06-19_13-02-06/archive/org.apache.accumulo/wikisearch-query-war/1.5.0-SNAPSHOT/wikisearch-query-war-1.5.0-SNAPSHOT.pom
[JENKINS] Archiving <https://builds.apache.org/job/Accumulo-Trunk/ws/accumulo-trunk/core/pom.xml>
to /home/hudson/hudson/jobs/Accumulo-Trunk/modules/org.apache.accumulo$accumulo-core/builds/2012-06-19_13-02-05/archive/org.apache.accumulo/accumulo-core/1.5.0-SNAPSHOT/accumulo-core-1.5.0-SNAPSHOT.pom
Waiting for Jenkins to finish collecting data
mavenExecutionResult exceptions not empty
message : Failed to execute goal org.apache.maven.plugins:maven-compiler-plugin:2.3.2:testCompile
(default-testCompile) on project accumulo-core: Compilation failure
cause : Compilation failure
Stack trace : 
org.apache.maven.lifecycle.LifecycleExecutionException: Failed to execute goal org.apache.maven.plugins:maven-compiler-plugin:2.3.2:testCompile
(default-testCompile) on project accumulo-core: Compilation failure
	at org.apache.maven.lifecycle.internal.MojoExecutor.execute(MojoExecutor.java:213)
	at org.apache.maven.lifecycle.internal.MojoExecutor.execute(MojoExecutor.java:153)
	at org.apache.maven.lifecycle.internal.MojoExecutor.execute(MojoExecutor.java:145)
	at org.apache.maven.lifecycle.internal.LifecycleModuleBuilder.buildProject(LifecycleModuleBuilder.java:84)
	at org.apache.maven.lifecycle.internal.LifecycleModuleBuilder.buildProject(LifecycleModuleBuilder.java:59)
	at org.apache.maven.lifecycle.internal.LifecycleStarter.singleThreadedBuild(LifecycleStarter.java:183)
	at org.apache.maven.lifecycle.internal.LifecycleStarter.execute(LifecycleStarter.java:161)
	at org.apache.maven.DefaultMaven.doExecute(DefaultMaven.java:319)
	at org.apache.maven.DefaultMaven.execute(DefaultMaven.java:156)
	at org.jvnet.hudson.maven3.launcher.Maven3Launcher.main(Maven3Launcher.java:79)
	at sun.reflect.NativeMethodAccessorImpl.invoke0(Native Method)
	at sun.reflect.NativeMethodAccessorImpl.invoke(NativeMethodAccessorImpl.java:39)
	at sun.reflect.DelegatingMethodAccessorImpl.invoke(DelegatingMethodAccessorImpl.java:25)
	at java.lang.reflect.Method.invoke(Method.java:597)
	at org.codehaus.plexus.classworlds.launcher.Launcher.launchStandard(Launcher.java:329)
	at org.codehaus.plexus.classworlds.launcher.Launcher.launch(Launcher.java:239)
	at org.jvnet.hudson.maven3.agent.Maven3Main.launch(Maven3Main.java:158)
	at hudson.maven.Maven3Builder.call(Maven3Builder.java:98)
	at hudson.maven.Maven3Builder.call(Maven3Builder.java:64)
	at hudson.remoting.UserRequest.perform(UserRequest.java:118)
	at hudson.remoting.UserRequest.perform(UserRequest.java:48)
	at hudson.remoting.Request$2.run(Request.java:287)
	at hudson.remoting.InterceptingExecutorService$1.call(InterceptingExecutorService.java:72)
	at java.util.concurrent.FutureTask$Sync.innerRun(FutureTask.java:303)
	at java.util.concurrent.FutureTask.run(FutureTask.java:138)
	at java.util.concurrent.ThreadPoolExecutor$Worker.runTask(ThreadPoolExecutor.java:886)
	at java.util.concurrent.ThreadPoolExecutor$Worker.run(ThreadPoolExecutor.java:908)
	at java.lang.Thread.run(Thread.java:662)
Caused by: org.apache.maven.plugin.CompilationFailureException: Compilation failure
	at org.apache.maven.plugin.AbstractCompilerMojo.execute(AbstractCompilerMojo.java:656)
	at org.apache.maven.plugin.TestCompilerMojo.execute(TestCompilerMojo.java:161)
	at org.apache.maven.plugin.DefaultBuildPluginManager.executeMojo(DefaultBuildPluginManager.java:101)
	at org.apache.maven.lifecycle.internal.MojoExecutor.execute(MojoExecutor.java:209)
	... 27 more
Sending e-mails to: dev@accumulo.apache.org
channel stopped
Skipping Cobertura coverage report as build was not UNSTABLE or better ...

Mime
View raw message