accumulo-dev mailing list archives

Site index · List index
Message view « Date » · « Thread »
Top « Date » · « Thread »
From Apache Jenkins Server <jenk...@builds.apache.org>
Subject Build failed in Jenkins: Accumulo-1.4.x #193
Date Thu, 28 Jun 2012 00:11:36 GMT
See <https://builds.apache.org/job/Accumulo-1.4.x/193/>

------------------------------------------
[...truncated 454 lines...]
[INFO] Copying 3 resources

[INFO] 
[INFO] --- maven-resources-plugin:2.5:resources (default-resources) @ accumulo-start ---
mojoSucceeded org.apache.maven.plugins:maven-resources-plugin:2.5(default-resources)
mojoStarted org.apache.maven.plugins:maven-dependency-plugin:2.1(copy-dependencies)[INFO]
commons-io-1.4.jar already exists in destination.
[INFO] commons-logging-1.0.4.jar already exists in destination.
[INFO] commons-logging-api-1.0.4.jar already exists in destination.
[INFO] log4j-1.2.16.jar already exists in destination.
[INFO] commons-jci-core-1.0.jar already exists in destination.
[INFO] commons-jci-fam-1.0.jar already exists in destination.

[INFO] 
[INFO] --- maven-dependency-plugin:2.1:copy-dependencies (copy-dependencies) @ accumulo-start
---
mojoSucceeded org.apache.maven.plugins:maven-dependency-plugin:2.1(copy-dependencies)
mojoStarted org.apache.maven.plugins:maven-compiler-plugin:2.3.2(default-compile)[INFO] Nothing
to compile - all classes are up to date

[INFO] 
[INFO] --- maven-compiler-plugin:2.3.2:compile (default-compile) @ accumulo-start ---
mojoSucceeded org.apache.maven.plugins:maven-compiler-plugin:2.3.2(default-compile)
mojoStarted org.codehaus.mojo:cobertura-maven-plugin:2.5.1(default-cli)
[INFO] 
[INFO] --- cobertura-maven-plugin:2.5.1:instrument (default-cli) @ accumulo-start ---
[INFO] Cobertura 1.9.4.1 - GNU GPL License (NO WARRANTY) - See COPYRIGHT file
Instrumenting 9 files to <https://builds.apache.org/job/Accumulo-1.4.x/ws/1.4/src/start/target/generated-classes/cobertura>
Cobertura: Saved information on 9 classes.
Instrument time: 126ms

[INFO] Instrumentation was successful.
[INFO] NOT adding cobertura ser file to attached artifacts list.
mojoSucceeded org.codehaus.mojo:cobertura-maven-plugin:2.5.1(default-cli)
mojoStarted org.apache.maven.plugins:maven-resources-plugin:2.5(default-testResources)[debug]
execute contextualize
[INFO] Using 'UTF-8' encoding to copy filtered resources.
[INFO] Copying 3 resources
[INFO] Copying 3 resources
[INFO] Copying 3 resources

[INFO] 
[INFO] --- maven-resources-plugin:2.5:testResources (default-testResources) @ accumulo-start
---
mojoSucceeded org.apache.maven.plugins:maven-resources-plugin:2.5(default-testResources)
mojoStarted org.apache.maven.plugins:maven-compiler-plugin:2.3.2(default-testCompile)[INFO]
Nothing to compile - all classes are up to date

[INFO] 
[INFO] --- maven-compiler-plugin:2.3.2:testCompile (default-testCompile) @ accumulo-start
---
mojoSucceeded org.apache.maven.plugins:maven-compiler-plugin:2.3.2(default-testCompile)
mojoStarted org.apache.maven.plugins:maven-surefire-plugin:2.9(default-test)[INFO] Surefire
report directory: <https://builds.apache.org/job/Accumulo-1.4.x/ws/1.4/src/start/target/surefire-reports>

-------------------------------------------------------
 T E S T S
-------------------------------------------------------

[INFO] 
[INFO] --- maven-surefire-plugin:2.9:test (default-test) @ accumulo-start ---
Running org.apache.accumulo.start.Test
Tests run: 2, Failures: 0, Errors: 0, Skipped: 0, Time elapsed: 18.329 sec
Flushing results...
Flushing results done
Cobertura: Loaded information on 9 classes.
Cobertura: Saved information on 9 classes.

Results :

Tests run: 2, Failures: 0, Errors: 0, Skipped: 0

mojoSucceeded org.apache.maven.plugins:maven-surefire-plugin:2.9(default-test)
[JENKINS] Recording test results
forkedProjectSucceeded org.apache.accumulo:accumulo-start:1.4.1-SNAPSHOT
mojoStarted org.codehaus.mojo:cobertura-maven-plugin:2.5.1(default-cli)
[JENKINS] cobertura-maven-plugin already configured with xml reports enabled
[INFO] 
[INFO] --- cobertura-maven-plugin:2.5.1:cobertura (default-cli) @ accumulo-start ---
[INFO] Cobertura 1.9.4.1 - GNU GPL License (NO WARRANTY) - See COPYRIGHT file
Cobertura: Loaded information on 9 classes.
Report time: 258ms

[INFO] Cobertura Report generation was successful.
mojoSucceeded org.codehaus.mojo:cobertura-maven-plugin:2.5.1(default-cli)
[JENKINS] Recording coverage results
projectSucceeded org.apache.accumulo:accumulo-start:1.4.1-SNAPSHOT
projectStarted org.apache.accumulo:accumulo-core:1.4.1-SNAPSHOT
[INFO] Downloading: http://repo1.maven.org/maven2/org/eclipse/m2e/lifecycle-mapping/1.0.0/lifecycle-mapping-1.0.0.pom
[WARNING] The POM for org.eclipse.m2e:lifecycle-mapping:jar:1.0.0 is missing, no dependency
information available
[WARNING] Failed to retrieve plugin descriptor for org.eclipse.m2e:lifecycle-mapping:1.0.0:
Plugin org.eclipse.m2e:lifecycle-mapping:1.0.0 or one of its dependencies could not be resolved:
Failed to read artifact descriptor for org.eclipse.m2e:lifecycle-mapping:jar:1.0.0
                                                                        
[INFO] ------------------------------------------------------------------------
[INFO] Building accumulo-core 1.4.1-SNAPSHOT
[INFO] ------------------------------------------------------------------------
Downloading: http://repo1.maven.org/maven2/org/mortbay/jetty/jetty/maven-metadata.xml
Downloading: http://repository.apache.org/snapshots/org/mortbay/jetty/jetty/maven-metadata.xml
Downloaded: http://repo1.maven.org/maven2/org/mortbay/jetty/jetty/maven-metadata.xml (688
B at 1.7 KB/sec)
mojoStarted org.apache.maven.plugins:maven-clean-plugin:2.4.1(default-clean)[INFO] Deleting
<https://builds.apache.org/job/Accumulo-1.4.x/ws/1.4/src/core/target>

[INFO] 
[INFO] --- maven-clean-plugin:2.4.1:clean (default-clean) @ accumulo-core ---
[INFO] Deleting <https://builds.apache.org/job/Accumulo-1.4.x/ws/1.4/src/core> (includes
= [**/*.pyc], excludes = [])
mojoSucceeded org.apache.maven.plugins:maven-clean-plugin:2.4.1(default-clean)
mojoStarted org.apache.maven.plugins:maven-enforcer-plugin:1.0.1(enforce-mvn)
[INFO] 
[INFO] --- maven-enforcer-plugin:1.0.1:enforce (enforce-mvn) @ accumulo-core ---
mojoSucceeded org.apache.maven.plugins:maven-enforcer-plugin:1.0.1(enforce-mvn)
mojoStarted org.codehaus.mojo:exec-maven-plugin:1.1.1(generate-core-thrift)
[INFO] 
[INFO] --- exec-maven-plugin:1.1.1:exec (generate-core-thrift) @ accumulo-core ---
[INFO] thrift is not available
mojoSucceeded org.codehaus.mojo:exec-maven-plugin:1.1.1(generate-core-thrift)
mojoStarted org.apache.maven.plugins:maven-remote-resources-plugin:1.2.1(default)
[INFO] 
[INFO] --- maven-remote-resources-plugin:1.2.1:process (default) @ accumulo-core ---
mojoSucceeded org.apache.maven.plugins:maven-remote-resources-plugin:1.2.1(default)
[debug] execute contextualize
mojoStarted org.apache.maven.plugins:maven-resources-plugin:2.5(default-resources)[INFO] Using
'UTF-8' encoding to copy filtered resources.
[INFO] skip non existing resourceDirectory <https://builds.apache.org/job/Accumulo-1.4.x/ws/1.4/src/core/src/main/resources>
[INFO] Copying 3 resources

[INFO] 
[INFO] --- maven-resources-plugin:2.5:resources (default-resources) @ accumulo-core ---
mojoSucceeded org.apache.maven.plugins:maven-resources-plugin:2.5(default-resources)
mojoStarted org.apache.maven.plugins:maven-dependency-plugin:2.1(copy-dependencies)[INFO]
Copying commons-collections-3.2.jar to <https://builds.apache.org/job/Accumulo-1.4.x/ws/1.4/lib/commons-collections-3.2.jar>
[INFO] Copying commons-lang-2.4.jar to <https://builds.apache.org/job/Accumulo-1.4.x/ws/1.4/lib/commons-lang-2.4.jar>
[INFO] Copying jline-0.9.94.jar to <https://builds.apache.org/job/Accumulo-1.4.x/ws/1.4/lib/jline-0.9.94.jar>
[INFO] log4j-1.2.16.jar already exists in destination.
[INFO] libthrift-0.6.1.jar already exists in destination.

[INFO] 
[INFO] --- maven-dependency-plugin:2.1:copy-dependencies (copy-dependencies) @ accumulo-core
---
mojoSucceeded org.apache.maven.plugins:maven-dependency-plugin:2.1(copy-dependencies)
mojoStarted org.apache.maven.plugins:maven-compiler-plugin:2.3.2(default-compile)
[INFO] 
[INFO] --- maven-compiler-plugin:2.3.2:compile (default-compile) @ accumulo-core ---
[INFO] Compiling 437 source files to <https://builds.apache.org/job/Accumulo-1.4.x/ws/1.4/src/core/target/classes>
mojoSucceeded org.apache.maven.plugins:maven-compiler-plugin:2.3.2(default-compile)
mojoStarted org.codehaus.mojo:exec-maven-plugin:1.1.1(generate-documentation)[INFO] HADOOP_HOME
is not set

[INFO] 
[INFO] --- exec-maven-plugin:1.1.1:exec (generate-documentation) @ accumulo-core ---
mojoSucceeded org.codehaus.mojo:exec-maven-plugin:1.1.1(generate-documentation)
[debug] execute contextualize
mojoStarted org.apache.maven.plugins:maven-resources-plugin:2.5(default-testResources)[INFO]
Using 'UTF-8' encoding to copy filtered resources.
[INFO] Copying 2 resources
[INFO] Copying 3 resources

[INFO] 
[INFO] --- maven-resources-plugin:2.5:testResources (default-testResources) @ accumulo-core
---
mojoSucceeded org.apache.maven.plugins:maven-resources-plugin:2.5(default-testResources)
mojoStarted org.apache.maven.plugins:maven-compiler-plugin:2.3.2(default-testCompile)[INFO]
Compiling 62 source files to <https://builds.apache.org/job/Accumulo-1.4.x/ws/1.4/src/core/target/test-classes>

[INFO] 
[INFO] --- maven-compiler-plugin:2.3.2:testCompile (default-testCompile) @ accumulo-core ---
[INFO] -------------------------------------------------------------
[ERROR] COMPILATION ERROR : 
[INFO] -------------------------------------------------------------
[ERROR] <https://builds.apache.org/job/Accumulo-1.4.x/ws/1.4/src/core/src/test/java/org/apache/accumulo/core/iterators/FirstEntryInRowTest.java>:[143,0]
class, interface, or enum expected
[ERROR] <https://builds.apache.org/job/Accumulo-1.4.x/ws/1.4/src/core/src/test/java/org/apache/accumulo/core/iterators/FirstEntryInRowTest.java>:[145,0]
class, interface, or enum expected
[ERROR] <https://builds.apache.org/job/Accumulo-1.4.x/ws/1.4/src/core/src/test/java/org/apache/accumulo/core/iterators/FirstEntryInRowTest.java>:[146,0]
class, interface, or enum expected
[ERROR] <https://builds.apache.org/job/Accumulo-1.4.x/ws/1.4/src/core/src/test/java/org/apache/accumulo/core/iterators/FirstEntryInRowTest.java>:[147,0]
class, interface, or enum expected
[ERROR] <https://builds.apache.org/job/Accumulo-1.4.x/ws/1.4/src/core/src/test/java/org/apache/accumulo/core/iterators/FirstEntryInRowTest.java>:[149,0]
class, interface, or enum expected
[ERROR] <https://builds.apache.org/job/Accumulo-1.4.x/ws/1.4/src/core/src/test/java/org/apache/accumulo/core/iterators/FirstEntryInRowTest.java>:[150,0]
class, interface, or enum expected
[ERROR] <https://builds.apache.org/job/Accumulo-1.4.x/ws/1.4/src/core/src/test/java/org/apache/accumulo/core/iterators/FirstEntryInRowTest.java>:[151,0]
class, interface, or enum expected
[ERROR] <https://builds.apache.org/job/Accumulo-1.4.x/ws/1.4/src/core/src/test/java/org/apache/accumulo/core/iterators/FirstEntryInRowTest.java>:[152,0]
class, interface, or enum expected
[ERROR] <https://builds.apache.org/job/Accumulo-1.4.x/ws/1.4/src/core/src/test/java/org/apache/accumulo/core/iterators/FirstEntryInRowTest.java>:[153,0]
class, interface, or enum expected
[ERROR] <https://builds.apache.org/job/Accumulo-1.4.x/ws/1.4/src/core/src/test/java/org/apache/accumulo/core/iterators/FirstEntryInRowTest.java>:[155,0]
class, interface, or enum expected
[ERROR] <https://builds.apache.org/job/Accumulo-1.4.x/ws/1.4/src/core/src/test/java/org/apache/accumulo/core/iterators/FirstEntryInRowTest.java>:[156,0]
class, interface, or enum expected
mojoFailed org.apache.maven.plugins:maven-compiler-plugin:2.3.2(default-testCompile)[ERROR]
<https://builds.apache.org/job/Accumulo-1.4.x/ws/1.4/src/core/src/test/java/org/apache/accumulo/core/iterators/FirstEntryInRowTest.java>:[157,0]
class, interface, or enum expected
[ERROR] <https://builds.apache.org/job/Accumulo-1.4.x/ws/1.4/src/core/src/test/java/org/apache/accumulo/core/iterators/FirstEntryInRowTest.java>:[158,0]
class, interface, or enum expected
[ERROR] <https://builds.apache.org/job/Accumulo-1.4.x/ws/1.4/src/core/src/test/java/org/apache/accumulo/core/iterators/FirstEntryInRowTest.java>:[159,0]
class, interface, or enum expected
[ERROR] <https://builds.apache.org/job/Accumulo-1.4.x/ws/1.4/src/core/src/test/java/org/apache/accumulo/core/iterators/FirstEntryInRowTest.java>:[160,0]
class, interface, or enum expected
[INFO] 15 errors 
[INFO] -------------------------------------------------------------

projectFailed org.apache.accumulo:accumulo-core:1.4.1-SNAPSHOT
sessionEnded
[INFO] ------------------------------------------------------------------------
[INFO] Reactor Summary:
[INFO] 
[INFO] accumulo .......................................... SUCCESS [21.331s]
[INFO] cloudtrace ........................................ SUCCESS [28.487s]
[INFO] accumulo-start .................................... SUCCESS [43.485s]
[INFO] accumulo-core ..................................... FAILURE [12.234s]
[INFO] accumulo-server ................................... SKIPPED
[INFO] accumulo-examples ................................. SKIPPED
[INFO] examples-simple ................................... SKIPPED
[INFO] accumulo-wikisearch ............................... SKIPPED
[INFO] wikisearch-ingest ................................. SKIPPED
[INFO] wikisearch-query .................................. SKIPPED
[INFO] wikisearch-query-war .............................. SKIPPED
[INFO] ------------------------------------------------------------------------
[INFO] BUILD FAILURE
[INFO] ------------------------------------------------------------------------
[INFO] Total time: 1:48.641s
[INFO] Finished at: Thu Jun 28 00:11:28 UTC 2012
[INFO] Final Memory: 46M/238M
[INFO] ------------------------------------------------------------------------
Projects to build: [MavenProject: org.apache.accumulo:accumulo:1.4.1-SNAPSHOT @ <https://builds.apache.org/job/Accumulo-1.4.x/ws/1.4/pom.xml,>
MavenProject: org.apache.accumulo:cloudtrace:1.4.1-SNAPSHOT @ <https://builds.apache.org/job/Accumulo-1.4.x/ws/1.4/src/trace/pom.xml,>
MavenProject: org.apache.accumulo:accumulo-start:1.4.1-SNAPSHOT @ <https://builds.apache.org/job/Accumulo-1.4.x/ws/1.4/src/start/pom.xml,>
MavenProject: org.apache.accumulo:accumulo-core:1.4.1-SNAPSHOT @ <https://builds.apache.org/job/Accumulo-1.4.x/ws/1.4/src/core/pom.xml,>
MavenProject: org.apache.accumulo:accumulo-server:1.4.1-SNAPSHOT @ <https://builds.apache.org/job/Accumulo-1.4.x/ws/1.4/src/server/pom.xml,>
MavenProject: org.apache.accumulo:accumulo-examples:1.4.1-SNAPSHOT @ <https://builds.apache.org/job/Accumulo-1.4.x/ws/1.4/src/examples/pom.xml,>
MavenProject: org.apache.accumulo:examples-simple:1.4.1-SNAPSHOT @ <https://builds.apache.org/job/Accumulo-1.4.x/ws/1.4/src/examples/simple/pom.xml,>
MavenProject: org.apache.accumulo:accumulo-wikisearch:1.4.1-SNAPSHOT @ <https://builds.apache.org/job/Accumulo-1.4.x/ws/1.4/src/examples/wikisearch/pom.xml,>
MavenProject: org.apache.accumulo:wikisearch-ingest:1.4.1-SNAPSHOT @ <https://builds.apache.org/job/Accumulo-1.4.x/ws/1.4/src/examples/wikisearch/ingest/pom.xml,>
MavenProject: org.apache.accumulo:wikisearch-query:1.4.1-SNAPSHOT @ <https://builds.apache.org/job/Accumulo-1.4.x/ws/1.4/src/examples/wikisearch/query/pom.xml,>
MavenProject: org.apache.accumulo:wikisearch-query-war:1.4.1-SNAPSHOT @ <https://builds.apache.org/job/Accumulo-1.4.x/ws/1.4/src/examples/wikisearch/query-war/pom.xml]>
[JENKINS] Archiving <https://builds.apache.org/job/Accumulo-1.4.x/ws/1.4/src/examples/wikisearch/ingest/pom.xml>
to /home/hudson/hudson/jobs/Accumulo-1.4.x/modules/org.apache.accumulo$wikisearch-ingest/builds/2012-06-28_00-09-27/archive/org.apache.accumulo/wikisearch-ingest/1.4.1-SNAPSHOT/wikisearch-ingest-1.4.1-SNAPSHOT.pom
[JENKINS] Archiving <https://builds.apache.org/job/Accumulo-1.4.x/ws/1.4/src/server/pom.xml>
to /home/hudson/hudson/jobs/Accumulo-1.4.x/modules/org.apache.accumulo$accumulo-server/builds/2012-06-28_00-09-26/archive/org.apache.accumulo/accumulo-server/1.4.1-SNAPSHOT/accumulo-server-1.4.1-SNAPSHOT.pom
[JENKINS] Archiving <https://builds.apache.org/job/Accumulo-1.4.x/ws/1.4/src/trace/pom.xml>
to /home/hudson/hudson/jobs/Accumulo-1.4.x/modules/org.apache.accumulo$cloudtrace/builds/2012-06-28_00-09-26/archive/org.apache.accumulo/cloudtrace/1.4.1-SNAPSHOT/cloudtrace-1.4.1-SNAPSHOT.pom
[JENKINS] Archiving <https://builds.apache.org/job/Accumulo-1.4.x/ws/1.4/lib/cloudtrace-1.4.1-SNAPSHOT.jar>
to /home/hudson/hudson/jobs/Accumulo-1.4.x/modules/org.apache.accumulo$cloudtrace/builds/2012-06-28_00-09-26/archive/org.apache.accumulo/cloudtrace/1.4.1-SNAPSHOT/cloudtrace-1.4.1-SNAPSHOT.jar
[JENKINS] Archiving <https://builds.apache.org/job/Accumulo-1.4.x/ws/1.4/src/examples/pom.xml>
to /home/hudson/hudson/jobs/Accumulo-1.4.x/modules/org.apache.accumulo$accumulo-examples/builds/2012-06-28_00-09-27/archive/org.apache.accumulo/accumulo-examples/1.4.1-SNAPSHOT/accumulo-examples-1.4.1-SNAPSHOT.pom
[JENKINS] Archiving <https://builds.apache.org/job/Accumulo-1.4.x/ws/1.4/src/examples/wikisearch/query/pom.xml>
to /home/hudson/hudson/jobs/Accumulo-1.4.x/modules/org.apache.accumulo$wikisearch-query/builds/2012-06-28_00-09-27/archive/org.apache.accumulo/wikisearch-query/1.4.1-SNAPSHOT/wikisearch-query-1.4.1-SNAPSHOT.pom
[JENKINS] Archiving <https://builds.apache.org/job/Accumulo-1.4.x/ws/1.4/src/examples/simple/pom.xml>
to /home/hudson/hudson/jobs/Accumulo-1.4.x/modules/org.apache.accumulo$examples-simple/builds/2012-06-28_00-09-27/archive/org.apache.accumulo/examples-simple/1.4.1-SNAPSHOT/examples-simple-1.4.1-SNAPSHOT.pom
[JENKINS] Archiving <https://builds.apache.org/job/Accumulo-1.4.x/ws/1.4/pom.xml> to
/home/hudson/hudson/jobs/Accumulo-1.4.x/modules/org.apache.accumulo$accumulo/builds/2012-06-28_00-09-26/archive/org.apache.accumulo/accumulo/1.4.1-SNAPSHOT/accumulo-1.4.1-SNAPSHOT.pom
[JENKINS] Archiving <https://builds.apache.org/job/Accumulo-1.4.x/ws/1.4/src/start/pom.xml>
to /home/hudson/hudson/jobs/Accumulo-1.4.x/modules/org.apache.accumulo$accumulo-start/builds/2012-06-28_00-09-26/archive/org.apache.accumulo/accumulo-start/1.4.1-SNAPSHOT/accumulo-start-1.4.1-SNAPSHOT.pom
[JENKINS] Archiving <https://builds.apache.org/job/Accumulo-1.4.x/ws/1.4/lib/accumulo-start-1.4.1-SNAPSHOT.jar>
to /home/hudson/hudson/jobs/Accumulo-1.4.x/modules/org.apache.accumulo$accumulo-start/builds/2012-06-28_00-09-26/archive/org.apache.accumulo/accumulo-start/1.4.1-SNAPSHOT/accumulo-start-1.4.1-SNAPSHOT.jar
[JENKINS] Archiving <https://builds.apache.org/job/Accumulo-1.4.x/ws/1.4/src/examples/wikisearch/pom.xml>
to /home/hudson/hudson/jobs/Accumulo-1.4.x/modules/org.apache.accumulo$accumulo-wikisearch/builds/2012-06-28_00-09-27/archive/org.apache.accumulo/accumulo-wikisearch/1.4.1-SNAPSHOT/accumulo-wikisearch-1.4.1-SNAPSHOT.pom
[JENKINS] Archiving <https://builds.apache.org/job/Accumulo-1.4.x/ws/1.4/src/examples/wikisearch/query-war/pom.xml>
to /home/hudson/hudson/jobs/Accumulo-1.4.x/modules/org.apache.accumulo$wikisearch-query-war/builds/2012-06-28_00-09-27/archive/org.apache.accumulo/wikisearch-query-war/1.4.1-SNAPSHOT/wikisearch-query-war-1.4.1-SNAPSHOT.pom
[JENKINS] Archiving <https://builds.apache.org/job/Accumulo-1.4.x/ws/1.4/src/core/pom.xml>
to /home/hudson/hudson/jobs/Accumulo-1.4.x/modules/org.apache.accumulo$accumulo-core/builds/2012-06-28_00-09-26/archive/org.apache.accumulo/accumulo-core/1.4.1-SNAPSHOT/accumulo-core-1.4.1-SNAPSHOT.pom
Waiting for Jenkins to finish collecting data
mavenExecutionResult exceptions not empty
message : Failed to execute goal org.apache.maven.plugins:maven-compiler-plugin:2.3.2:testCompile
(default-testCompile) on project accumulo-core: Compilation failure
cause : Compilation failure
Stack trace : 
org.apache.maven.lifecycle.LifecycleExecutionException: Failed to execute goal org.apache.maven.plugins:maven-compiler-plugin:2.3.2:testCompile
(default-testCompile) on project accumulo-core: Compilation failure
	at org.apache.maven.lifecycle.internal.MojoExecutor.execute(MojoExecutor.java:213)
	at org.apache.maven.lifecycle.internal.MojoExecutor.execute(MojoExecutor.java:153)
	at org.apache.maven.lifecycle.internal.MojoExecutor.execute(MojoExecutor.java:145)
	at org.apache.maven.lifecycle.internal.LifecycleModuleBuilder.buildProject(LifecycleModuleBuilder.java:84)
	at org.apache.maven.lifecycle.internal.LifecycleModuleBuilder.buildProject(LifecycleModuleBuilder.java:59)
	at org.apache.maven.lifecycle.internal.LifecycleStarter.singleThreadedBuild(LifecycleStarter.java:183)
	at org.apache.maven.lifecycle.internal.LifecycleStarter.execute(LifecycleStarter.java:161)
	at org.apache.maven.DefaultMaven.doExecute(DefaultMaven.java:319)
	at org.apache.maven.DefaultMaven.execute(DefaultMaven.java:156)
	at org.jvnet.hudson.maven3.launcher.Maven3Launcher.main(Maven3Launcher.java:79)
	at sun.reflect.NativeMethodAccessorImpl.invoke0(Native Method)
	at sun.reflect.NativeMethodAccessorImpl.invoke(NativeMethodAccessorImpl.java:39)
	at sun.reflect.DelegatingMethodAccessorImpl.invoke(DelegatingMethodAccessorImpl.java:25)
	at java.lang.reflect.Method.invoke(Method.java:597)
	at org.codehaus.plexus.classworlds.launcher.Launcher.launchStandard(Launcher.java:329)
	at org.codehaus.plexus.classworlds.launcher.Launcher.launch(Launcher.java:239)
	at org.jvnet.hudson.maven3.agent.Maven3Main.launch(Maven3Main.java:158)
	at hudson.maven.Maven3Builder.call(Maven3Builder.java:98)
	at hudson.maven.Maven3Builder.call(Maven3Builder.java:64)
	at hudson.remoting.UserRequest.perform(UserRequest.java:118)
	at hudson.remoting.UserRequest.perform(UserRequest.java:48)
	at hudson.remoting.Request$2.run(Request.java:326)
	at hudson.remoting.InterceptingExecutorService$1.call(InterceptingExecutorService.java:72)
	at java.util.concurrent.FutureTask$Sync.innerRun(FutureTask.java:303)
	at java.util.concurrent.FutureTask.run(FutureTask.java:138)
	at java.util.concurrent.ThreadPoolExecutor$Worker.runTask(ThreadPoolExecutor.java:886)
	at java.util.concurrent.ThreadPoolExecutor$Worker.run(ThreadPoolExecutor.java:908)
	at java.lang.Thread.run(Thread.java:662)
Caused by: org.apache.maven.plugin.CompilationFailureException: Compilation failure
	at org.apache.maven.plugin.AbstractCompilerMojo.execute(AbstractCompilerMojo.java:656)
	at org.apache.maven.plugin.TestCompilerMojo.execute(TestCompilerMojo.java:161)
	at org.apache.maven.plugin.DefaultBuildPluginManager.executeMojo(DefaultBuildPluginManager.java:101)
	at org.apache.maven.lifecycle.internal.MojoExecutor.execute(MojoExecutor.java:209)
	... 27 more
Sending e-mails to: dev@accumulo.apache.org
channel stopped
Skipping Cobertura coverage report as build was not UNSTABLE or better ...

Mime
View raw message