accumulo-dev mailing list archives

Site index · List index
Message view « Date » · « Thread »
Top « Date » · « Thread »
From Apache Jenkins Server <jenk...@builds.apache.org>
Subject Build failed in Jenkins: Accumulo-Trunk #344
Date Thu, 10 May 2012 13:14:28 GMT
See <https://builds.apache.org/job/Accumulo-Trunk/344/changes>

Changes:

[vines] Merging ACCUMULO-480

------------------------------------------
[...truncated 2151 lines...]

[INFO] 
[INFO] --- maven-compiler-plugin:2.3.2:compile (default-compile) @ wikisearch-query-war ---
mojoSucceeded org.apache.maven.plugins:maven-compiler-plugin:2.3.2(default-compile)
mojoStarted org.apache.maven.plugins:maven-resources-plugin:2.5(default-testResources)[debug]
execute contextualize
[INFO] Using 'UTF-8' encoding to copy filtered resources.
[INFO] Copying 1 resource

[INFO] [INFO] Copying 3 resources

[INFO] --- maven-resources-plugin:2.5:testResources (default-testResources) @ wikisearch-query-war
---
mojoSucceeded org.apache.maven.plugins:maven-resources-plugin:2.5(default-testResources)
mojoStarted org.apache.maven.plugins:maven-compiler-plugin:2.3.2(default-testCompile)[INFO]
No sources to compile

[INFO] 
[INFO] --- maven-compiler-plugin:2.3.2:testCompile (default-testCompile) @ wikisearch-query-war
---
mojoSucceeded org.apache.maven.plugins:maven-compiler-plugin:2.3.2(default-testCompile)
mojoStarted org.apache.maven.plugins:maven-surefire-plugin:2.12(default-test)[INFO] Surefire
report directory: <https://builds.apache.org/job/Accumulo-Trunk/ws/accumulo-trunk/examples/wikisearch/query-war/target/surefire-reports>

-------------------------------------------------------
 T E S T S
-------------------------------------------------------

[INFO] 
[INFO] --- maven-surefire-plugin:2.12:test (default-test) @ wikisearch-query-war ---

mojoSucceeded org.apache.maven.plugins:maven-surefire-plugin:2.12(default-test)Results :

Tests run: 0, Failures: 0, Errors: 0, Skipped: 0


[JENKINS] Recording test results
mojoStarted org.apache.maven.plugins:maven-war-plugin:2.1.1(default-war)
[INFO] 
[INFO] --- maven-war-plugin:2.1.1:war (default-war) @ wikisearch-query-war ---
[INFO] Packaging webapp
[INFO] Assembling webapp [wikisearch-query-war] in [<https://builds.apache.org/job/Accumulo-Trunk/ws/accumulo-trunk/examples/wikisearch/query-war/target/wikisearch-query-war-1.5.0-SNAPSHOT]>
[INFO] Processing war project
[INFO] Copying webapp resources [<https://builds.apache.org/job/Accumulo-Trunk/ws/accumulo-trunk/examples/wikisearch/query-war/src/main/webapp]>
[INFO] Webapp assembled in [32 msecs]
[INFO] Building war: <https://builds.apache.org/job/Accumulo-Trunk/ws/accumulo-trunk/examples/wikisearch/query-war/target/wikisearch-query-war-1.5.0-SNAPSHOT.war>
[INFO] WEB-INF/web.xml already added, skipping
mojoSucceeded org.apache.maven.plugins:maven-war-plugin:2.1.1(default-war)
mojoStarted org.apache.maven.plugins:maven-site-plugin:3.0(attach-descriptor)
[INFO] 
[INFO] --- maven-site-plugin:3.0:attach-descriptor (attach-descriptor) @ wikisearch-query-war
---
mojoSucceeded org.apache.maven.plugins:maven-site-plugin:3.0(attach-descriptor)
[JENKINS] Configuring cobertura-maven-plugin to enable xml reports
forkedProjectStarted org.apache.accumulo:wikisearch-query-war:1.5.0-SNAPSHOT
mojoStarted org.apache.maven.plugins:maven-enforcer-plugin:1.0.1(enforce-mvn)
[INFO] 
[INFO] --- maven-enforcer-plugin:1.0.1:enforce (enforce-mvn) @ wikisearch-query-war ---
mojoSucceeded org.apache.maven.plugins:maven-enforcer-plugin:1.0.1(enforce-mvn)
mojoStarted org.apache.maven.plugins:maven-remote-resources-plugin:1.2.1(default)
[INFO] 
[INFO] --- maven-remote-resources-plugin:1.2.1:process (default) @ wikisearch-query-war ---
mojoSucceeded org.apache.maven.plugins:maven-remote-resources-plugin:1.2.1(default)
[debug] execute contextualize
mojoStarted org.apache.maven.plugins:maven-resources-plugin:2.5(default-resources)[INFO] Using
'UTF-8' encoding to copy filtered resources.
[INFO] skip non existing resourceDirectory <https://builds.apache.org/job/Accumulo-Trunk/ws/accumulo-trunk/examples/wikisearch/query-war/src/main/resources>
[INFO] Copying 3 resources
[INFO] Copying 3 resources

[INFO] 
[INFO] --- maven-resources-plugin:2.5:resources (default-resources) @ wikisearch-query-war
---
mojoSucceeded org.apache.maven.plugins:maven-resources-plugin:2.5(default-resources)
mojoStarted org.apache.maven.plugins:maven-compiler-plugin:2.3.2(default-compile)[INFO] No
sources to compile

[INFO] 
[INFO] --- maven-compiler-plugin:2.3.2:compile (default-compile) @ wikisearch-query-war ---
mojoSucceeded org.apache.maven.plugins:maven-compiler-plugin:2.3.2(default-compile)
mojoStarted org.codehaus.mojo:cobertura-maven-plugin:2.5.1(default-cli)[WARNING] No files
to instrument.
[INFO] NOT adding cobertura ser file to attached artifacts list.

[INFO] 
[INFO] --- cobertura-maven-plugin:2.5.1:instrument (default-cli) @ wikisearch-query-war ---
mojoSucceeded org.codehaus.mojo:cobertura-maven-plugin:2.5.1(default-cli)
[debug] execute contextualize
mojoStarted org.apache.maven.plugins:maven-resources-plugin:2.5(default-testResources)[INFO]
Using 'UTF-8' encoding to copy filtered resources.
[INFO] Copying 1 resource
[INFO] Copying 3 resources
[INFO] Copying 3 resources

[INFO] 
[INFO] --- maven-resources-plugin:2.5:testResources (default-testResources) @ wikisearch-query-war
---
mojoSucceeded org.apache.maven.plugins:maven-resources-plugin:2.5(default-testResources)
mojoStarted org.apache.maven.plugins:maven-compiler-plugin:2.3.2(default-testCompile)[INFO]
No sources to compile

[INFO] 
[INFO] --- maven-compiler-plugin:2.3.2:testCompile (default-testCompile) @ wikisearch-query-war
---
mojoSucceeded org.apache.maven.plugins:maven-compiler-plugin:2.3.2(default-testCompile)
mojoStarted org.apache.maven.plugins:maven-surefire-plugin:2.12(default-test)[INFO] Surefire
report directory: <https://builds.apache.org/job/Accumulo-Trunk/ws/accumulo-trunk/examples/wikisearch/query-war/target/surefire-reports>

-------------------------------------------------------
 T E S T S
-------------------------------------------------------

[INFO] 
[INFO] --- maven-surefire-plugin:2.12:test (default-test) @ wikisearch-query-war ---

Results :

Tests run: 0, Failures: 0, Errors: 0, Skipped: 0

mojoSucceeded org.apache.maven.plugins:maven-surefire-plugin:2.12(default-test)
[JENKINS] Recording test results
forkedProjectSucceeded org.apache.accumulo:wikisearch-query-war:1.5.0-SNAPSHOT
mojoStarted org.codehaus.mojo:cobertura-maven-plugin:2.5.1(default-cli)
[JENKINS] cobertura-maven-plugin already configured with xml reports enabled
[INFO] 
[INFO] --- cobertura-maven-plugin:2.5.1:cobertura (default-cli) @ wikisearch-query-war ---
mojoSucceeded org.codehaus.mojo:cobertura-maven-plugin:2.5.1(default-cli)
projectSucceeded org.apache.accumulo:wikisearch-query-war:1.5.0-SNAPSHOT
projectStarted org.apache.accumulo:accumulo-assemble:1.5.0-SNAPSHOT
[INFO] Downloading: http://repo1.maven.org/maven2/org/eclipse/m2e/lifecycle-mapping/1.0.0/lifecycle-mapping-1.0.0.pom
                                                                        
[INFO] ------------------------------------------------------------------------
[INFO] Building accumulo-assemble 1.5.0-SNAPSHOT
[INFO] ------------------------------------------------------------------------
[WARNING] The POM for org.eclipse.m2e:lifecycle-mapping:jar:1.0.0 is missing, no dependency
information available
[WARNING] Failed to retrieve plugin descriptor for org.eclipse.m2e:lifecycle-mapping:1.0.0:
Plugin org.eclipse.m2e:lifecycle-mapping:1.0.0 or one of its dependencies could not be resolved:
Failed to read artifact descriptor for org.eclipse.m2e:lifecycle-mapping:jar:1.0.0
mojoStarted org.apache.maven.plugins:maven-clean-plugin:2.4.1(default-clean)[INFO] Deleting
<https://builds.apache.org/job/Accumulo-Trunk/ws/accumulo-trunk/assemble/target>
[INFO] Deleting <https://builds.apache.org/job/Accumulo-Trunk/ws/accumulo-trunk/assemble>
(includes = [**/*.pyc], excludes = [])

[INFO] 
[INFO] --- maven-clean-plugin:2.4.1:clean (default-clean) @ accumulo-assemble ---
mojoSucceeded org.apache.maven.plugins:maven-clean-plugin:2.4.1(default-clean)
mojoStarted org.apache.maven.plugins:maven-enforcer-plugin:1.0.1(enforce-mvn)
[INFO] 
[INFO] --- maven-enforcer-plugin:1.0.1:enforce (enforce-mvn) @ accumulo-assemble ---
mojoSucceeded org.apache.maven.plugins:maven-enforcer-plugin:1.0.1(enforce-mvn)
mojoStarted org.apache.maven.plugins:maven-remote-resources-plugin:1.2.1(default)
[INFO] 
[INFO] --- maven-remote-resources-plugin:1.2.1:process (default) @ accumulo-assemble ---
mojoSucceeded org.apache.maven.plugins:maven-remote-resources-plugin:1.2.1(default)
mojoStarted org.apache.maven.plugins:maven-dependency-plugin:2.3(copy-dependencies)
[INFO] 
[INFO] --- maven-dependency-plugin:2.3:copy-dependencies (copy-dependencies) @ accumulo-assemble
---
mojoSucceeded org.apache.maven.plugins:maven-dependency-plugin:2.3(copy-dependencies)
mojoStarted org.codehaus.mojo:exec-maven-plugin:1.2.1(user-manual)Missing pdflatex command.
Please install.

[INFO] 
[INFO] --- exec-maven-plugin:1.2.1:exec (user-manual) @ accumulo-assemble ---
mojoSucceeded org.codehaus.mojo:exec-maven-plugin:1.2.1(user-manual)
mojoStarted org.apache.maven.plugins:maven-site-plugin:3.0(attach-descriptor)
[INFO] 
[INFO] --- maven-site-plugin:3.0:attach-descriptor (attach-descriptor) @ accumulo-assemble
---
mojoSucceeded org.apache.maven.plugins:maven-site-plugin:3.0(attach-descriptor)
mojoStarted org.codehaus.mojo:exec-maven-plugin:1.2.1(config webpage)
[INFO] 
[INFO] --- exec-maven-plugin:1.2.1:exec (config webpage) @ accumulo-assemble ---
Exception in thread "main" java.lang.ArrayIndexOutOfBoundsException: 0
	at org.apache.accumulo.core.conf.DefaultConfiguration.generateDocumentation(DefaultConfiguration.java:105)
	at org.apache.accumulo.core.conf.DefaultConfiguration.main(DefaultConfiguration.java:141)
mojoFailed org.codehaus.mojo:exec-maven-plugin:1.2.1(config webpage)
projectFailed org.apache.accumulo:accumulo-assemble:1.5.0-SNAPSHOT
sessionEnded
[INFO] ------------------------------------------------------------------------
[INFO] Reactor Summary:
[INFO] 
[INFO] accumulo .......................................... SUCCESS [31.125s]
[INFO] cloudtrace ........................................ SUCCESS [31.023s]
[INFO] accumulo-start .................................... SUCCESS [44.939s]
[INFO] accumulo-core ..................................... SUCCESS [6:01.492s]
[INFO] accumulo-server ................................... SUCCESS [2:41.745s]
[INFO] accumulo-examples ................................. SUCCESS [1.678s]
[INFO] examples-simple ................................... SUCCESS [23.913s]
[INFO] accumulo-wikisearch ............................... SUCCESS [1.615s]
[INFO] wikisearch-ingest ................................. SUCCESS [19.465s]
[INFO] wikisearch-query .................................. SUCCESS [39.628s]
[INFO] wikisearch-query-war .............................. SUCCESS [4.305s]
[INFO] accumulo-assemble ................................. FAILURE [1.544s]
[INFO] ------------------------------------------------------------------------
[INFO] BUILD FAILURE
[INFO] ------------------------------------------------------------------------
[INFO] Total time: 12:08.263s
[INFO] Finished at: Thu May 10 13:13:52 UTC 2012
[INFO] Final Memory: 88M/225M
[INFO] ------------------------------------------------------------------------
Projects to build: [MavenProject: org.apache.accumulo:accumulo:1.5.0-SNAPSHOT @ <https://builds.apache.org/job/Accumulo-Trunk/ws/accumulo-trunk/pom.xml,>
MavenProject: org.apache.accumulo:cloudtrace:1.5.0-SNAPSHOT @ <https://builds.apache.org/job/Accumulo-Trunk/ws/accumulo-trunk/trace/pom.xml,>
MavenProject: org.apache.accumulo:accumulo-start:1.5.0-SNAPSHOT @ <https://builds.apache.org/job/Accumulo-Trunk/ws/accumulo-trunk/start/pom.xml,>
MavenProject: org.apache.accumulo:accumulo-core:1.5.0-SNAPSHOT @ <https://builds.apache.org/job/Accumulo-Trunk/ws/accumulo-trunk/core/pom.xml,>
MavenProject: org.apache.accumulo:accumulo-server:1.5.0-SNAPSHOT @ <https://builds.apache.org/job/Accumulo-Trunk/ws/accumulo-trunk/server/pom.xml,>
MavenProject: org.apache.accumulo:accumulo-examples:1.5.0-SNAPSHOT @ <https://builds.apache.org/job/Accumulo-Trunk/ws/accumulo-trunk/examples/pom.xml,>
MavenProject: org.apache.accumulo:examples-simple:1.5.0-SNAPSHOT @ <https://builds.apache.org/job/Accumulo-Trunk/ws/accumulo-trunk/examples/simple/pom.xml,>
MavenProject: org.apache.accumulo:accumulo-wikisearch:1.5.0-SNAPSHOT @ <https://builds.apache.org/job/Accumulo-Trunk/ws/accumulo-trunk/examples/wikisearch/pom.xml,>
MavenProject: org.apache.accumulo:wikisearch-ingest:1.5.0-SNAPSHOT @ <https://builds.apache.org/job/Accumulo-Trunk/ws/accumulo-trunk/examples/wikisearch/ingest/pom.xml,>
MavenProject: org.apache.accumulo:wikisearch-query:1.5.0-SNAPSHOT @ <https://builds.apache.org/job/Accumulo-Trunk/ws/accumulo-trunk/examples/wikisearch/query/pom.xml,>
MavenProject: org.apache.accumulo:wikisearch-query-war:1.5.0-SNAPSHOT @ <https://builds.apache.org/job/Accumulo-Trunk/ws/accumulo-trunk/examples/wikisearch/query-war/pom.xml,>
MavenProject: org.apache.accumulo:accumulo-assemble:1.5.0-SNAPSHOT @ <https://builds.apache.org/job/Accumulo-Trunk/ws/accumulo-trunk/assemble/pom.xml]>
[JENKINS] Archiving <https://builds.apache.org/job/Accumulo-Trunk/ws/accumulo-trunk/server/pom.xml>
to /home/hudson/hudson/jobs/Accumulo-Trunk/modules/org.apache.accumulo$accumulo-server/builds/2012-05-10_13-01-30/archive/org.apache.accumulo/accumulo-server/1.5.0-SNAPSHOT/accumulo-server-1.5.0-SNAPSHOT.pom
[JENKINS] Archiving <https://builds.apache.org/job/Accumulo-Trunk/ws/accumulo-trunk/lib/accumulo-server-1.5.0-SNAPSHOT.jar>
to /home/hudson/hudson/jobs/Accumulo-Trunk/modules/org.apache.accumulo$accumulo-server/builds/2012-05-10_13-01-30/archive/org.apache.accumulo/accumulo-server/1.5.0-SNAPSHOT/accumulo-server-1.5.0-SNAPSHOT.jar
[JENKINS] Archiving <https://builds.apache.org/job/Accumulo-Trunk/ws/accumulo-trunk/assemble/pom.xml>
to /home/hudson/hudson/jobs/Accumulo-Trunk/modules/org.apache.accumulo$accumulo-assemble/builds/2012-05-10_13-01-31/archive/org.apache.accumulo/accumulo-assemble/1.5.0-SNAPSHOT/accumulo-assemble-1.5.0-SNAPSHOT.pom
[JENKINS] Archiving <https://builds.apache.org/job/Accumulo-Trunk/ws/accumulo-trunk/examples/wikisearch/ingest/pom.xml>
to /home/hudson/hudson/jobs/Accumulo-Trunk/modules/org.apache.accumulo$wikisearch-ingest/builds/2012-05-10_13-01-31/archive/org.apache.accumulo/wikisearch-ingest/1.5.0-SNAPSHOT/wikisearch-ingest-1.5.0-SNAPSHOT.pom
[JENKINS] Archiving <https://builds.apache.org/job/Accumulo-Trunk/ws/accumulo-trunk/examples/wikisearch/ingest/lib/wikisearch-ingest-1.5.0-SNAPSHOT.jar>
to /home/hudson/hudson/jobs/Accumulo-Trunk/modules/org.apache.accumulo$wikisearch-ingest/builds/2012-05-10_13-01-31/archive/org.apache.accumulo/wikisearch-ingest/1.5.0-SNAPSHOT/wikisearch-ingest-1.5.0-SNAPSHOT.jar
[JENKINS] Archiving <https://builds.apache.org/job/Accumulo-Trunk/ws/accumulo-trunk/trace/pom.xml>
to /home/hudson/hudson/jobs/Accumulo-Trunk/modules/org.apache.accumulo$cloudtrace/builds/2012-05-10_13-01-30/archive/org.apache.accumulo/cloudtrace/1.5.0-SNAPSHOT/cloudtrace-1.5.0-SNAPSHOT.pom
[JENKINS] Archiving <https://builds.apache.org/job/Accumulo-Trunk/ws/accumulo-trunk/lib/cloudtrace-1.5.0-SNAPSHOT.jar>
to /home/hudson/hudson/jobs/Accumulo-Trunk/modules/org.apache.accumulo$cloudtrace/builds/2012-05-10_13-01-30/archive/org.apache.accumulo/cloudtrace/1.5.0-SNAPSHOT/cloudtrace-1.5.0-SNAPSHOT.jar
[JENKINS] Archiving <https://builds.apache.org/job/Accumulo-Trunk/ws/accumulo-trunk/examples/pom.xml>
to /home/hudson/hudson/jobs/Accumulo-Trunk/modules/org.apache.accumulo$accumulo-examples/builds/2012-05-10_13-01-31/archive/org.apache.accumulo/accumulo-examples/1.5.0-SNAPSHOT/accumulo-examples-1.5.0-SNAPSHOT.pom
[JENKINS] Archiving <https://builds.apache.org/job/Accumulo-Trunk/ws/accumulo-trunk/examples/wikisearch/query/pom.xml>
to /home/hudson/hudson/jobs/Accumulo-Trunk/modules/org.apache.accumulo$wikisearch-query/builds/2012-05-10_13-01-31/archive/org.apache.accumulo/wikisearch-query/1.5.0-SNAPSHOT/wikisearch-query-1.5.0-SNAPSHOT.pom
[JENKINS] Archiving <https://builds.apache.org/job/Accumulo-Trunk/ws/accumulo-trunk/examples/wikisearch/query/target/wikisearch-query-1.5.0-SNAPSHOT.jar>
to /home/hudson/hudson/jobs/Accumulo-Trunk/modules/org.apache.accumulo$wikisearch-query/builds/2012-05-10_13-01-31/archive/org.apache.accumulo/wikisearch-query/1.5.0-SNAPSHOT/wikisearch-query-1.5.0-SNAPSHOT.jar
[JENKINS] Archiving <https://builds.apache.org/job/Accumulo-Trunk/ws/accumulo-trunk/examples/simple/pom.xml>
to /home/hudson/hudson/jobs/Accumulo-Trunk/modules/org.apache.accumulo$examples-simple/builds/2012-05-10_13-01-31/archive/org.apache.accumulo/examples-simple/1.5.0-SNAPSHOT/examples-simple-1.5.0-SNAPSHOT.pom
[JENKINS] Archiving <https://builds.apache.org/job/Accumulo-Trunk/ws/accumulo-trunk/lib/examples-simple-1.5.0-SNAPSHOT.jar>
to /home/hudson/hudson/jobs/Accumulo-Trunk/modules/org.apache.accumulo$examples-simple/builds/2012-05-10_13-01-31/archive/org.apache.accumulo/examples-simple/1.5.0-SNAPSHOT/examples-simple-1.5.0-SNAPSHOT.jar
[JENKINS] Archiving <https://builds.apache.org/job/Accumulo-Trunk/ws/accumulo-trunk/pom.xml>
to /home/hudson/hudson/jobs/Accumulo-Trunk/modules/org.apache.accumulo$accumulo/builds/2012-05-10_13-01-30/archive/org.apache.accumulo/accumulo/1.5.0-SNAPSHOT/accumulo-1.5.0-SNAPSHOT.pom
[JENKINS] Archiving <https://builds.apache.org/job/Accumulo-Trunk/ws/accumulo-trunk/target/accumulo-1.5.0-SNAPSHOT-site.xml>
to /home/hudson/hudson/jobs/Accumulo-Trunk/modules/org.apache.accumulo$accumulo/builds/2012-05-10_13-01-30/archive/org.apache.accumulo/accumulo/1.5.0-SNAPSHOT/accumulo-1.5.0-SNAPSHOT-site.xml
[JENKINS] Archiving <https://builds.apache.org/job/Accumulo-Trunk/ws/accumulo-trunk/start/pom.xml>
to /home/hudson/hudson/jobs/Accumulo-Trunk/modules/org.apache.accumulo$accumulo-start/builds/2012-05-10_13-01-30/archive/org.apache.accumulo/accumulo-start/1.5.0-SNAPSHOT/accumulo-start-1.5.0-SNAPSHOT.pom
[JENKINS] Archiving <https://builds.apache.org/job/Accumulo-Trunk/ws/accumulo-trunk/lib/accumulo-start-1.5.0-SNAPSHOT.jar>
to /home/hudson/hudson/jobs/Accumulo-Trunk/modules/org.apache.accumulo$accumulo-start/builds/2012-05-10_13-01-30/archive/org.apache.accumulo/accumulo-start/1.5.0-SNAPSHOT/accumulo-start-1.5.0-SNAPSHOT.jar
[JENKINS] Archiving <https://builds.apache.org/job/Accumulo-Trunk/ws/accumulo-trunk/examples/wikisearch/pom.xml>
to /home/hudson/hudson/jobs/Accumulo-Trunk/modules/org.apache.accumulo$accumulo-wikisearch/builds/2012-05-10_13-01-31/archive/org.apache.accumulo/accumulo-wikisearch/1.5.0-SNAPSHOT/accumulo-wikisearch-1.5.0-SNAPSHOT.pom
[JENKINS] Archiving <https://builds.apache.org/job/Accumulo-Trunk/ws/accumulo-trunk/examples/wikisearch/query-war/pom.xml>
to /home/hudson/hudson/jobs/Accumulo-Trunk/modules/org.apache.accumulo$wikisearch-query-war/builds/2012-05-10_13-01-31/archive/org.apache.accumulo/wikisearch-query-war/1.5.0-SNAPSHOT/wikisearch-query-war-1.5.0-SNAPSHOT.pom
[JENKINS] Archiving <https://builds.apache.org/job/Accumulo-Trunk/ws/accumulo-trunk/examples/wikisearch/query-war/target/wikisearch-query-war-1.5.0-SNAPSHOT.war>
to /home/hudson/hudson/jobs/Accumulo-Trunk/modules/org.apache.accumulo$wikisearch-query-war/builds/2012-05-10_13-01-31/archive/org.apache.accumulo/wikisearch-query-war/1.5.0-SNAPSHOT/wikisearch-query-war-1.5.0-SNAPSHOT.war
[JENKINS] Archiving <https://builds.apache.org/job/Accumulo-Trunk/ws/accumulo-trunk/core/pom.xml>
to /home/hudson/hudson/jobs/Accumulo-Trunk/modules/org.apache.accumulo$accumulo-core/builds/2012-05-10_13-01-30/archive/org.apache.accumulo/accumulo-core/1.5.0-SNAPSHOT/accumulo-core-1.5.0-SNAPSHOT.pom
[JENKINS] Archiving <https://builds.apache.org/job/Accumulo-Trunk/ws/accumulo-trunk/lib/accumulo-core-1.5.0-SNAPSHOT.jar>
to /home/hudson/hudson/jobs/Accumulo-Trunk/modules/org.apache.accumulo$accumulo-core/builds/2012-05-10_13-01-30/archive/org.apache.accumulo/accumulo-core/1.5.0-SNAPSHOT/accumulo-core-1.5.0-SNAPSHOT.jar
Waiting for Jenkins to finish collecting data
mavenExecutionResult exceptions not empty
message : Failed to execute goal org.codehaus.mojo:exec-maven-plugin:1.2.1:exec (config webpage)
on project accumulo-assemble: Command execution failed.
cause : Command execution failed.
Stack trace : 
org.apache.maven.lifecycle.LifecycleExecutionException: Failed to execute goal org.codehaus.mojo:exec-maven-plugin:1.2.1:exec
(config webpage) on project accumulo-assemble: Command execution failed.
	at org.apache.maven.lifecycle.internal.MojoExecutor.execute(MojoExecutor.java:217)
	at org.apache.maven.lifecycle.internal.MojoExecutor.execute(MojoExecutor.java:153)
	at org.apache.maven.lifecycle.internal.MojoExecutor.execute(MojoExecutor.java:145)
	at org.apache.maven.lifecycle.internal.LifecycleModuleBuilder.buildProject(LifecycleModuleBuilder.java:84)
	at org.apache.maven.lifecycle.internal.LifecycleModuleBuilder.buildProject(LifecycleModuleBuilder.java:59)
	at org.apache.maven.lifecycle.internal.LifecycleStarter.singleThreadedBuild(LifecycleStarter.java:183)
	at org.apache.maven.lifecycle.internal.LifecycleStarter.execute(LifecycleStarter.java:161)
	at org.apache.maven.DefaultMaven.doExecute(DefaultMaven.java:319)
	at org.apache.maven.DefaultMaven.execute(DefaultMaven.java:156)
	at org.jvnet.hudson.maven3.launcher.Maven3Launcher.main(Maven3Launcher.java:79)
	at sun.reflect.NativeMethodAccessorImpl.invoke0(Native Method)
	at sun.reflect.NativeMethodAccessorImpl.invoke(NativeMethodAccessorImpl.java:39)
	at sun.reflect.DelegatingMethodAccessorImpl.invoke(DelegatingMethodAccessorImpl.java:25)
	at java.lang.reflect.Method.invoke(Method.java:597)
	at org.codehaus.plexus.classworlds.launcher.Launcher.launchStandard(Launcher.java:329)
	at org.codehaus.plexus.classworlds.launcher.Launcher.launch(Launcher.java:239)
	at org.jvnet.hudson.maven3.agent.Maven3Main.launch(Maven3Main.java:158)
	at hudson.maven.Maven3Builder.call(Maven3Builder.java:98)
	at hudson.maven.Maven3Builder.call(Maven3Builder.java:64)
	at hudson.remoting.UserRequest.perform(UserRequest.java:118)
	at hudson.remoting.UserRequest.perform(UserRequest.java:48)
	at hudson.remoting.Request$2.run(Request.java:287)
	at hudson.remoting.InterceptingExecutorService$1.call(InterceptingExecutorService.java:72)
	at java.util.concurrent.FutureTask$Sync.innerRun(FutureTask.java:303)
	at java.util.concurrent.FutureTask.run(FutureTask.java:138)
	at java.util.concurrent.ThreadPoolExecutor$Worker.runTask(ThreadPoolExecutor.java:886)
	at java.util.concurrent.ThreadPoolExecutor$Worker.run(ThreadPoolExecutor.java:908)
	at java.lang.Thread.run(Thread.java:662)
Caused by: org.apache.maven.plugin.MojoExecutionException: Command execution failed.
	at org.codehaus.mojo.exec.ExecMojo.execute(ExecMojo.java:362)
	at org.apache.maven.plugin.DefaultBuildPluginManager.executeMojo(DefaultBuildPluginManager.java:101)
	at org.apache.maven.lifecycle.internal.MojoExecutor.execute(MojoExecutor.java:209)
	... 27 more
Caused by: org.apache.commons.exec.ExecuteException: Process exited with an error: 1 (Exit
value: 1)
	at org.apache.commons.exec.DefaultExecutor.executeInternal(DefaultExecutor.java:377)
	at org.apache.commons.exec.DefaultExecutor.execute(DefaultExecutor.java:160)
	at org.codehaus.mojo.exec.ExecMojo.executeCommandLine(ExecMojo.java:610)
	at org.codehaus.mojo.exec.ExecMojo.execute(ExecMojo.java:352)
	... 29 more
Sending e-mails to: dev@accumulo.apache.org
channel stopped
Skipping Cobertura coverage report as build was not UNSTABLE or better ...

Mime
View raw message