accumulo-dev mailing list archives

Site index · List index
Message view « Date » · « Thread »
Top « Date » · « Thread »
From Apache Jenkins Server <jenk...@builds.apache.org>
Subject Build failed in Jenkins: Accumulo-1.4.x #147
Date Mon, 23 Apr 2012 21:20:38 GMT
See <https://builds.apache.org/job/Accumulo-1.4.x/147/changes>

Changes:

[vines] ACCUMULO-404 - Tested in multi-node setup, looks good

------------------------------------------
[...truncated 2630 lines...]
Tests run: 1, Failures: 0, Errors: 0, Skipped: 0, Time elapsed: 0.003 sec
Running org.apache.accumulo.core.iterators.user.FilterTest
Tests run: 11, Failures: 0, Errors: 0, Skipped: 0, Time elapsed: 0.357 sec
Running org.apache.accumulo.core.iterators.user.WholeRowIteratorTest
Tests run: 3, Failures: 0, Errors: 0, Skipped: 0, Time elapsed: 0.004 sec
Running org.apache.accumulo.core.iterators.user.RegExFilterTest
Tests run: 1, Failures: 0, Errors: 0, Skipped: 0, Time elapsed: 0.003 sec
Running org.apache.accumulo.core.iterators.user.LargeRowFilterTest
Tests run: 5, Failures: 0, Errors: 0, Skipped: 0, Time elapsed: 0.292 sec
Running org.apache.accumulo.core.iterators.user.IntersectingIteratorTest
Tests run: 6, Failures: 0, Errors: 0, Skipped: 0, Time elapsed: 8.864 sec
Running org.apache.accumulo.core.iterators.user.VersioningIteratorTest
Tests run: 6, Failures: 0, Errors: 0, Skipped: 0, Time elapsed: 0.043 sec
Running org.apache.accumulo.core.iterators.user.CombinerTest
Tests run: 13, Failures: 0, Errors: 0, Skipped: 0, Time elapsed: 0.035 sec
Running org.apache.accumulo.core.iterators.user.IndexedDocIteratorTest
Tests run: 5, Failures: 0, Errors: 0, Skipped: 0, Time elapsed: 2.922 sec
Running org.apache.accumulo.core.iterators.user.RowFilterTest
Tests run: 1, Failures: 0, Errors: 0, Skipped: 0, Time elapsed: 0.045 sec
Running org.apache.accumulo.core.iterators.aggregation.NumSummationTest
Tests run: 5, Failures: 0, Errors: 0, Skipped: 0, Time elapsed: 0.002 sec
Running org.apache.accumulo.core.iterators.aggregation.conf.AggregatorConfigurationTest
Tests run: 2, Failures: 0, Errors: 0, Skipped: 0, Time elapsed: 0.004 sec
Running org.apache.accumulo.core.iterators.IterUtilTest
Tests run: 5, Failures: 0, Errors: 0, Skipped: 0, Time elapsed: 0.007 sec
Running org.apache.accumulo.core.iterators.AggregatingIteratorTest
Tests run: 7, Failures: 0, Errors: 0, Skipped: 0, Time elapsed: 0.006 sec
Running org.apache.accumulo.core.conf.PropertyTest
Tests run: 3, Failures: 0, Errors: 0, Skipped: 0, Time elapsed: 0.004 sec
Flushing results...
Flushing results done
Cobertura: Loaded information on 1262 classes.
Cobertura: Saved information on 1262 classes.

Results :

Tests run: 291, Failures: 0, Errors: 0, Skipped: 0

[JENKINS] Recording test results
[JENKINS] Archiving <https://builds.apache.org/job/Accumulo-1.4.x/ws/1.4/src/core/pom.xml>
to /home/hudson/hudson/jobs/Accumulo-1.4.x/modules/org.apache.accumulo$accumulo-core/builds/2012-04-23_21-11-48/archive/org.apache.accumulo/accumulo-core/1.4.1-SNAPSHOT/accumulo-core-1.4.1-SNAPSHOT.pom
[JENKINS] cobertura-maven-plugin already configured with xml reports enabled
[INFO] 
[INFO] --- cobertura-maven-plugin:2.5.1:cobertura (default-cli) @ accumulo-core ---
[INFO] Cobertura 1.9.4.1 - GNU GPL License (NO WARRANTY) - See COPYRIGHT file
Cobertura: Loaded information on 1262 classes.
[cobertura] WARN  [main] net.sourceforge.cobertura.reporting.ComplexityCalculator - JavaNCSS
got an error while parsing the java file <https://builds.apache.org/job/Accumulo-1.4.x/ws/1.4/src/core/src/main/java/org/apache/accumulo/core/data/Mutation.java>
ParseException in STDIN
Last useful checkpoint: "org.apache.accumulo.core.data.Mutation.getValueLengths()"
Encountered " ":" ": "" at line 403, column 23.
Was expecting one of:
    "[" ...
    ";" ...
    "," ...
    "=" ...
    

Report time: 7863ms

[ERROR] net.sourceforge.cobertura.javancss.parser.ParseException: Encountered " ":" ": ""
at line 403, column 23.
Was expecting one of:
    "[" ...
    ";" ...
    "," ...
    "=" ...
    
	at net.sourceforge.cobertura.javancss.parser.JavaParser.generateParseException(JavaParser.java:10296)
	at net.sourceforge.cobertura.javancss.parser.JavaParser.jj_consume_token(JavaParser.java:10172)
	at net.sourceforge.cobertura.javancss.parser.JavaParser.ForStatement(JavaParser.java:4380)
	at net.sourceforge.cobertura.javancss.parser.JavaParser.Statement(JavaParser.java:3828)
	at net.sourceforge.cobertura.javancss.parser.JavaParser.BlockStatement(JavaParser.java:3997)
	at net.sourceforge.cobertura.javancss.parser.JavaParser.Block(JavaParser.java:3947)
	at net.sourceforge.cobertura.javancss.parser.JavaParser.Statement(JavaParser.java:3778)
	at net.sourceforge.cobertura.javancss.parser.JavaParser.IfStatement(JavaParser.java:4253)
	at net.sourceforge.cobertura.javancss.parser.JavaParser.Statement(JavaParser.java:3816)
	at net.sourceforge.cobertura.javancss.parser.JavaParser.BlockStatement(JavaParser.java:3997)
	at net.sourceforge.cobertura.javancss.parser.JavaParser.Block(JavaParser.java:3947)
	at net.sourceforge.cobertura.javancss.parser.JavaParser.MethodDeclaration(JavaParser.java:2039)
	at net.sourceforge.cobertura.javancss.parser.JavaParser.ClassBodyDeclaration(JavaParser.java:1082)
	at net.sourceforge.cobertura.javancss.parser.JavaParser.ClassBody(JavaParser.java:941)
	at net.sourceforge.cobertura.javancss.parser.JavaParser.UnmodifiedClassDeclaration(JavaParser.java:854)
	at net.sourceforge.cobertura.javancss.parser.JavaParser.ClassDeclaration(JavaParser.java:761)
	at net.sourceforge.cobertura.javancss.parser.JavaParser.TypeDeclaration(JavaParser.java:608)
	at net.sourceforge.cobertura.javancss.parser.JavaParser.CompilationUnit(JavaParser.java:353)
	at net.sourceforge.cobertura.javancss.parser.JavaParser.parse(JavaParser.java:137)
	at net.sourceforge.cobertura.javancss.Javancss._measureSource(Javancss.java:256)
	at net.sourceforge.cobertura.javancss.Javancss._measureRoot(Javancss.java:339)
	at net.sourceforge.cobertura.javancss.Javancss.<init>(Javancss.java:419)
	at net.sourceforge.cobertura.reporting.ComplexityCalculator.getAccumlatedCCNForSource(ComplexityCalculator.java:102)
	at net.sourceforge.cobertura.reporting.ComplexityCalculator.getAccumlatedCCNForSingleFile(ComplexityCalculator.java:139)
	at net.sourceforge.cobertura.reporting.ComplexityCalculator.getCCNForSourceFileNameInternal(ComplexityCalculator.java:224)
	at net.sourceforge.cobertura.reporting.ComplexityCalculator.getCCNForPackageInternal(ComplexityCalculator.java:194)
	at net.sourceforge.cobertura.reporting.ComplexityCalculator.getCCNForProject(ComplexityCalculator.java:164)
	at net.sourceforge.cobertura.reporting.xml.XMLReport.<init>(XMLReport.java:80)
	at net.sourceforge.cobertura.reporting.Main.parseArguments(Main.java:107)
	at net.sourceforge.cobertura.reporting.Main.main(Main.java:174)

[INFO] Cobertura Report generation was successful.
[JENKINS] Recording coverage results
[JENKINS] Archiving <https://builds.apache.org/job/Accumulo-1.4.x/ws/1.4/lib/accumulo-core-1.4.1-SNAPSHOT.jar>
to /home/hudson/hudson/jobs/Accumulo-1.4.x/modules/org.apache.accumulo$accumulo-core/builds/2012-04-23_21-11-48/archive/org.apache.accumulo/accumulo-core/1.4.1-SNAPSHOT/accumulo-core-1.4.1-SNAPSHOT.jar
[INFO] Downloading: http://repo1.maven.org/maven2/org/eclipse/m2e/lifecycle-mapping/1.0.0/lifecycle-mapping-1.0.0.pom
                                                                        
[INFO] ------------------------------------------------------------------------
[INFO] Building accumulo-server 1.4.1-SNAPSHOT
[INFO] ------------------------------------------------------------------------
[WARNING] The POM for org.eclipse.m2e:lifecycle-mapping:jar:1.0.0 is missing, no dependency
information available
[WARNING] Failed to retrieve plugin descriptor for org.eclipse.m2e:lifecycle-mapping:1.0.0:
Plugin org.eclipse.m2e:lifecycle-mapping:1.0.0 or one of its dependencies could not be resolved:
Failed to read artifact descriptor for org.eclipse.m2e:lifecycle-mapping:jar:1.0.0
[INFO] [INFO] Deleting <https://builds.apache.org/job/Accumulo-1.4.x/ws/1.4/src/server>
(includes = [**/*.pyc], excludes = [])

[INFO] --- maven-clean-plugin:2.4.1:clean (default-clean) @ accumulo-server ---
[INFO] 
[INFO] --- maven-enforcer-plugin:1.0.1:enforce (enforce-mvn) @ accumulo-server ---
[INFO] 
[INFO] --- maven-remote-resources-plugin:1.2.1:process (default) @ accumulo-server ---
[INFO] [debug] execute contextualize
[INFO] Using 'UTF-8' encoding to copy filtered resources.
[INFO] Copying 39 resources

[INFO] --- maven-resources-plugin:2.5:resources (default-resources) @ accumulo-server ---
[INFO] Copying 3 resources
[INFO] [INFO] Copying commons-configuration-1.5.jar to <https://builds.apache.org/job/Accumulo-1.4.x/ws/1.4/lib/commons-configuration-1.5.jar>
[INFO] commons-io-1.4.jar already exists in destination.
[INFO] commons-lang-2.4.jar already exists in destination.
[INFO] jline-0.9.94.jar already exists in destination.
[INFO] log4j-1.2.16.jar already exists in destination.

[INFO] --- maven-dependency-plugin:2.1:copy-dependencies (copy-dependencies) @ accumulo-server
---
[INFO] 
[INFO] --- maven-compiler-plugin:2.3.2:compile (default-compile) @ accumulo-server ---
[INFO] Compiling 413 source files to <https://builds.apache.org/job/Accumulo-1.4.x/ws/1.4/src/server/target/classes>
[INFO] -------------------------------------------------------------
[ERROR] COMPILATION ERROR : 
[INFO] -------------------------------------------------------------
[ERROR] <https://builds.apache.org/job/Accumulo-1.4.x/ws/1.4/src/server/src/main/java/org/apache/accumulo/server/master/Master.java>:[144,42]
cannot find symbol
symbol  : class SecurityUtil
location: package org.apache.accumulo.server.security
[ERROR] <https://builds.apache.org/job/Accumulo-1.4.x/ws/1.4/src/server/src/main/java/org/apache/accumulo/server/tabletserver/TabletServer.java>:[148,42]
cannot find symbol
symbol  : class SecurityUtil
location: package org.apache.accumulo.server.security
[ERROR] <https://builds.apache.org/job/Accumulo-1.4.x/ws/1.4/src/server/src/main/java/org/apache/accumulo/server/gc/SimpleGarbageCollector.java>:[78,42]
cannot find symbol
symbol  : class SecurityUtil
location: package org.apache.accumulo.server.security
[ERROR] <https://builds.apache.org/job/Accumulo-1.4.x/ws/1.4/src/server/src/main/java/org/apache/accumulo/server/util/Initialize.java>:[52,42]
cannot find symbol
symbol  : class SecurityUtil
location: package org.apache.accumulo.server.security
[ERROR] <https://builds.apache.org/job/Accumulo-1.4.x/ws/1.4/src/server/src/main/java/org/apache/accumulo/server/logger/LogService.java>:[65,42]
cannot find symbol
symbol  : class SecurityUtil
location: package org.apache.accumulo.server.security
[ERROR] <https://builds.apache.org/job/Accumulo-1.4.x/ws/1.4/src/server/src/main/java/org/apache/accumulo/server/trace/TraceServer.java>:[42,42]
cannot find symbol
symbol  : class SecurityUtil
location: package org.apache.accumulo.server.security
[ERROR] <https://builds.apache.org/job/Accumulo-1.4.x/ws/1.4/src/server/src/main/java/org/apache/accumulo/server/monitor/Monitor.java>:[70,42]
cannot find symbol
symbol  : class SecurityUtil
location: package org.apache.accumulo.server.security
[ERROR] <https://builds.apache.org/job/Accumulo-1.4.x/ws/1.4/src/server/src/main/java/org/apache/accumulo/server/master/state/SetGoalState.java>:[25,42]
cannot find symbol
symbol  : class SecurityUtil
location: package org.apache.accumulo.server.security
[ERROR] <https://builds.apache.org/job/Accumulo-1.4.x/ws/1.4/src/server/src/main/java/org/apache/accumulo/server/master/Master.java>:[2154,6]
cannot find symbol
symbol  : variable SecurityUtil
location: class org.apache.accumulo.server.master.Master
[ERROR] <https://builds.apache.org/job/Accumulo-1.4.x/ws/1.4/src/server/src/main/java/org/apache/accumulo/server/tabletserver/TabletServer.java>:[2657,4]
cannot find symbol
symbol  : variable SecurityUtil
location: class org.apache.accumulo.server.tabletserver.TabletServer
[ERROR] <https://builds.apache.org/job/Accumulo-1.4.x/ws/1.4/src/server/src/main/java/org/apache/accumulo/server/tabletserver/TabletServer.java>:[3110,6]
cannot find symbol
symbol  : variable SecurityUtil
location: class org.apache.accumulo.server.tabletserver.TabletServer
[ERROR] <https://builds.apache.org/job/Accumulo-1.4.x/ws/1.4/src/server/src/main/java/org/apache/accumulo/server/gc/SimpleGarbageCollector.java>:[126,4]
cannot find symbol
symbol  : variable SecurityUtil
location: class org.apache.accumulo.server.gc.SimpleGarbageCollector
[ERROR] <https://builds.apache.org/job/Accumulo-1.4.x/ws/1.4/src/server/src/main/java/org/apache/accumulo/server/util/Initialize.java>:[427,6]
cannot find symbol
symbol  : variable SecurityUtil
location: class org.apache.accumulo.server.util.Initialize
[ERROR] <https://builds.apache.org/job/Accumulo-1.4.x/ws/1.4/src/server/src/main/java/org/apache/accumulo/server/logger/LogService.java>:[125,4]
cannot find symbol
symbol  : variable SecurityUtil
location: class org.apache.accumulo.server.logger.LogService
[ERROR] <https://builds.apache.org/job/Accumulo-1.4.x/ws/1.4/src/server/src/main/java/org/apache/accumulo/server/trace/TraceServer.java>:[223,4]
cannot find symbol
symbol  : variable SecurityUtil
location: class org.apache.accumulo.server.trace.TraceServer
[ERROR] <https://builds.apache.org/job/Accumulo-1.4.x/ws/1.4/src/server/src/main/java/org/apache/accumulo/server/monitor/Monitor.java>:[426,4]
cannot find symbol
symbol  : variable SecurityUtil
location: class org.apache.accumulo.server.monitor.Monitor
[ERROR] <https://builds.apache.org/job/Accumulo-1.4.x/ws/1.4/src/server/src/main/java/org/apache/accumulo/server/master/state/SetGoalState.java>:[38,4]
cannot find symbol
symbol  : variable SecurityUtil
location: class org.apache.accumulo.server.master.state.SetGoalState
[INFO] 17 errors 
[INFO] -------------------------------------------------------------
[JENKINS] Archiving <https://builds.apache.org/job/Accumulo-1.4.x/ws/1.4/src/server/pom.xml>
to /home/hudson/hudson/jobs/Accumulo-1.4.x/modules/org.apache.accumulo$accumulo-server/builds/2012-04-23_21-11-48/archive/org.apache.accumulo/accumulo-server/1.4.1-SNAPSHOT/accumulo-server-1.4.1-SNAPSHOT.pom
[INFO] ------------------------------------------------------------------------
[INFO] Reactor Summary:
[INFO] 
[INFO] accumulo .......................................... SUCCESS [39.517s]
[INFO] cloudtrace ........................................ SUCCESS [31.736s]
[INFO] accumulo-start .................................... SUCCESS [45.983s]
[INFO] accumulo-core ..................................... SUCCESS [6:09.093s]
[INFO] accumulo-server ................................... FAILURE [5.377s]
[INFO] accumulo-examples ................................. SKIPPED
[INFO] examples-simple ................................... SKIPPED
[INFO] accumulo-wikisearch ............................... SKIPPED
[INFO] wikisearch-ingest ................................. SKIPPED
[INFO] wikisearch-query .................................. SKIPPED
[INFO] wikisearch-query-war .............................. SKIPPED
[INFO] ------------------------------------------------------------------------
[INFO] BUILD FAILURE
[INFO] ------------------------------------------------------------------------
[INFO] Total time: 8:34.619s
[INFO] Finished at: Mon Apr 23 21:20:37 UTC 2012
[INFO] Final Memory: 49M/221M
[INFO] ------------------------------------------------------------------------
mavenExecutionResult exceptions not empty
message : Failed to execute goal org.apache.maven.plugins:maven-compiler-plugin:2.3.2:compile
(default-compile) on project accumulo-server: Compilation failure
cause : Compilation failure
Stack trace : 
org.apache.maven.lifecycle.LifecycleExecutionException: Failed to execute goal org.apache.maven.plugins:maven-compiler-plugin:2.3.2:compile
(default-compile) on project accumulo-server: Compilation failure
	at org.apache.maven.lifecycle.internal.MojoExecutor.execute(MojoExecutor.java:213)
	at org.apache.maven.lifecycle.internal.MojoExecutor.execute(MojoExecutor.java:153)
	at org.apache.maven.lifecycle.internal.MojoExecutor.execute(MojoExecutor.java:145)
	at org.apache.maven.lifecycle.internal.LifecycleModuleBuilder.buildProject(LifecycleModuleBuilder.java:84)
	at org.apache.maven.lifecycle.internal.LifecycleModuleBuilder.buildProject(LifecycleModuleBuilder.java:59)
	at org.apache.maven.lifecycle.internal.LifecycleStarter.singleThreadedBuild(LifecycleStarter.java:183)
	at org.apache.maven.lifecycle.internal.LifecycleStarter.execute(LifecycleStarter.java:161)
	at org.apache.maven.DefaultMaven.doExecute(DefaultMaven.java:319)
	at org.apache.maven.DefaultMaven.execute(DefaultMaven.java:156)
	at org.jvnet.hudson.maven3.launcher.Maven3Launcher.main(Maven3Launcher.java:79)
	at sun.reflect.NativeMethodAccessorImpl.invoke0(Native Method)
	at sun.reflect.NativeMethodAccessorImpl.invoke(NativeMethodAccessorImpl.java:39)
	at sun.reflect.DelegatingMethodAccessorImpl.invoke(DelegatingMethodAccessorImpl.java:25)
	at java.lang.reflect.Method.invoke(Method.java:597)
	at org.codehaus.plexus.classworlds.launcher.Launcher.launchStandard(Launcher.java:329)
	at org.codehaus.plexus.classworlds.launcher.Launcher.launch(Launcher.java:239)
	at org.jvnet.hudson.maven3.agent.Maven3Main.launch(Maven3Main.java:158)
	at hudson.maven.Maven3Builder.call(Maven3Builder.java:104)
	at hudson.maven.Maven3Builder.call(Maven3Builder.java:70)
	at hudson.remoting.UserRequest.perform(UserRequest.java:118)
	at hudson.remoting.UserRequest.perform(UserRequest.java:48)
	at hudson.remoting.Request$2.run(Request.java:287)
	at hudson.remoting.InterceptingExecutorService$1.call(InterceptingExecutorService.java:72)
	at java.util.concurrent.FutureTask$Sync.innerRun(FutureTask.java:303)
	at java.util.concurrent.FutureTask.run(FutureTask.java:138)
	at java.util.concurrent.ThreadPoolExecutor$Worker.runTask(ThreadPoolExecutor.java:886)
	at java.util.concurrent.ThreadPoolExecutor$Worker.run(ThreadPoolExecutor.java:908)
	at java.lang.Thread.run(Thread.java:662)
Caused by: org.apache.maven.plugin.CompilationFailureException: Compilation failure
	at org.apache.maven.plugin.AbstractCompilerMojo.execute(AbstractCompilerMojo.java:656)
	at org.apache.maven.plugin.CompilerMojo.execute(CompilerMojo.java:128)
	at org.apache.maven.plugin.DefaultBuildPluginManager.executeMojo(DefaultBuildPluginManager.java:101)
	at org.apache.maven.lifecycle.internal.MojoExecutor.execute(MojoExecutor.java:209)
	... 27 more
Sending e-mails to: dev@accumulo.apache.org
channel stopped
Skipping Cobertura coverage report as build was not UNSTABLE or better ...

Mime
View raw message