accumulo-dev mailing list archives

Site index · List index
Message view « Date » · « Thread »
Top « Date » · « Thread »
From Apache Jenkins Server <jenk...@builds.apache.org>
Subject Build failed in Jenkins: Accumulo-1.4.x » accumulo-server #147
Date Mon, 23 Apr 2012 21:20:38 GMT
See <https://builds.apache.org/job/Accumulo-1.4.x/org.apache.accumulo$accumulo-server/147/changes>

Changes:

[vines] ACCUMULO-404 - Tested in multi-node setup, looks good

------------------------------------------
[JENKINS] cobertura-maven-plugin already configured with xml reports enabled
[INFO] 
[INFO] --- cobertura-maven-plugin:2.5.1:cobertura (default-cli) @ accumulo-core ---
[INFO] Cobertura 1.9.4.1 - GNU GPL License (NO WARRANTY) - See COPYRIGHT file
Cobertura: Loaded information on 1262 classes.
[cobertura] WARN  [main] net.sourceforge.cobertura.reporting.ComplexityCalculator - JavaNCSS
got an error while parsing the java file /home/jenkins/jenkins-slave/workspace/Accumulo-1.4.x/1.4/src/core/src/main/java/org/apache/accumulo/core/data/Mutation.java
ParseException in STDIN
Last useful checkpoint: "org.apache.accumulo.core.data.Mutation.getValueLengths()"
Encountered " ":" ": "" at line 403, column 23.
Was expecting one of:
    "[" ...
    ";" ...
    "," ...
    "=" ...
    

Report time: 7863ms

[ERROR] net.sourceforge.cobertura.javancss.parser.ParseException: Encountered " ":" ": ""
at line 403, column 23.
Was expecting one of:
    "[" ...
    ";" ...
    "," ...
    "=" ...
    
	at net.sourceforge.cobertura.javancss.parser.JavaParser.generateParseException(JavaParser.java:10296)
	at net.sourceforge.cobertura.javancss.parser.JavaParser.jj_consume_token(JavaParser.java:10172)
	at net.sourceforge.cobertura.javancss.parser.JavaParser.ForStatement(JavaParser.java:4380)
	at net.sourceforge.cobertura.javancss.parser.JavaParser.Statement(JavaParser.java:3828)
	at net.sourceforge.cobertura.javancss.parser.JavaParser.BlockStatement(JavaParser.java:3997)
	at net.sourceforge.cobertura.javancss.parser.JavaParser.Block(JavaParser.java:3947)
	at net.sourceforge.cobertura.javancss.parser.JavaParser.Statement(JavaParser.java:3778)
	at net.sourceforge.cobertura.javancss.parser.JavaParser.IfStatement(JavaParser.java:4253)
	at net.sourceforge.cobertura.javancss.parser.JavaParser.Statement(JavaParser.java:3816)
	at net.sourceforge.cobertura.javancss.parser.JavaParser.BlockStatement(JavaParser.java:3997)
	at net.sourceforge.cobertura.javancss.parser.JavaParser.Block(JavaParser.java:3947)
	at net.sourceforge.cobertura.javancss.parser.JavaParser.MethodDeclaration(JavaParser.java:2039)
	at net.sourceforge.cobertura.javancss.parser.JavaParser.ClassBodyDeclaration(JavaParser.java:1082)
	at net.sourceforge.cobertura.javancss.parser.JavaParser.ClassBody(JavaParser.java:941)
	at net.sourceforge.cobertura.javancss.parser.JavaParser.UnmodifiedClassDeclaration(JavaParser.java:854)
	at net.sourceforge.cobertura.javancss.parser.JavaParser.ClassDeclaration(JavaParser.java:761)
	at net.sourceforge.cobertura.javancss.parser.JavaParser.TypeDeclaration(JavaParser.java:608)
	at net.sourceforge.cobertura.javancss.parser.JavaParser.CompilationUnit(JavaParser.java:353)
	at net.sourceforge.cobertura.javancss.parser.JavaParser.parse(JavaParser.java:137)
	at net.sourceforge.cobertura.javancss.Javancss._measureSource(Javancss.java:256)
	at net.sourceforge.cobertura.javancss.Javancss._measureRoot(Javancss.java:339)
	at net.sourceforge.cobertura.javancss.Javancss.<init>(Javancss.java:419)
	at net.sourceforge.cobertura.reporting.ComplexityCalculator.getAccumlatedCCNForSource(ComplexityCalculator.java:102)
	at net.sourceforge.cobertura.reporting.ComplexityCalculator.getAccumlatedCCNForSingleFile(ComplexityCalculator.java:139)
	at net.sourceforge.cobertura.reporting.ComplexityCalculator.getCCNForSourceFileNameInternal(ComplexityCalculator.java:224)
	at net.sourceforge.cobertura.reporting.ComplexityCalculator.getCCNForPackageInternal(ComplexityCalculator.java:194)
	at net.sourceforge.cobertura.reporting.ComplexityCalculator.getCCNForProject(ComplexityCalculator.java:164)
	at net.sourceforge.cobertura.reporting.xml.XMLReport.<init>(XMLReport.java:80)
	at net.sourceforge.cobertura.reporting.Main.parseArguments(Main.java:107)
	at net.sourceforge.cobertura.reporting.Main.main(Main.java:174)

[INFO] Cobertura Report generation was successful.
[JENKINS] Recording coverage results
[JENKINS] Archiving /home/jenkins/jenkins-slave/workspace/Accumulo-1.4.x/1.4/lib/accumulo-core-1.4.1-SNAPSHOT.jar
to /home/hudson/hudson/jobs/Accumulo-1.4.x/modules/org.apache.accumulo$accumulo-core/builds/2012-04-23_21-11-48/archive/org.apache.accumulo/accumulo-core/1.4.1-SNAPSHOT/accumulo-core-1.4.1-SNAPSHOT.jar
[INFO] Downloading: http://repo1.maven.org/maven2/org/eclipse/m2e/lifecycle-mapping/1.0.0/lifecycle-mapping-1.0.0.pom
                                                                        
[INFO] ------------------------------------------------------------------------
[INFO] Building accumulo-server 1.4.1-SNAPSHOT
[INFO] ------------------------------------------------------------------------
[WARNING] The POM for org.eclipse.m2e:lifecycle-mapping:jar:1.0.0 is missing, no dependency
information available
[WARNING] Failed to retrieve plugin descriptor for org.eclipse.m2e:lifecycle-mapping:1.0.0:
Plugin org.eclipse.m2e:lifecycle-mapping:1.0.0 or one of its dependencies could not be resolved:
Failed to read artifact descriptor for org.eclipse.m2e:lifecycle-mapping:jar:1.0.0
[INFO] [INFO] Deleting <https://builds.apache.org/job/Accumulo-1.4.x/org.apache.accumulo$accumulo-server/ws/>
(includes = [**/*.pyc], excludes = [])

[INFO] --- maven-clean-plugin:2.4.1:clean (default-clean) @ accumulo-server ---
[INFO] 
[INFO] --- maven-enforcer-plugin:1.0.1:enforce (enforce-mvn) @ accumulo-server ---
[INFO] 
[INFO] --- maven-remote-resources-plugin:1.2.1:process (default) @ accumulo-server ---
[INFO] [debug] execute contextualize
[INFO] Using 'UTF-8' encoding to copy filtered resources.
[INFO] Copying 39 resources

[INFO] --- maven-resources-plugin:2.5:resources (default-resources) @ accumulo-server ---
[INFO] Copying 3 resources
[INFO] [INFO] Copying commons-configuration-1.5.jar to /home/jenkins/jenkins-slave/workspace/Accumulo-1.4.x/1.4/lib/commons-configuration-1.5.jar
[INFO] commons-io-1.4.jar already exists in destination.
[INFO] commons-lang-2.4.jar already exists in destination.
[INFO] jline-0.9.94.jar already exists in destination.
[INFO] log4j-1.2.16.jar already exists in destination.

[INFO] --- maven-dependency-plugin:2.1:copy-dependencies (copy-dependencies) @ accumulo-server
---
[INFO] 
[INFO] --- maven-compiler-plugin:2.3.2:compile (default-compile) @ accumulo-server ---
[INFO] Compiling 413 source files to <https://builds.apache.org/job/Accumulo-1.4.x/org.apache.accumulo$accumulo-server/ws/target/classes>
[INFO] -------------------------------------------------------------
[ERROR] COMPILATION ERROR : 
[INFO] -------------------------------------------------------------
[ERROR] <https://builds.apache.org/job/Accumulo-1.4.x/org.apache.accumulo$accumulo-server/ws/src/main/java/org/apache/accumulo/server/master/Master.java>:[144,42]
cannot find symbol
symbol  : class SecurityUtil
location: package org.apache.accumulo.server.security
[ERROR] <https://builds.apache.org/job/Accumulo-1.4.x/org.apache.accumulo$accumulo-server/ws/src/main/java/org/apache/accumulo/server/tabletserver/TabletServer.java>:[148,42]
cannot find symbol
symbol  : class SecurityUtil
location: package org.apache.accumulo.server.security
[ERROR] <https://builds.apache.org/job/Accumulo-1.4.x/org.apache.accumulo$accumulo-server/ws/src/main/java/org/apache/accumulo/server/gc/SimpleGarbageCollector.java>:[78,42]
cannot find symbol
symbol  : class SecurityUtil
location: package org.apache.accumulo.server.security
[ERROR] <https://builds.apache.org/job/Accumulo-1.4.x/org.apache.accumulo$accumulo-server/ws/src/main/java/org/apache/accumulo/server/util/Initialize.java>:[52,42]
cannot find symbol
symbol  : class SecurityUtil
location: package org.apache.accumulo.server.security
[ERROR] <https://builds.apache.org/job/Accumulo-1.4.x/org.apache.accumulo$accumulo-server/ws/src/main/java/org/apache/accumulo/server/logger/LogService.java>:[65,42]
cannot find symbol
symbol  : class SecurityUtil
location: package org.apache.accumulo.server.security
[ERROR] <https://builds.apache.org/job/Accumulo-1.4.x/org.apache.accumulo$accumulo-server/ws/src/main/java/org/apache/accumulo/server/trace/TraceServer.java>:[42,42]
cannot find symbol
symbol  : class SecurityUtil
location: package org.apache.accumulo.server.security
[ERROR] <https://builds.apache.org/job/Accumulo-1.4.x/org.apache.accumulo$accumulo-server/ws/src/main/java/org/apache/accumulo/server/monitor/Monitor.java>:[70,42]
cannot find symbol
symbol  : class SecurityUtil
location: package org.apache.accumulo.server.security
[ERROR] <https://builds.apache.org/job/Accumulo-1.4.x/org.apache.accumulo$accumulo-server/ws/src/main/java/org/apache/accumulo/server/master/state/SetGoalState.java>:[25,42]
cannot find symbol
symbol  : class SecurityUtil
location: package org.apache.accumulo.server.security
[ERROR] <https://builds.apache.org/job/Accumulo-1.4.x/org.apache.accumulo$accumulo-server/ws/src/main/java/org/apache/accumulo/server/master/Master.java>:[2154,6]
cannot find symbol
symbol  : variable SecurityUtil
location: class org.apache.accumulo.server.master.Master
[ERROR] <https://builds.apache.org/job/Accumulo-1.4.x/org.apache.accumulo$accumulo-server/ws/src/main/java/org/apache/accumulo/server/tabletserver/TabletServer.java>:[2657,4]
cannot find symbol
symbol  : variable SecurityUtil
location: class org.apache.accumulo.server.tabletserver.TabletServer
[ERROR] <https://builds.apache.org/job/Accumulo-1.4.x/org.apache.accumulo$accumulo-server/ws/src/main/java/org/apache/accumulo/server/tabletserver/TabletServer.java>:[3110,6]
cannot find symbol
symbol  : variable SecurityUtil
location: class org.apache.accumulo.server.tabletserver.TabletServer
[ERROR] <https://builds.apache.org/job/Accumulo-1.4.x/org.apache.accumulo$accumulo-server/ws/src/main/java/org/apache/accumulo/server/gc/SimpleGarbageCollector.java>:[126,4]
cannot find symbol
symbol  : variable SecurityUtil
location: class org.apache.accumulo.server.gc.SimpleGarbageCollector
[ERROR] <https://builds.apache.org/job/Accumulo-1.4.x/org.apache.accumulo$accumulo-server/ws/src/main/java/org/apache/accumulo/server/util/Initialize.java>:[427,6]
cannot find symbol
symbol  : variable SecurityUtil
location: class org.apache.accumulo.server.util.Initialize
[ERROR] <https://builds.apache.org/job/Accumulo-1.4.x/org.apache.accumulo$accumulo-server/ws/src/main/java/org/apache/accumulo/server/logger/LogService.java>:[125,4]
cannot find symbol
symbol  : variable SecurityUtil
location: class org.apache.accumulo.server.logger.LogService
[ERROR] <https://builds.apache.org/job/Accumulo-1.4.x/org.apache.accumulo$accumulo-server/ws/src/main/java/org/apache/accumulo/server/trace/TraceServer.java>:[223,4]
cannot find symbol
symbol  : variable SecurityUtil
location: class org.apache.accumulo.server.trace.TraceServer
[ERROR] <https://builds.apache.org/job/Accumulo-1.4.x/org.apache.accumulo$accumulo-server/ws/src/main/java/org/apache/accumulo/server/monitor/Monitor.java>:[426,4]
cannot find symbol
symbol  : variable SecurityUtil
location: class org.apache.accumulo.server.monitor.Monitor
[ERROR] <https://builds.apache.org/job/Accumulo-1.4.x/org.apache.accumulo$accumulo-server/ws/src/main/java/org/apache/accumulo/server/master/state/SetGoalState.java>:[38,4]
cannot find symbol
symbol  : variable SecurityUtil
location: class org.apache.accumulo.server.master.state.SetGoalState
[INFO] 17 errors 
[INFO] -------------------------------------------------------------
[JENKINS] Archiving <https://builds.apache.org/job/Accumulo-1.4.x/org.apache.accumulo$accumulo-server/ws/pom.xml>
to /home/hudson/hudson/jobs/Accumulo-1.4.x/modules/org.apache.accumulo$accumulo-server/builds/2012-04-23_21-11-48/archive/org.apache.accumulo/accumulo-server/1.4.1-SNAPSHOT/accumulo-server-1.4.1-SNAPSHOT.pom

Mime
View raw message