accumulo-dev mailing list archives

Site index · List index
Message view « Date » · « Thread »
Top « Date » · « Thread »
From Apache Jenkins Server <jenk...@builds.apache.org>
Subject Build failed in Jenkins: Accumulo-1.3.x #44
Date Fri, 27 Apr 2012 17:50:54 GMT
See <https://builds.apache.org/job/Accumulo-1.3.x/44/changes>

Changes:

[billie] ACCUMULO-563 created script and added it to the generate-resources build phase

[ecn] ACCUMULO-520: add assigned but not loaded tablets to "unassigned"

[ecn] ACCUMULO-559 use instance.getZooKeepers instead of trying to read the site configuration

[ecn] ACCUMULO-542: just use a scanner to read the root tablet

[ecn] ACCUMULO-499

[ecn] ACCUMULO-505 use consistent api calls to get space

[ecn] ACCUMULO-530 recycle connections after an i/o error

[ecn] ACCUMULO-529 remove should have been removeAll

[ecn] ACCUMULO-512 make the constant match the comment

[billie] ACCUMULO-506 added instructions for building thrift

------------------------------------------
[...truncated 3199 lines...]
A    thrift-0.3.0/compiler/cpp/src/generate/t_xsd_generator.cc
A    thrift-0.3.0/compiler/cpp/src/generate/t_oop_generator.h
A    thrift-0.3.0/compiler/cpp/src/main.h
A    thrift-0.3.0/compiler/cpp/src/parse
A    thrift-0.3.0/compiler/cpp/src/parse/t_program.h
A    thrift-0.3.0/compiler/cpp/src/parse/t_scope.h
A    thrift-0.3.0/compiler/cpp/src/parse/t_base_type.h
A    thrift-0.3.0/compiler/cpp/src/parse/t_list.h
A    thrift-0.3.0/compiler/cpp/src/parse/t_map.h
A    thrift-0.3.0/compiler/cpp/src/parse/t_type.h
A    thrift-0.3.0/compiler/cpp/src/parse/t_const_value.h
A    thrift-0.3.0/compiler/cpp/src/parse/t_container.h
A    thrift-0.3.0/compiler/cpp/src/parse/t_field.h
A    thrift-0.3.0/compiler/cpp/src/parse/t_struct.h
A    thrift-0.3.0/compiler/cpp/src/parse/t_function.h
A    thrift-0.3.0/compiler/cpp/src/parse/t_const.h
A    thrift-0.3.0/compiler/cpp/src/parse/t_set.h
A    thrift-0.3.0/compiler/cpp/src/parse/t_typedef.h
A    thrift-0.3.0/compiler/cpp/src/parse/t_enum_value.h
A    thrift-0.3.0/compiler/cpp/src/parse/t_service.h
A    thrift-0.3.0/compiler/cpp/src/parse/t_enum.h
A    thrift-0.3.0/compiler/cpp/src/parse/t_doc.h
A    thrift-0.3.0/compiler/cpp/src/platform.h
A    thrift-0.3.0/compiler/cpp/src/md5.h
A    thrift-0.3.0/compiler/cpp/Makefile.am
A    thrift-0.3.0/compiler/cpp/README
A    thrift-0.3.0/compiler/src
A    thrift-0.3.0/compiler/py
A    thrift-0.3.0/compiler/py/src
A    thrift-0.3.0/NEWS
A    thrift-0.3.0/DISCLAIMER
Exported revision 1331517.
in <https://builds.apache.org/job/Accumulo-1.3.x/ws/1.3/thrift-0.3.0/lib/java>
ant
Buildfile: build.xml

init:
    [mkdir] Created dir: <https://builds.apache.org/job/Accumulo-1.3.x/ws/1.3/thrift-0.3.0/lib/java/build>
    [mkdir] Created dir: <https://builds.apache.org/job/Accumulo-1.3.x/ws/1.3/thrift-0.3.0/lib/java/build/test>

ivy-init-dirs:
    [mkdir] Created dir: <https://builds.apache.org/job/Accumulo-1.3.x/ws/1.3/thrift-0.3.0/lib/java/build/ivy>
    [mkdir] Created dir: <https://builds.apache.org/job/Accumulo-1.3.x/ws/1.3/thrift-0.3.0/lib/java/build/ivy/lib>

ivy-download:
      [get] Getting: http://repo2.maven.org/maven2/org/apache/ivy/ivy/2.0.0-rc2/ivy-2.0.0-rc2.jar
      [get] To: <https://builds.apache.org/job/Accumulo-1.3.x/ws/1.3/thrift-0.3.0/lib/java/build/ivy/ivy-2.0.0-rc2.jar>

ivy-probe-antlib:

ivy-init-antlib:

resolve:
No ivy:settings found for the default reference 'ivy.instance'.  A default instance will be
used
no settings file found, using default...
[ivy:retrieve] :: Ivy 2.0.0-rc2 - 20081028224207 :: http://ant.apache.org/ivy/ ::
:: loading settings :: url = jar:<https://builds.apache.org/job/Accumulo-1.3.x/ws/1.3/thrift-0.3.0/lib/java/build/ivy/ivy-2.0.0-rc2.jar!/org/apache/ivy/core/settings/ivysettings.xml>
[ivy:retrieve] :: resolving dependencies :: org.apache.thrift#libthrift;0.3.0-20100116
[ivy:retrieve] 	confs: [default]
[ivy:retrieve] 	found org.slf4j#slf4j-api;1.5.8 in default
[ivy:retrieve] 	found org.slf4j#slf4j-simple;1.5.8 in public
[ivy:retrieve] 	found commons-lang#commons-lang;2.4 in default
[ivy:retrieve] 	found junit#junit;4.4 in public
[ivy:retrieve] :: resolution report :: resolve 149ms :: artifacts dl 6ms
	---------------------------------------------------------------------
	|                  |            modules            ||   artifacts   |
	|       conf       | number| search|dwnlded|evicted|| number|dwnlded|
	---------------------------------------------------------------------
	|      default     |   4   |   0   |   0   |   0   ||   4   |   0   |
	---------------------------------------------------------------------
[ivy:retrieve] :: retrieving :: org.apache.thrift#libthrift
[ivy:retrieve] 	confs: [default]
[ivy:retrieve] 	4 artifacts copied, 0 already retrieved (443kB/7ms)

compile:
    [javac] Compiling 60 source files to <https://builds.apache.org/job/Accumulo-1.3.x/ws/1.3/thrift-0.3.0/lib/java/build>
    [javac] Note: <https://builds.apache.org/job/Accumulo-1.3.x/ws/1.3/thrift-0.3.0/lib/java/src/org/apache/thrift/TUnion.java>
uses or overrides a deprecated API.
    [javac] Note: Recompile with -Xlint:deprecation for details.
    [javac] Note: Some input files use unchecked or unsafe operations.
    [javac] Note: Recompile with -Xlint:unchecked for details.

dist:
    [mkdir] Created dir: <https://builds.apache.org/job/Accumulo-1.3.x/ws/1.3/thrift-0.3.0/lib/java/build/META-INF>
     [copy] Copying 1 file to <https://builds.apache.org/job/Accumulo-1.3.x/ws/1.3/thrift-0.3.0/lib/java/build/META-INF>
     [copy] Copying 1 file to <https://builds.apache.org/job/Accumulo-1.3.x/ws/1.3/thrift-0.3.0/lib/java/build/META-INF>
      [jar] Building jar: <https://builds.apache.org/job/Accumulo-1.3.x/ws/1.3/thrift-0.3.0/lib/java/libthrift.jar>

BUILD SUCCESSFUL
Total time: 2 seconds
mvn install:install-file -Dfile=thrift-0.3.0/lib/java/libthrift.jar -DgroupId=org.apache.accumulo.thrift
-DartifactId=libthrift -Dversion=0.3 -Dpackaging=jar
[INFO] Scanning for projects...
[WARNING] 
[WARNING] Some problems were encountered while building the effective model for org.apache.accumulo:cloudtrace:jar:1.3.6-SNAPSHOT
[WARNING] 'build.plugins.plugin.(groupId:artifactId)' must be unique but found duplicate declaration
of plugin org.codehaus.mojo:exec-maven-plugin @ org.apache.accumulo:accumulo:1.3.6-SNAPSHOT,
<https://builds.apache.org/job/Accumulo-1.3.x/ws/1.3/pom.xml,> line 334, column 15
[WARNING] 
[WARNING] Some problems were encountered while building the effective model for org.apache.accumulo:accumulo:pom:1.3.6-SNAPSHOT
[WARNING] 'build.plugins.plugin.(groupId:artifactId)' must be unique but found duplicate declaration
of plugin org.codehaus.mojo:exec-maven-plugin @ line 334, column 15
[WARNING] 
[WARNING] It is highly recommended to fix these problems because they threaten the stability
of your build.
[WARNING] 
[WARNING] For this reason, future Maven versions might no longer support building such malformed
projects.
[WARNING] 
[INFO] ------------------------------------------------------------------------
[INFO] Reactor Build Order:
[INFO] 
[INFO] accumulo
[INFO] cloudtrace
[INFO] accumulo-start
[INFO] accumulo-core
[INFO] accumulo-server
[INFO] accumulo-examples
[INFO]                                                                         
[INFO] ------------------------------------------------------------------------
[INFO] Building accumulo 1.3.6-SNAPSHOT
[INFO] ------------------------------------------------------------------------
[INFO] 
[INFO] --- maven-install-plugin:2.3.1:install-file (default-cli) @ accumulo ---
[INFO] Installing <https://builds.apache.org/job/Accumulo-1.3.x/ws/1.3/thrift-0.3.0/lib/java/libthrift.jar>
to /home/jenkins/.m2/repository/org/apache/accumulo/thrift/libthrift/0.3/libthrift-0.3.jar
[INFO] ------------------------------------------------------------------------
[INFO] Reactor Summary:
[INFO] 
[INFO] accumulo .......................................... SUCCESS [0.262s]
[INFO] cloudtrace ........................................ SKIPPED
[INFO] accumulo-start .................................... SKIPPED
[INFO] accumulo-core ..................................... SKIPPED
[INFO] accumulo-server ................................... SKIPPED
[INFO] accumulo-examples ................................. SKIPPED
[INFO] ------------------------------------------------------------------------
[INFO] BUILD SUCCESS
[INFO] ------------------------------------------------------------------------
[INFO] Total time: 1.057s
[INFO] Finished at: Fri Apr 27 17:50:18 UTC 2012
[INFO] Final Memory: 6M/79M
[INFO] ------------------------------------------------------------------------
rm -rf thrift-0.3.0
mojoSucceeded org.codehaus.mojo:exec-maven-plugin:1.2(thrift-jar)
mojoStarted org.apache.maven.plugins:maven-dependency-plugin:2.1(copy-dependencies)
[INFO] 
[INFO] --- maven-dependency-plugin:2.1:copy-dependencies (copy-dependencies) @ accumulo ---
mojoSucceeded org.apache.maven.plugins:maven-dependency-plugin:2.1(copy-dependencies)
mojoStarted org.codehaus.mojo:cobertura-maven-plugin:2.5.1(default-cli)
[INFO] 
[INFO] --- cobertura-maven-plugin:2.5.1:instrument (default-cli) @ accumulo ---
[INFO] Skipping cobertura mojo for project with packaging type 'pom'
mojoSucceeded org.codehaus.mojo:cobertura-maven-plugin:2.5.1(default-cli)
forkedProjectSucceeded org.apache.accumulo:accumulo:1.3.6-SNAPSHOT
mojoStarted org.codehaus.mojo:cobertura-maven-plugin:2.5.1(default-cli)
[JENKINS] cobertura-maven-plugin already configured with xml reports enabled
[INFO] 
[INFO] --- cobertura-maven-plugin:2.5.1:cobertura (default-cli) @ accumulo ---
mojoSucceeded org.codehaus.mojo:cobertura-maven-plugin:2.5.1(default-cli)
projectSucceeded org.apache.accumulo:accumulo:1.3.6-SNAPSHOT
projectStarted org.apache.accumulo:cloudtrace:1.3.6-SNAPSHOT
[INFO] Downloading: http://repo1.maven.org/maven2/org/eclipse/m2e/lifecycle-mapping/1.0.0/lifecycle-mapping-1.0.0.pom
                                                                        
[INFO] ------------------------------------------------------------------------
[INFO] Building cloudtrace 1.3.6-SNAPSHOT
[INFO] ------------------------------------------------------------------------
[WARNING] The POM for org.eclipse.m2e:lifecycle-mapping:jar:1.0.0 is missing, no dependency
information available
[WARNING] Failed to retrieve plugin descriptor for org.eclipse.m2e:lifecycle-mapping:1.0.0:
Plugin org.eclipse.m2e:lifecycle-mapping:1.0.0 or one of its dependencies could not be resolved:
Failed to read artifact descriptor for org.eclipse.m2e:lifecycle-mapping:jar:1.0.0
Downloading: http://repo1.maven.org/maven2/org/apache/accumulo/thrift/libthrift/0.3/libthrift-0.3.pom
[WARNING] The POM for org.apache.accumulo.thrift:libthrift:jar:0.3 is missing, no dependency
information available
Downloading: http://repo1.maven.org/maven2/org/apache/accumulo/thrift/libthrift/0.3/libthrift-0.3.jar
projectFailed org.apache.accumulo:cloudtrace:1.3.6-SNAPSHOT
sessionEnded
[INFO] ------------------------------------------------------------------------
[INFO] Reactor Summary:
[INFO] 
[INFO] accumulo .......................................... SUCCESS [1:37.783s]
[INFO] cloudtrace ........................................ FAILURE [0.733s]
[INFO] accumulo-start .................................... SKIPPED
[INFO] accumulo-core ..................................... SKIPPED
[INFO] accumulo-server ................................... SKIPPED
[INFO] accumulo-examples ................................. SKIPPED
[INFO] ------------------------------------------------------------------------
[INFO] BUILD FAILURE
[INFO] ------------------------------------------------------------------------
[INFO] Total time: 1:53.581s
[INFO] Finished at: Fri Apr 27 17:50:35 UTC 2012
[INFO] Final Memory: 20M/88M
[INFO] ------------------------------------------------------------------------
Projects to build: [MavenProject: org.apache.accumulo:accumulo:1.3.6-SNAPSHOT @ <https://builds.apache.org/job/Accumulo-1.3.x/ws/1.3/pom.xml,>
MavenProject: org.apache.accumulo:cloudtrace:1.3.6-SNAPSHOT @ <https://builds.apache.org/job/Accumulo-1.3.x/ws/1.3/src/trace/pom.xml,>
MavenProject: org.apache.accumulo:accumulo-start:1.3.6-SNAPSHOT @ <https://builds.apache.org/job/Accumulo-1.3.x/ws/1.3/src/start/pom.xml,>
MavenProject: org.apache.accumulo:accumulo-core:1.3.6-SNAPSHOT @ <https://builds.apache.org/job/Accumulo-1.3.x/ws/1.3/src/core/pom.xml,>
MavenProject: org.apache.accumulo:accumulo-server:1.3.6-SNAPSHOT @ <https://builds.apache.org/job/Accumulo-1.3.x/ws/1.3/src/server/pom.xml,>
MavenProject: org.apache.accumulo:accumulo-examples:1.3.6-SNAPSHOT @ <https://builds.apache.org/job/Accumulo-1.3.x/ws/1.3/src/examples/pom.xml]>
[JENKINS] Archiving <https://builds.apache.org/job/Accumulo-1.3.x/ws/1.3/src/server/pom.xml>
to /home/hudson/hudson/jobs/Accumulo-1.3.x/modules/org.apache.accumulo$accumulo-server/builds/2012-04-27_17-48-10/archive/org.apache.accumulo/accumulo-server/1.3.6-SNAPSHOT/accumulo-server-1.3.6-SNAPSHOT.pom
[JENKINS] Archiving <https://builds.apache.org/job/Accumulo-1.3.x/ws/1.3/src/trace/pom.xml>
to /home/hudson/hudson/jobs/Accumulo-1.3.x/modules/org.apache.accumulo$cloudtrace/builds/2012-04-27_17-48-10/archive/org.apache.accumulo/cloudtrace/1.3.6-SNAPSHOT/cloudtrace-1.3.6-SNAPSHOT.pom
[JENKINS] Archiving <https://builds.apache.org/job/Accumulo-1.3.x/ws/1.3/src/examples/pom.xml>
to /home/hudson/hudson/jobs/Accumulo-1.3.x/modules/org.apache.accumulo$accumulo-examples/builds/2012-04-27_17-48-10/archive/org.apache.accumulo/accumulo-examples/1.3.6-SNAPSHOT/accumulo-examples-1.3.6-SNAPSHOT.pom
[JENKINS] Archiving <https://builds.apache.org/job/Accumulo-1.3.x/ws/1.3/pom.xml> to
/home/hudson/hudson/jobs/Accumulo-1.3.x/modules/org.apache.accumulo$accumulo/builds/2012-04-27_17-48-10/archive/org.apache.accumulo/accumulo/1.3.6-SNAPSHOT/accumulo-1.3.6-SNAPSHOT.pom
[JENKINS] Archiving <https://builds.apache.org/job/Accumulo-1.3.x/ws/1.3/src/start/pom.xml>
to /home/hudson/hudson/jobs/Accumulo-1.3.x/modules/org.apache.accumulo$accumulo-start/builds/2012-04-27_17-48-10/archive/org.apache.accumulo/accumulo-start/1.3.6-SNAPSHOT/accumulo-start-1.3.6-SNAPSHOT.pom
[JENKINS] Archiving <https://builds.apache.org/job/Accumulo-1.3.x/ws/1.3/src/core/pom.xml>
to /home/hudson/hudson/jobs/Accumulo-1.3.x/modules/org.apache.accumulo$accumulo-core/builds/2012-04-27_17-48-10/archive/org.apache.accumulo/accumulo-core/1.3.6-SNAPSHOT/accumulo-core-1.3.6-SNAPSHOT.pom
Waiting for Jenkins to finish collecting data
mavenExecutionResult exceptions not empty
message : Failed to execute goal on project cloudtrace: Could not resolve dependencies for
project org.apache.accumulo:cloudtrace:jar:1.3.6-SNAPSHOT: Could not find artifact org.apache.accumulo.thrift:libthrift:jar:0.3
in central (http://repo1.maven.org/maven2)
cause : Could not resolve dependencies for project org.apache.accumulo:cloudtrace:jar:1.3.6-SNAPSHOT:
Could not find artifact org.apache.accumulo.thrift:libthrift:jar:0.3 in central (http://repo1.maven.org/maven2)
Stack trace : 
org.apache.maven.lifecycle.LifecycleExecutionException: Failed to execute goal on project
cloudtrace: Could not resolve dependencies for project org.apache.accumulo:cloudtrace:jar:1.3.6-SNAPSHOT:
Could not find artifact org.apache.accumulo.thrift:libthrift:jar:0.3 in central (http://repo1.maven.org/maven2)
	at org.apache.maven.lifecycle.internal.LifecycleDependencyResolver.getDependencies(LifecycleDependencyResolver.java:196)
	at org.apache.maven.lifecycle.internal.LifecycleDependencyResolver.resolveProjectDependencies(LifecycleDependencyResolver.java:108)
	at org.apache.maven.lifecycle.internal.MojoExecutor.ensureDependenciesAreResolved(MojoExecutor.java:258)
	at org.apache.maven.lifecycle.internal.MojoExecutor.execute(MojoExecutor.java:201)
	at org.apache.maven.lifecycle.internal.MojoExecutor.execute(MojoExecutor.java:153)
	at org.apache.maven.lifecycle.internal.MojoExecutor.execute(MojoExecutor.java:145)
	at org.apache.maven.lifecycle.internal.LifecycleModuleBuilder.buildProject(LifecycleModuleBuilder.java:84)
	at org.apache.maven.lifecycle.internal.LifecycleModuleBuilder.buildProject(LifecycleModuleBuilder.java:59)
	at org.apache.maven.lifecycle.internal.LifecycleStarter.singleThreadedBuild(LifecycleStarter.java:183)
	at org.apache.maven.lifecycle.internal.LifecycleStarter.execute(LifecycleStarter.java:161)
	at org.apache.maven.DefaultMaven.doExecute(DefaultMaven.java:319)
	at org.apache.maven.DefaultMaven.execute(DefaultMaven.java:156)
	at org.jvnet.hudson.maven3.launcher.Maven3Launcher.main(Maven3Launcher.java:79)
	at sun.reflect.NativeMethodAccessorImpl.invoke0(Native Method)
	at sun.reflect.NativeMethodAccessorImpl.invoke(NativeMethodAccessorImpl.java:39)
	at sun.reflect.DelegatingMethodAccessorImpl.invoke(DelegatingMethodAccessorImpl.java:25)
	at java.lang.reflect.Method.invoke(Method.java:597)
	at org.codehaus.plexus.classworlds.launcher.Launcher.launchStandard(Launcher.java:329)
	at org.codehaus.plexus.classworlds.launcher.Launcher.launch(Launcher.java:239)
	at org.jvnet.hudson.maven3.agent.Maven3Main.launch(Maven3Main.java:158)
	at hudson.maven.Maven3Builder.call(Maven3Builder.java:98)
	at hudson.maven.Maven3Builder.call(Maven3Builder.java:64)
	at hudson.remoting.UserRequest.perform(UserRequest.java:118)
	at hudson.remoting.UserRequest.perform(UserRequest.java:48)
	at hudson.remoting.Request$2.run(Request.java:287)
	at hudson.remoting.InterceptingExecutorService$1.call(InterceptingExecutorService.java:72)
	at java.util.concurrent.FutureTask$Sync.innerRun(FutureTask.java:303)
	at java.util.concurrent.FutureTask.run(FutureTask.java:138)
	at java.util.concurrent.ThreadPoolExecutor$Worker.runTask(ThreadPoolExecutor.java:886)
	at java.util.concurrent.ThreadPoolExecutor$Worker.run(ThreadPoolExecutor.java:908)
	at java.lang.Thread.run(Thread.java:662)
Caused by: org.apache.maven.project.DependencyResolutionException: Could not resolve dependencies
for project org.apache.accumulo:cloudtrace:jar:1.3.6-SNAPSHOT: Could not find artifact org.apache.accumulo.thrift:libthrift:jar:0.3
in central (http://repo1.maven.org/maven2)
	at org.apache.maven.project.DefaultProjectDependenciesResolver.resolve(DefaultProjectDependenciesResolver.java:170)
	at org.apache.maven.lifecycle.internal.LifecycleDependencyResolver.getDependencies(LifecycleDependencyResolver.java:171)
	... 30 more
Caused by: org.sonatype.aether.resolution.DependencyResolutionException: Could not find artifact
org.apache.accumulo.thrift:libthrift:jar:0.3 in central (http://repo1.maven.org/maven2)
	at org.sonatype.aether.impl.internal.DefaultRepositorySystem.resolveDependencies(DefaultRepositorySystem.java:412)
	at org.apache.maven.project.DefaultProjectDependenciesResolver.resolve(DefaultProjectDependenciesResolver.java:164)
	... 31 more
Caused by: org.sonatype.aether.resolution.ArtifactResolutionException: Could not find artifact
org.apache.accumulo.thrift:libthrift:jar:0.3 in central (http://repo1.maven.org/maven2)
	at org.sonatype.aether.impl.internal.DefaultArtifactResolver.resolve(DefaultArtifactResolver.java:541)
	at org.sonatype.aether.impl.internal.DefaultArtifactResolver.resolveArtifacts(DefaultArtifactResolver.java:220)
	at org.sonatype.aether.impl.internal.DefaultRepositorySystem.resolveDependencies(DefaultRepositorySystem.java:395)
	... 32 more
Caused by: org.sonatype.aether.transfer.ArtifactNotFoundException: Could not find artifact
org.apache.accumulo.thrift:libthrift:jar:0.3 in central (http://repo1.maven.org/maven2)
	at org.sonatype.aether.connector.wagon.WagonRepositoryConnector$4.wrap(WagonRepositoryConnector.java:945)
	at org.sonatype.aether.connector.wagon.WagonRepositoryConnector$4.wrap(WagonRepositoryConnector.java:940)
	at org.sonatype.aether.connector.wagon.WagonRepositoryConnector$GetTask.flush(WagonRepositoryConnector.java:695)
	at org.sonatype.aether.connector.wagon.WagonRepositoryConnector$GetTask.flush(WagonRepositoryConnector.java:689)
	at org.sonatype.aether.connector.wagon.WagonRepositoryConnector.get(WagonRepositoryConnector.java:445)
	at org.sonatype.aether.impl.internal.DefaultArtifactResolver.resolve(DefaultArtifactResolver.java:460)
	... 34 more
Sending e-mails to: dev@accumulo.apache.org
channel stopped
Skipping Cobertura coverage report as build was not UNSTABLE or better ...

Mime
View raw message