accumulo-dev mailing list archives

Site index · List index
Message view « Date » · « Thread »
Top « Date » · « Thread »
From Apache Jenkins Server <jenk...@builds.apache.org>
Subject Build failed in Jenkins: Accumulo-1.3.x #42
Date Tue, 27 Mar 2012 01:43:33 GMT
See <https://builds.apache.org/job/Accumulo-1.3.x/42/>

------------------------------------------
[...truncated 1225 lines...]
AU        src/trace/src/main/java/cloudtrace/instrument/thrift/TraceWrap.java
AU        src/trace/src/main/java/cloudtrace/instrument/Span.java
A         src/trace/src/main/java/cloudtrace/instrument/impl
AU        src/trace/src/main/java/cloudtrace/instrument/impl/MilliSpan.java
AU        src/trace/src/main/java/cloudtrace/instrument/impl/NullSpan.java
AU        src/trace/src/main/java/cloudtrace/instrument/impl/RootMilliSpan.java
AU        src/trace/src/main/java/cloudtrace/instrument/Sampler.java
AU        src/trace/src/main/java/cloudtrace/instrument/TraceRunnable.java
A         src/trace/src/main/java/cloudtrace/instrument/receivers
AU        src/trace/src/main/java/cloudtrace/instrument/receivers/SendSpansViaThrift.java
AU        src/trace/src/main/java/cloudtrace/instrument/receivers/AsyncSpanReceiver.java
AU        src/trace/src/main/java/cloudtrace/instrument/receivers/LogSpans.java
AU        src/trace/src/main/java/cloudtrace/instrument/receivers/SpanReceiver.java
AU        src/trace/src/main/java/cloudtrace/instrument/receivers/ZooSpanClient.java
AU        src/trace/src/main/java/cloudtrace/instrument/CountSampler.java
AU        src/trace/src/main/java/cloudtrace/instrument/Trace.java
AU        src/trace/src/main/java/cloudtrace/instrument/TraceCallable.java
AU        src/trace/src/main/java/cloudtrace/instrument/TraceExecutorService.java
AU        src/trace/thrift.sh
AU        src/trace/pom.xml
AU        CHANGES
A         bin
AU        bin/stop-here.sh
AU        bin/upgrade.sh
AU        bin/tup.sh
AU        bin/stop-server.sh
AU        bin/stop-all.sh
AU        bin/tdown.sh
AU        bin/LogForwarder.sh
AU        bin/tool.sh
AU        bin/start-here.sh
AU        bin/accumulo
AU        bin/check-slaves
AU        bin/etc_initd_accumulo
AU        bin/start-server.sh
AU        bin/start-all.sh
AU        bin/config.sh
A         docs
AU        docs/documentation.css
AU        docs/isolation.html
AU        docs/mockAccumulo.html
A         docs/src
A         docs/src/developer_manual
AU        docs/src/developer_manual/developer_manual.tex
A         docs/src/developer_manual/images
AU        docs/src/developer_manual/images/system_blocks.jpg
AU        docs/src/developer_manual/images/tserver_monitor.jpg
AU        docs/src/developer_manual/images/tserver_rw.jpg
AU        docs/src/developer_manual/images/component_overview.jpg
AU        docs/src/developer_manual/images/tserver_recovery.jpg
AU        docs/src/developer_manual/images/tablet_hierarchy.jpg
AU        docs/src/developer_manual/images/tablet_dataflow.jpg
AU        docs/src/developer_manual/images/tserver_maintenance.jpg
AU        docs/src/developer_manual/images/tserver_config.jpg
AU        docs/src/developer_manual/component_docs.odp
A         docs/src/user_manual
AU        docs/src/user_manual/accumulo_user_manual.tex
A         docs/src/user_manual/images
AU        docs/src/user_manual/images/data_distribution.png
AU        docs/src/user_manual/images/failure_handling.png
AU        docs/src/user_manual/build.sh
A         docs/src/user_manual/chapters
AU        docs/src/user_manual/chapters/table_design.tex
AU        docs/src/user_manual/chapters/clients.tex
AU        docs/src/user_manual/chapters/introduction.tex
AU        docs/src/user_manual/chapters/administration.tex
AU        docs/src/user_manual/chapters/analytics.tex
AU        docs/src/user_manual/chapters/security.tex
AU        docs/src/user_manual/chapters/shell.tex
AU        docs/src/user_manual/chapters/high_speed_ingest.tex
AU        docs/src/user_manual/chapters/design.tex
AU        docs/src/user_manual/chapters/table_configuration.tex
A         docs/src/user_manual/appendices
AU        docs/src/user_manual/appendices/get_shell_commands.sh
AU        docs/src/user_manual/appendices/shell_commands.tex
AU        docs/src/user_manual/appendices/get_shell_command.sh
AU        docs/administration.html
AU        docs/config.html
AU        docs/metrics.html
AU        docs/timestamps.html
AU        docs/aggregation.html
AU        docs/bulkIngest.html
AU        docs/constraints.html
AU        docs/index.html
AU        docs/distributedTracing.html
A         docs/examples
AU        docs/examples/README.filter
AU        docs/examples/README.aggregation
AU        docs/examples/README.bulkIngest
AU        docs/examples/README.constraints
AU        docs/examples/README.bloom
AU        docs/examples/README.mapred
AU        docs/examples/README.dirlist
AU        docs/examples/README.helloworld
AU        docs/examples/README
AU        docs/examples/README.batch
AU        docs/examples/README.shard
AU        docs/lgroups.html
AU        pom.xml
AU        README
 U        .
At revision 1305705
no revision recorded for https://svn.apache.org/repos/asf/accumulo/branches/1.3 in the previous
build
Parsing POMs
Modules changed, recalculating dependency graph
[1.3] $ /home/hudson/tools/java/latest1.6/bin/java -cp /home/jenkins/jenkins-slave/maven3-agent.jar:/home/hudson/tools/maven/latest3/boot/plexus-classworlds-2.4.jar
org.jvnet.hudson.maven3.agent.Maven3Main /home/hudson/tools/maven/latest3 /home/jenkins/jenkins-slave/slave.jar
/home/jenkins/jenkins-slave/maven3-interceptor.jar 39364
<===[JENKINS REMOTING CAPACITY]===>channel started
   log4j:WARN No appenders could be found for logger (org.apache.commons.beanutils.converters.BooleanConverter).
log4j:WARN Please initialize the log4j system properly.
Executing Maven:  -B -f <https://builds.apache.org/job/Accumulo-1.3.x/ws/1.3/pom.xml>
-Dmaven.repo.local=/home/jenkins/jenkins-slave/maven-repositories/1 -Daccumulo-scm-url=scm:svn:http://svn.apache.org/repos/asf/incubator/accumulo/branches/1.3/
-Daccumulo-scm-devurl=scm:svn:https://svn.apache.org/repos/asf/incubator/accumulo/branches/1.3/
clean package cobertura:cobertura
[INFO] Scanning for projects...
[INFO] ------------------------------------------------------------------------
[INFO] Reactor Build Order:
[INFO] 
[INFO] accumulo
[INFO] cloudtrace
[INFO] accumulo-start
[INFO] accumulo-core
[INFO] accumulo-server
[INFO] accumulo-examples
Downloading: http://repo1.maven.org/maven2/org/eclipse/m2e/lifecycle-mapping/1.0.0/lifecycle-mapping-1.0.0.pom
[WARNING] The POM for org.eclipse.m2e:lifecycle-mapping:jar:1.0.0 is missing, no dependency
information available
[WARNING] Failed to retrieve plugin descriptor for org.eclipse.m2e:lifecycle-mapping:1.0.0:
Plugin org.eclipse.m2e:lifecycle-mapping:1.0.0 or one of its dependencies could not be resolved:
Failed to read artifact descriptor for org.eclipse.m2e:lifecycle-mapping:jar:1.0.0
Downloading: http://repo1.maven.org/maven2/org/eclipse/m2e/lifecycle-mapping/1.0.0/lifecycle-mapping-1.0.0.pom
[INFO] [WARNING] The POM for org.eclipse.m2e:lifecycle-mapping:jar:1.0.0 is missing, no dependency
information available
[WARNING] Failed to retrieve plugin descriptor for org.eclipse.m2e:lifecycle-mapping:1.0.0:
Plugin org.eclipse.m2e:lifecycle-mapping:1.0.0 or one of its dependencies could not be resolved:
Failed to read artifact descriptor for org.eclipse.m2e:lifecycle-mapping:jar:1.0.0
                                                                        
[INFO] ------------------------------------------------------------------------
[INFO] Building accumulo 1.3.6-SNAPSHOT
[INFO] ------------------------------------------------------------------------
[INFO] [INFO] Deleting <https://builds.apache.org/job/Accumulo-1.3.x/ws/1.3/lib> (includes
= [*.jar], excludes = [])
[INFO] Deleting <https://builds.apache.org/job/Accumulo-1.3.x/ws/1.3/test> (includes
= [**/*.so], excludes = [])

[INFO] --- maven-clean-plugin:2.4.1:clean (default-clean) @ accumulo ---
[INFO] Deleting <https://builds.apache.org/job/Accumulo-1.3.x/ws/1.3> (includes = [**/*.pyc],
excludes = [])
[INFO] 
[INFO] --- maven-enforcer-plugin:1.0-beta-1:enforce (enforce-mvn) @ accumulo ---
[INFO] 
[INFO] --- maven-remote-resources-plugin:1.2.1:process (default) @ accumulo ---
[INFO] 
[INFO] --- maven-dependency-plugin:2.1:copy-dependencies (copy-dependencies) @ accumulo ---
[INFO] Missing pdflatex command. Please install.

[INFO] --- exec-maven-plugin:1.2:exec (user-manual) @ accumulo ---
[INFO] 
[INFO] --- maven-site-plugin:3.0:attach-descriptor (attach-descriptor) @ accumulo ---
[JENKINS] Configuring cobertura-maven-plugin to enable xml reports
[INFO] 
[INFO] --- maven-enforcer-plugin:1.0-beta-1:enforce (enforce-mvn) @ accumulo ---
[INFO] 
[INFO] --- maven-remote-resources-plugin:1.2.1:process (default) @ accumulo ---
[INFO] 
[INFO] --- maven-dependency-plugin:2.1:copy-dependencies (copy-dependencies) @ accumulo ---
[INFO] 
[INFO] --- cobertura-maven-plugin:2.5.1:instrument (default-cli) @ accumulo ---
[INFO] Skipping cobertura mojo for project with packaging type 'pom'
[JENKINS] Archiving <https://builds.apache.org/job/Accumulo-1.3.x/ws/1.3/pom.xml> to
/home/hudson/hudson/jobs/Accumulo-1.3.x/modules/org.apache.accumulo$accumulo/builds/2012-03-27_01-33-23/archive/org.apache.accumulo/accumulo/1.3.6-SNAPSHOT/accumulo-1.3.6-SNAPSHOT.pom
[JENKINS] cobertura-maven-plugin already configured with xml reports enabled
[INFO] 
[INFO] --- cobertura-maven-plugin:2.5.1:cobertura (default-cli) @ accumulo ---
[INFO] Downloading: http://repo1.maven.org/maven2/org/eclipse/m2e/lifecycle-mapping/1.0.0/lifecycle-mapping-1.0.0.pom
                                                                        
[INFO] ------------------------------------------------------------------------
[INFO] Building cloudtrace 1.3.6-SNAPSHOT
[INFO] ------------------------------------------------------------------------
[WARNING] The POM for org.eclipse.m2e:lifecycle-mapping:jar:1.0.0 is missing, no dependency
information available
[WARNING] Failed to retrieve plugin descriptor for org.eclipse.m2e:lifecycle-mapping:1.0.0:
Plugin org.eclipse.m2e:lifecycle-mapping:1.0.0 or one of its dependencies could not be resolved:
Failed to read artifact descriptor for org.eclipse.m2e:lifecycle-mapping:jar:1.0.0
Downloading: http://accumulo.apache.org/mvn_repo/org/apache/accumulo/thrift/libthrift/0.3/libthrift-0.3.pom
Downloading: http://repo1.maven.org/maven2/org/apache/accumulo/thrift/libthrift/0.3/libthrift-0.3.pom
[WARNING] The POM for org.apache.accumulo.thrift:libthrift:jar:0.3 is missing, no dependency
information available
Downloading: http://accumulo.apache.org/mvn_repo/org/apache/accumulo/thrift/libthrift/0.3/libthrift-0.3.jar
Downloading: http://repo1.maven.org/maven2/org/apache/accumulo/thrift/libthrift/0.3/libthrift-0.3.jar
[JENKINS] Archiving <https://builds.apache.org/job/Accumulo-1.3.x/ws/1.3/src/trace/pom.xml>
to /home/hudson/hudson/jobs/Accumulo-1.3.x/modules/org.apache.accumulo$cloudtrace/builds/2012-03-27_01-33-29/archive/org.apache.accumulo/cloudtrace/1.3.6-SNAPSHOT/cloudtrace-1.3.6-SNAPSHOT.pom
[INFO] ------------------------------------------------------------------------
[INFO] Reactor Summary:
[INFO] 
[INFO] accumulo .......................................... SUCCESS [3:50.673s]
[INFO] cloudtrace ........................................ FAILURE [0.686s]
[INFO] accumulo-start .................................... SKIPPED
[INFO] accumulo-core ..................................... SKIPPED
[INFO] accumulo-server ................................... SKIPPED
[INFO] accumulo-examples ................................. SKIPPED
[INFO] ------------------------------------------------------------------------
[INFO] BUILD FAILURE
[INFO] ------------------------------------------------------------------------
[INFO] Total time: 4:05.400s
[INFO] Finished at: Tue Mar 27 01:43:08 UTC 2012
[INFO] Final Memory: 20M/124M
[INFO] ------------------------------------------------------------------------
mavenExecutionResult exceptions not empty
message : Failed to execute goal on project cloudtrace: Could not resolve dependencies for
project org.apache.accumulo:cloudtrace:jar:1.3.6-SNAPSHOT: Could not find artifact org.apache.accumulo.thrift:libthrift:jar:0.3
in legacy-releases (http://accumulo.apache.org/mvn_repo)
cause : Could not resolve dependencies for project org.apache.accumulo:cloudtrace:jar:1.3.6-SNAPSHOT:
Could not find artifact org.apache.accumulo.thrift:libthrift:jar:0.3 in legacy-releases (http://accumulo.apache.org/mvn_repo)
Stack trace : 
org.apache.maven.lifecycle.LifecycleExecutionException: Failed to execute goal on project
cloudtrace: Could not resolve dependencies for project org.apache.accumulo:cloudtrace:jar:1.3.6-SNAPSHOT:
Could not find artifact org.apache.accumulo.thrift:libthrift:jar:0.3 in legacy-releases (http://accumulo.apache.org/mvn_repo)
	at org.apache.maven.lifecycle.internal.LifecycleDependencyResolver.getDependencies(LifecycleDependencyResolver.java:196)
	at org.apache.maven.lifecycle.internal.LifecycleDependencyResolver.resolveProjectDependencies(LifecycleDependencyResolver.java:108)
	at org.apache.maven.lifecycle.internal.MojoExecutor.ensureDependenciesAreResolved(MojoExecutor.java:258)
	at org.apache.maven.lifecycle.internal.MojoExecutor.execute(MojoExecutor.java:201)
	at org.apache.maven.lifecycle.internal.MojoExecutor.execute(MojoExecutor.java:153)
	at org.apache.maven.lifecycle.internal.MojoExecutor.execute(MojoExecutor.java:145)
	at org.apache.maven.lifecycle.internal.LifecycleModuleBuilder.buildProject(LifecycleModuleBuilder.java:84)
	at org.apache.maven.lifecycle.internal.LifecycleModuleBuilder.buildProject(LifecycleModuleBuilder.java:59)
	at org.apache.maven.lifecycle.internal.LifecycleStarter.singleThreadedBuild(LifecycleStarter.java:183)
	at org.apache.maven.lifecycle.internal.LifecycleStarter.execute(LifecycleStarter.java:161)
	at org.apache.maven.DefaultMaven.doExecute(DefaultMaven.java:319)
	at org.apache.maven.DefaultMaven.execute(DefaultMaven.java:156)
	at org.jvnet.hudson.maven3.launcher.Maven3Launcher.main(Maven3Launcher.java:79)
	at sun.reflect.NativeMethodAccessorImpl.invoke0(Native Method)
	at sun.reflect.NativeMethodAccessorImpl.invoke(NativeMethodAccessorImpl.java:39)
	at sun.reflect.DelegatingMethodAccessorImpl.invoke(DelegatingMethodAccessorImpl.java:25)
	at java.lang.reflect.Method.invoke(Method.java:597)
	at org.codehaus.plexus.classworlds.launcher.Launcher.launchStandard(Launcher.java:329)
	at org.codehaus.plexus.classworlds.launcher.Launcher.launch(Launcher.java:239)
	at org.jvnet.hudson.maven3.agent.Maven3Main.launch(Maven3Main.java:158)
	at hudson.maven.Maven3Builder.call(Maven3Builder.java:104)
	at hudson.maven.Maven3Builder.call(Maven3Builder.java:70)
	at hudson.remoting.UserRequest.perform(UserRequest.java:118)
	at hudson.remoting.UserRequest.perform(UserRequest.java:48)
	at hudson.remoting.Request$2.run(Request.java:287)
	at hudson.remoting.InterceptingExecutorService$1.call(InterceptingExecutorService.java:72)
	at java.util.concurrent.FutureTask$Sync.innerRun(FutureTask.java:303)
	at java.util.concurrent.FutureTask.run(FutureTask.java:138)
	at java.util.concurrent.ThreadPoolExecutor$Worker.runTask(ThreadPoolExecutor.java:886)
	at java.util.concurrent.ThreadPoolExecutor$Worker.run(ThreadPoolExecutor.java:908)
	at java.lang.Thread.run(Thread.java:662)
Caused by: org.apache.maven.project.DependencyResolutionException: Could not resolve dependencies
for project org.apache.accumulo:cloudtrace:jar:1.3.6-SNAPSHOT: Could not find artifact org.apache.accumulo.thrift:libthrift:jar:0.3
in legacy-releases (http://accumulo.apache.org/mvn_repo)
	at org.apache.maven.project.DefaultProjectDependenciesResolver.resolve(DefaultProjectDependenciesResolver.java:170)
	at org.apache.maven.lifecycle.internal.LifecycleDependencyResolver.getDependencies(LifecycleDependencyResolver.java:171)
	... 30 more
Caused by: org.sonatype.aether.resolution.DependencyResolutionException: Could not find artifact
org.apache.accumulo.thrift:libthrift:jar:0.3 in legacy-releases (http://accumulo.apache.org/mvn_repo)
	at org.sonatype.aether.impl.internal.DefaultRepositorySystem.resolveDependencies(DefaultRepositorySystem.java:412)
	at org.apache.maven.project.DefaultProjectDependenciesResolver.resolve(DefaultProjectDependenciesResolver.java:164)
	... 31 more
Caused by: org.sonatype.aether.resolution.ArtifactResolutionException: Could not find artifact
org.apache.accumulo.thrift:libthrift:jar:0.3 in legacy-releases (http://accumulo.apache.org/mvn_repo)
	at org.sonatype.aether.impl.internal.DefaultArtifactResolver.resolve(DefaultArtifactResolver.java:541)
	at org.sonatype.aether.impl.internal.DefaultArtifactResolver.resolveArtifacts(DefaultArtifactResolver.java:220)
	at org.sonatype.aether.impl.internal.DefaultRepositorySystem.resolveDependencies(DefaultRepositorySystem.java:395)
	... 32 more
Caused by: org.sonatype.aether.transfer.ArtifactNotFoundException: Could not find artifact
org.apache.accumulo.thrift:libthrift:jar:0.3 in legacy-releases (http://accumulo.apache.org/mvn_repo)
	at org.sonatype.aether.connector.wagon.WagonRepositoryConnector$4.wrap(WagonRepositoryConnector.java:945)
	at org.sonatype.aether.connector.wagon.WagonRepositoryConnector$4.wrap(WagonRepositoryConnector.java:940)
	at org.sonatype.aether.connector.wagon.WagonRepositoryConnector$GetTask.flush(WagonRepositoryConnector.java:695)
	at org.sonatype.aether.connector.wagon.WagonRepositoryConnector$GetTask.flush(WagonRepositoryConnector.java:689)
	at org.sonatype.aether.connector.wagon.WagonRepositoryConnector.get(WagonRepositoryConnector.java:445)
	at org.sonatype.aether.impl.internal.DefaultArtifactResolver.resolve(DefaultArtifactResolver.java:460)
	... 34 more
Sending e-mails to: accumulo-dev@incubator.apache.org
channel stopped
Skipping Cobertura coverage report as build was not UNSTABLE or better ...

Mime
View raw message