accumulo-dev mailing list archives

Site index · List index
Message view « Date » · « Thread »
Top « Date » · « Thread »
From Apache Jenkins Server <jenk...@builds.apache.org>
Subject Build failed in Jenkins: Accumulo-Trunk #264
Date Tue, 13 Mar 2012 21:25:58 GMT
See <https://builds.apache.org/job/Accumulo-Trunk/264/changes>

Changes:

[bimargulies] ACCUMULO-464: fix start pom, remove empty src dir.

------------------------------------------
[...truncated 3344 lines...]

[INFO] Instrumentation was successful.
[INFO] NOT adding cobertura ser file to attached artifacts list.
[debug] execute contextualize
[INFO] [INFO] Using 'UTF-8' encoding to copy filtered resources.
[INFO] Copying 1 resource
[INFO] Copying 3 resources
[INFO] Copying 3 resources

[INFO] --- maven-resources-plugin:2.5:testResources (default-testResources) @ wikisearch-query
---
[INFO] [INFO] Nothing to compile - all classes are up to date

[INFO] --- maven-compiler-plugin:2.3.2:testCompile (default-testCompile) @ wikisearch-query
---
[INFO] [INFO] Surefire report directory: <https://builds.apache.org/job/Accumulo-Trunk/ws/accumulo-trunk/examples/wikisearch/query/target/surefire-reports>

-------------------------------------------------------
 T E S T S
-------------------------------------------------------

[INFO] --- maven-surefire-plugin:2.9:test (default-test) @ wikisearch-query ---
Running org.apache.accumulo.examples.wikisearch.logic.TestQueryLogic
Tests run: 1, Failures: 0, Errors: 0, Skipped: 0, Time elapsed: 0.888 sec
Flushing results...
Flushing results done
Cobertura: Loaded information on 60 classes.
Cobertura: Saved information on 60 classes.

Results :

Tests run: 1, Failures: 0, Errors: 0, Skipped: 0

[JENKINS] Recording test results
[JENKINS] Archiving <https://builds.apache.org/job/Accumulo-Trunk/ws/accumulo-trunk/examples/wikisearch/query/pom.xml>
to /home/hudson/hudson/jobs/Accumulo-Trunk/modules/org.apache.accumulo$wikisearch-query/builds/2012-03-13_21-05-25/archive/org.apache.accumulo/wikisearch-query/1.5.0-incubating-SNAPSHOT/wikisearch-query-1.5.0-incubating-SNAPSHOT.pom
[JENKINS] cobertura-maven-plugin already configured with xml reports enabled
[INFO] 
[INFO] --- cobertura-maven-plugin:2.5.1:cobertura (default-cli) @ wikisearch-query ---
[INFO] Cobertura 1.9.4.1 - GNU GPL License (NO WARRANTY) - See COPYRIGHT file
Cobertura: Loaded information on 60 classes.
Report time: 2543ms

[INFO] Cobertura Report generation was successful.
[JENKINS] Recording coverage results
[JENKINS] Archiving <https://builds.apache.org/job/Accumulo-Trunk/ws/accumulo-trunk/examples/wikisearch/query/target/wikisearch-query-1.5.0-incubating-SNAPSHOT.jar>
to /home/hudson/hudson/jobs/Accumulo-Trunk/modules/org.apache.accumulo$wikisearch-query/builds/2012-03-13_21-05-25/archive/org.apache.accumulo/wikisearch-query/1.5.0-incubating-SNAPSHOT/wikisearch-query-1.5.0-incubating-SNAPSHOT.jar
[INFO]                                                                         
[INFO] ------------------------------------------------------------------------
[INFO] Building wikisearch-query-war 1.5.0-incubating-SNAPSHOT
[INFO] ------------------------------------------------------------------------
Downloading: http://repo1.maven.org/maven2/org/eclipse/m2e/lifecycle-mapping/1.0.0/lifecycle-mapping-1.0.0.pom
[WARNING] The POM for org.eclipse.m2e:lifecycle-mapping:jar:1.0.0 is missing, no dependency
information available
[WARNING] Failed to retrieve plugin descriptor for org.eclipse.m2e:lifecycle-mapping:1.0.0:
Plugin org.eclipse.m2e:lifecycle-mapping:1.0.0 or one of its dependencies could not be resolved:
Failed to read artifact descriptor for org.eclipse.m2e:lifecycle-mapping:jar:1.0.0
[INFO] 
[INFO] --- maven-clean-plugin:2.4.1:clean (default-clean) @ wikisearch-query-war ---
[INFO] 
[INFO] --- maven-enforcer-plugin:1.0.1:enforce (enforce-mvn) @ wikisearch-query-war ---
[INFO] 
[INFO] --- maven-remote-resources-plugin:1.2.1:process (default) @ wikisearch-query-war ---
[debug] execute contextualize
[INFO] [INFO] Using 'UTF-8' encoding to copy filtered resources.
[INFO] skip non existing resourceDirectory <https://builds.apache.org/job/Accumulo-Trunk/ws/accumulo-trunk/examples/wikisearch/query-war/src/main/resources>
[INFO] Copying 3 resources

[INFO] --- maven-resources-plugin:2.5:resources (default-resources) @ wikisearch-query-war
---
[INFO] No sources to compile
[INFO] 
[INFO] --- maven-compiler-plugin:2.3.2:compile (default-compile) @ wikisearch-query-war ---
[debug] execute contextualize
[INFO] [INFO] Using 'UTF-8' encoding to copy filtered resources.
[INFO] Copying 1 resource
[INFO] Copying 3 resources

[INFO] --- maven-resources-plugin:2.5:testResources (default-testResources) @ wikisearch-query-war
---
[INFO] No sources to compile
[INFO] 
[INFO] --- maven-compiler-plugin:2.3.2:testCompile (default-testCompile) @ wikisearch-query-war
---
[INFO] [INFO] Surefire report directory: <https://builds.apache.org/job/Accumulo-Trunk/ws/accumulo-trunk/examples/wikisearch/query-war/target/surefire-reports>

-------------------------------------------------------
 T E S T S
-------------------------------------------------------

[INFO] --- maven-surefire-plugin:2.9:test (default-test) @ wikisearch-query-war ---

Results :

Tests run: 0, Failures: 0, Errors: 0, Skipped: 0

[JENKINS] Recording test results
[INFO] 
[INFO] --- maven-war-plugin:2.1.1:war (default-war) @ wikisearch-query-war ---
[INFO] Packaging webapp
[INFO] Assembling webapp [wikisearch-query-war] in [<https://builds.apache.org/job/Accumulo-Trunk/ws/accumulo-trunk/examples/wikisearch/query-war/target/wikisearch-query-war-1.5.0-incubating-SNAPSHOT]>
[INFO] Processing war project
[INFO] Copying webapp resources [<https://builds.apache.org/job/Accumulo-Trunk/ws/accumulo-trunk/examples/wikisearch/query-war/src/main/webapp]>
[INFO] Webapp assembled in [74 msecs]
[INFO] Building war: <https://builds.apache.org/job/Accumulo-Trunk/ws/accumulo-trunk/examples/wikisearch/query-war/target/wikisearch-query-war-1.5.0-incubating-SNAPSHOT.war>
[INFO] WEB-INF/web.xml already added, skipping
[INFO] 
[INFO] --- maven-site-plugin:3.0:attach-descriptor (attach-descriptor) @ wikisearch-query-war
---
[JENKINS] Configuring cobertura-maven-plugin to enable xml reports
[INFO] 
[INFO] --- maven-enforcer-plugin:1.0.1:enforce (enforce-mvn) @ wikisearch-query-war ---
[INFO] 
[INFO] --- maven-remote-resources-plugin:1.2.1:process (default) @ wikisearch-query-war ---
[INFO] [debug] execute contextualize
[INFO] Using 'UTF-8' encoding to copy filtered resources.
[INFO] skip non existing resourceDirectory <https://builds.apache.org/job/Accumulo-Trunk/ws/accumulo-trunk/examples/wikisearch/query-war/src/main/resources>
[INFO] Copying 3 resources
[INFO] Copying 3 resources

[INFO] --- maven-resources-plugin:2.5:resources (default-resources) @ wikisearch-query-war
---
[INFO] [INFO] No sources to compile

[INFO] --- maven-compiler-plugin:2.3.2:compile (default-compile) @ wikisearch-query-war ---
[INFO] [WARNING] No files to instrument.
[INFO] NOT adding cobertura ser file to attached artifacts list.

[INFO] --- cobertura-maven-plugin:2.5.1:instrument (default-cli) @ wikisearch-query-war ---
[debug] execute contextualize
[INFO] [INFO] Using 'UTF-8' encoding to copy filtered resources.
[INFO] Copying 1 resource
[INFO] Copying 3 resources
[INFO] Copying 3 resources

[INFO] --- maven-resources-plugin:2.5:testResources (default-testResources) @ wikisearch-query-war
---
[INFO] [INFO] No sources to compile

[INFO] --- maven-compiler-plugin:2.3.2:testCompile (default-testCompile) @ wikisearch-query-war
---
[INFO] [INFO] Surefire report directory: <https://builds.apache.org/job/Accumulo-Trunk/ws/accumulo-trunk/examples/wikisearch/query-war/target/surefire-reports>

-------------------------------------------------------
 T E S T S
-------------------------------------------------------

[INFO] --- maven-surefire-plugin:2.9:test (default-test) @ wikisearch-query-war ---

Results :

Tests run: 0, Failures: 0, Errors: 0, Skipped: 0

[JENKINS] Recording test results
[JENKINS] Archiving <https://builds.apache.org/job/Accumulo-Trunk/ws/accumulo-trunk/examples/wikisearch/query-war/pom.xml>
to /home/hudson/hudson/jobs/Accumulo-Trunk/modules/org.apache.accumulo$wikisearch-query-war/builds/2012-03-13_21-05-25/archive/org.apache.accumulo/wikisearch-query-war/1.5.0-incubating-SNAPSHOT/wikisearch-query-war-1.5.0-incubating-SNAPSHOT.pom
[JENKINS] cobertura-maven-plugin already configured with xml reports enabled
[INFO] 
[INFO] --- cobertura-maven-plugin:2.5.1:cobertura (default-cli) @ wikisearch-query-war ---
[JENKINS] Archiving <https://builds.apache.org/job/Accumulo-Trunk/ws/accumulo-trunk/examples/wikisearch/query-war/target/wikisearch-query-war-1.5.0-incubating-SNAPSHOT.war>
to /home/hudson/hudson/jobs/Accumulo-Trunk/modules/org.apache.accumulo$wikisearch-query-war/builds/2012-03-13_21-05-25/archive/org.apache.accumulo/wikisearch-query-war/1.5.0-incubating-SNAPSHOT/wikisearch-query-war-1.5.0-incubating-SNAPSHOT.war
[INFO] Downloading: http://repo1.maven.org/maven2/org/eclipse/m2e/lifecycle-mapping/1.0.0/lifecycle-mapping-1.0.0.pom
                                                                        
[INFO] ------------------------------------------------------------------------
[INFO] Building accumulo-assemble 1.5.0-incubating-SNAPSHOT
[INFO] ------------------------------------------------------------------------
[WARNING] The POM for org.eclipse.m2e:lifecycle-mapping:jar:1.0.0 is missing, no dependency
information available
[WARNING] Failed to retrieve plugin descriptor for org.eclipse.m2e:lifecycle-mapping:1.0.0:
Plugin org.eclipse.m2e:lifecycle-mapping:1.0.0 or one of its dependencies could not be resolved:
Failed to read artifact descriptor for org.eclipse.m2e:lifecycle-mapping:jar:1.0.0
[INFO] [INFO] Deleting <https://builds.apache.org/job/Accumulo-Trunk/ws/accumulo-trunk/assemble>
(includes = [**/*.pyc], excludes = [])

[INFO] --- maven-clean-plugin:2.4.1:clean (default-clean) @ accumulo-assemble ---
[INFO] 
[INFO] --- maven-enforcer-plugin:1.0.1:enforce (enforce-mvn) @ accumulo-assemble ---
[INFO] 
[INFO] --- maven-remote-resources-plugin:1.2.1:process (default) @ accumulo-assemble ---
[INFO] 
[INFO] --- maven-dependency-plugin:2.3:copy-dependencies (copy-dependencies) @ accumulo-assemble
---
[INFO] Missing pdflatex command. Please install.

[INFO] --- exec-maven-plugin:1.2:exec (user-manual) @ accumulo-assemble ---
[INFO] 
[INFO] --- maven-site-plugin:3.0:attach-descriptor (attach-descriptor) @ accumulo-assemble
---
[INFO] Exception in thread "main" java.lang.NoClassDefFoundError: org/apache/log4j/Logger
	at org.apache.accumulo.core.conf.AccumuloConfiguration.<clinit>(AccumuloConfiguration.java:29)
Caused by: java.lang.ClassNotFoundException: org.apache.log4j.Logger
	at java.net.URLClassLoader$1.run(URLClassLoader.java:202)
	at java.security.AccessController.doPrivileged(Native Method)
	at java.net.URLClassLoader.findClass(URLClassLoader.java:190)
	at java.lang.ClassLoader.loadClass(ClassLoader.java:306)
	at sun.misc.Launcher$AppClassLoader.loadClass(Launcher.java:301)
	at java.lang.ClassLoader.loadClass(ClassLoader.java:247)
	... 1 more
Could not find the main class: org.apache.accumulo.core.conf.DefaultConfiguration.  Program
will exit.

[INFO] --- exec-maven-plugin:1.2:exec (config webpage) @ accumulo-assemble ---
[JENKINS] Archiving <https://builds.apache.org/job/Accumulo-Trunk/ws/accumulo-trunk/assemble/pom.xml>
to /home/hudson/hudson/jobs/Accumulo-Trunk/modules/org.apache.accumulo$accumulo-assemble/builds/2012-03-13_21-05-25/archive/org.apache.accumulo/accumulo-assemble/1.5.0-incubating-SNAPSHOT/accumulo-assemble-1.5.0-incubating-SNAPSHOT.pom
[INFO] ------------------------------------------------------------------------
[INFO] Reactor Summary:
[INFO] 
[INFO] accumulo .......................................... SUCCESS [49.633s]
[INFO] cloudtrace ........................................ SUCCESS [37.078s]
[INFO] accumulo-start .................................... SUCCESS [47.000s]
[INFO] accumulo-core ..................................... SUCCESS [8:26.631s]
[INFO] accumulo-server ................................... SUCCESS [4:09.471s]
[INFO] accumulo-examples ................................. SUCCESS [3.154s]
[INFO] examples-simple ................................... SUCCESS [2:21.707s]
[INFO] accumulo-wikisearch ............................... SUCCESS [2.637s]
[INFO] wikisearch-ingest ................................. SUCCESS [29.738s]
[INFO] wikisearch-query .................................. SUCCESS [1:00.657s]
[INFO] wikisearch-query-war .............................. SUCCESS [5.926s]
[INFO] accumulo-assemble ................................. FAILURE [1.742s]
[INFO] ------------------------------------------------------------------------
[INFO] BUILD FAILURE
[INFO] ------------------------------------------------------------------------
[INFO] Total time: 20:14.309s
[INFO] Finished at: Tue Mar 13 21:25:55 UTC 2012
[INFO] Final Memory: 93M/197M
[INFO] ------------------------------------------------------------------------
mavenExecutionResult exceptions not empty
message : Failed to execute goal org.codehaus.mojo:exec-maven-plugin:1.2:exec (config webpage)
on project accumulo-assemble: Command execution failed.
cause : Command execution failed.
Stack trace : 
org.apache.maven.lifecycle.LifecycleExecutionException: Failed to execute goal org.codehaus.mojo:exec-maven-plugin:1.2:exec
(config webpage) on project accumulo-assemble: Command execution failed.
	at org.apache.maven.lifecycle.internal.MojoExecutor.execute(MojoExecutor.java:217)
	at org.apache.maven.lifecycle.internal.MojoExecutor.execute(MojoExecutor.java:153)
	at org.apache.maven.lifecycle.internal.MojoExecutor.execute(MojoExecutor.java:145)
	at org.apache.maven.lifecycle.internal.LifecycleModuleBuilder.buildProject(LifecycleModuleBuilder.java:84)
	at org.apache.maven.lifecycle.internal.LifecycleModuleBuilder.buildProject(LifecycleModuleBuilder.java:59)
	at org.apache.maven.lifecycle.internal.LifecycleStarter.singleThreadedBuild(LifecycleStarter.java:183)
	at org.apache.maven.lifecycle.internal.LifecycleStarter.execute(LifecycleStarter.java:161)
	at org.apache.maven.DefaultMaven.doExecute(DefaultMaven.java:319)
	at org.apache.maven.DefaultMaven.execute(DefaultMaven.java:156)
	at org.jvnet.hudson.maven3.launcher.Maven3Launcher.main(Maven3Launcher.java:79)
	at sun.reflect.NativeMethodAccessorImpl.invoke0(Native Method)
	at sun.reflect.NativeMethodAccessorImpl.invoke(NativeMethodAccessorImpl.java:39)
	at sun.reflect.DelegatingMethodAccessorImpl.invoke(DelegatingMethodAccessorImpl.java:25)
	at java.lang.reflect.Method.invoke(Method.java:597)
	at org.codehaus.plexus.classworlds.launcher.Launcher.launchStandard(Launcher.java:329)
	at org.codehaus.plexus.classworlds.launcher.Launcher.launch(Launcher.java:239)
	at org.jvnet.hudson.maven3.agent.Maven3Main.launch(Maven3Main.java:158)
	at hudson.maven.Maven3Builder.call(Maven3Builder.java:104)
	at hudson.maven.Maven3Builder.call(Maven3Builder.java:70)
	at hudson.remoting.UserRequest.perform(UserRequest.java:118)
	at hudson.remoting.UserRequest.perform(UserRequest.java:48)
	at hudson.remoting.Request$2.run(Request.java:287)
	at hudson.remoting.InterceptingExecutorService$1.call(InterceptingExecutorService.java:72)
	at java.util.concurrent.FutureTask$Sync.innerRun(FutureTask.java:303)
	at java.util.concurrent.FutureTask.run(FutureTask.java:138)
	at java.util.concurrent.ThreadPoolExecutor$Worker.runTask(ThreadPoolExecutor.java:886)
	at java.util.concurrent.ThreadPoolExecutor$Worker.run(ThreadPoolExecutor.java:908)
	at java.lang.Thread.run(Thread.java:662)
Caused by: org.apache.maven.plugin.MojoExecutionException: Command execution failed.
	at org.codehaus.mojo.exec.ExecMojo.execute(ExecMojo.java:345)
	at org.apache.maven.plugin.DefaultBuildPluginManager.executeMojo(DefaultBuildPluginManager.java:101)
	at org.apache.maven.lifecycle.internal.MojoExecutor.execute(MojoExecutor.java:209)
	... 27 more
Caused by: org.apache.commons.exec.ExecuteException: Process exited with an error: 1(Exit
value: 1)
	at org.apache.commons.exec.DefaultExecutor.executeInternal(DefaultExecutor.java:346)
	at org.apache.commons.exec.DefaultExecutor.execute(DefaultExecutor.java:149)
	at org.codehaus.mojo.exec.ExecMojo.executeCommandLine(ExecMojo.java:589)
	at org.codehaus.mojo.exec.ExecMojo.execute(ExecMojo.java:335)
	... 29 more
Sending e-mails to: accumulo-dev@incubator.apache.org
channel stopped
Skipping Cobertura coverage report as build was not UNSTABLE or better ...


Mime
View raw message