abdera-dev mailing list archives

Site index · List index
Message view « Date » · « Thread »
Top « Date » · « Thread »
From Apache Jenkins Server <jenk...@builds.apache.org>
Subject Build failed in Jenkins: Abdera2-trunk #1382
Date Sat, 15 Aug 2015 09:48:20 GMT
See <https://builds.apache.org/job/Abdera2-trunk/1382/>

------------------------------------------
[...truncated 593 lines...]
Tests run: 3, Failures: 0, Errors: 0, Skipped: 0, Time elapsed: 0.145 sec
Running org.apache.abdera2.test.parser.axiom.ConcurrencyTest
Tests run: 1, Failures: 0, Errors: 0, Skipped: 0, Time elapsed: 0.101 sec
Running org.apache.abdera2.test.common.lang.LangTest
Tests run: 1, Failures: 0, Errors: 0, Skipped: 0, Time elapsed: 0.003 sec
Running org.apache.abdera2.test.common.templates.TemplateTest
Tests run: 4, Failures: 0, Errors: 0, Skipped: 0, Time elapsed: 0.018 sec
Running org.apache.abdera2.test.parser.axiom.EntryLinkTest
Tests run: 1, Failures: 0, Errors: 0, Skipped: 0, Time elapsed: 0.003 sec
Running org.apache.abdera2.test.parser.axiom.ParserTest
Tests run: 3, Failures: 0, Errors: 0, Skipped: 0, Time elapsed: 0.004 sec
Running org.apache.abdera2.test.common.text.CodecTest
Tests run: 1, Failures: 0, Errors: 0, Skipped: 0, Time elapsed: 0.003 sec

Results :

Tests run: 482, Failures: 0, Errors: 0, Skipped: 0

[JENKINS] Recording test results
log4j:WARN No appenders could be found for logger (org.apache.commons.beanutils.converters.BooleanConverter).
log4j:WARN Please initialize the log4j system properly.
[INFO] 
[INFO] --- maven-bundle-plugin:2.1.0:bundle (default-bundle) @ abdera2-test ---
[WARNING] Warning building bundle org.apache.abdera2:abdera2-test:bundle:2.0-SNAPSHOT : Did
not find matching referal for org.apache.abdera2.*
[INFO] 
[INFO] --- maven-bundle-plugin:2.1.0:cleanVersions (default) @ abdera2-test ---
[WARNING] Failed to getClass for org.apache.maven.plugin.source.SourceJarMojo
[INFO] 
[INFO] --- maven-source-plugin:2.1.2:jar (attach-sources) @ abdera2-test ---
[INFO] META-INF already added, skipping
[INFO] META-INF/LICENSE already added, skipping
[INFO] META-INF/NOTICE already added, skipping
[INFO] Building jar: <https://builds.apache.org/job/Abdera2-trunk/ws/abdera2/test/target/abdera2-test-2.0-SNAPSHOT-sources.jar>
[INFO] META-INF already added, skipping
[INFO] META-INF/LICENSE already added, skipping
[INFO] META-INF/NOTICE already added, skipping
[INFO] 
[INFO] --- maven-install-plugin:2.5.2:install (default-install) @ abdera2-test ---
[INFO] Installing <https://builds.apache.org/job/Abdera2-trunk/ws/abdera2/test/target/abdera2-test-2.0-SNAPSHOT.jar>
to /home/jenkins/jenkins-slave/maven-repositories/0/org/apache/abdera2/abdera2-test/2.0-SNAPSHOT/abdera2-test-2.0-SNAPSHOT.jar
[INFO] Installing <https://builds.apache.org/job/Abdera2-trunk/ws/abdera2/test/pom.xml>
to /home/jenkins/jenkins-slave/maven-repositories/0/org/apache/abdera2/abdera2-test/2.0-SNAPSHOT/abdera2-test-2.0-SNAPSHOT.pom
[INFO] Installing <https://builds.apache.org/job/Abdera2-trunk/ws/abdera2/test/target/abdera2-test-2.0-SNAPSHOT-sources.jar>
to /home/jenkins/jenkins-slave/maven-repositories/0/org/apache/abdera2/abdera2-test/2.0-SNAPSHOT/abdera2-test-2.0-SNAPSHOT-sources.jar
[INFO] 
[INFO] --- maven-bundle-plugin:2.1.0:install (default-install) @ abdera2-test ---
[INFO] Installing org/apache/abdera2/abdera2-test/2.0-SNAPSHOT/abdera2-test-2.0-SNAPSHOT.jar
[INFO] Writing OBR metadata
[INFO]                                                                         
[INFO] ------------------------------------------------------------------------
[INFO] Building Abdera2 Examples 2.0-SNAPSHOT
[INFO] ------------------------------------------------------------------------
[INFO] 
[INFO] --- maven-clean-plugin:2.4.1:clean (default-clean) @ abdera2-examples ---
[INFO] Deleting <https://builds.apache.org/job/Abdera2-trunk/ws/abdera2/examples/target>
[INFO] 
[INFO] --- cobertura-maven-plugin:2.4:clean (default) @ abdera2-examples ---
[INFO] 
[INFO] --- maven-bundle-plugin:2.1.0:cleanVersions (default) @ abdera2-examples ---
[INFO] 
[INFO] --- maven-remote-resources-plugin:1.0:process (compile) @ abdera2-examples ---
[INFO] 
[INFO] --- maven-resources-plugin:2.5:resources (default-resources) @ abdera2-examples ---
[debug] execute contextualize
[INFO] Using 'UTF-8' encoding to copy filtered resources.
[INFO] Copying 10 resources
[INFO] Copying 2 resources
[INFO] 
[INFO] --- maven-compiler-plugin:2.3.2:compile (default-compile) @ abdera2-examples ---
[INFO] Compiling 45 source files to <https://builds.apache.org/job/Abdera2-trunk/ws/abdera2/examples/target/classes>
[INFO] 
[INFO] --- maven-resources-plugin:2.5:testResources (default-testResources) @ abdera2-examples
---
[debug] execute contextualize
[INFO] Using 'UTF-8' encoding to copy filtered resources.
[INFO] skip non existing resourceDirectory <https://builds.apache.org/job/Abdera2-trunk/ws/abdera2/examples/src/test/resources>
[INFO] Copying 2 resources
[INFO] 
[INFO] --- maven-compiler-plugin:2.3.2:testCompile (default-testCompile) @ abdera2-examples
---
[INFO] No sources to compile
[INFO] 
[INFO] --- maven-surefire-plugin:2.6:test (default-test) @ abdera2-examples ---
[INFO] Surefire report directory: <https://builds.apache.org/job/Abdera2-trunk/ws/abdera2/examples/target/surefire-reports>

-------------------------------------------------------
 T E S T S
-------------------------------------------------------
There are no tests to run.

Results :

Tests run: 0, Failures: 0, Errors: 0, Skipped: 0

[JENKINS] Recording test results
[INFO] 
[INFO] --- maven-jar-plugin:2.2:jar (default-jar) @ abdera2-examples ---
[INFO] Building jar: <https://builds.apache.org/job/Abdera2-trunk/ws/abdera2/examples/target/abdera2-examples-2.0-SNAPSHOT.jar>
[INFO] 
[INFO] --- maven-bundle-plugin:2.1.0:cleanVersions (default) @ abdera2-examples ---
[WARNING] Failed to getClass for org.apache.maven.plugin.source.SourceJarMojo
[INFO] 
[INFO] --- maven-source-plugin:2.1.2:jar (attach-sources) @ abdera2-examples ---
[INFO] META-INF already added, skipping
[INFO] org already added, skipping
[INFO] org/apache already added, skipping
[INFO] META-INF already added, skipping
[INFO] META-INF/LICENSE already added, skipping
[INFO] META-INF/NOTICE already added, skipping
[INFO] Building jar: <https://builds.apache.org/job/Abdera2-trunk/ws/abdera2/examples/target/abdera2-examples-2.0-SNAPSHOT-sources.jar>
[INFO] META-INF already added, skipping
[INFO] org already added, skipping
[INFO] org/apache already added, skipping
[INFO] META-INF already added, skipping
[INFO] META-INF/LICENSE already added, skipping
[INFO] META-INF/NOTICE already added, skipping
[INFO] 
[INFO] --- maven-install-plugin:2.3.1:install (default-install) @ abdera2-examples ---
[INFO] Installing <https://builds.apache.org/job/Abdera2-trunk/ws/abdera2/examples/target/abdera2-examples-2.0-SNAPSHOT.jar>
to /home/jenkins/jenkins-slave/maven-repositories/0/org/apache/abdera2/abdera2-examples/2.0-SNAPSHOT/abdera2-examples-2.0-SNAPSHOT.jar
[INFO] Installing <https://builds.apache.org/job/Abdera2-trunk/ws/abdera2/examples/pom.xml>
to /home/jenkins/jenkins-slave/maven-repositories/0/org/apache/abdera2/abdera2-examples/2.0-SNAPSHOT/abdera2-examples-2.0-SNAPSHOT.pom
[INFO] Installing <https://builds.apache.org/job/Abdera2-trunk/ws/abdera2/examples/target/abdera2-examples-2.0-SNAPSHOT-sources.jar>
to /home/jenkins/jenkins-slave/maven-repositories/0/org/apache/abdera2/abdera2-examples/2.0-SNAPSHOT/abdera2-examples-2.0-SNAPSHOT-sources.jar
[INFO] ------------------------------------------------------------------------
[INFO] Reactor Summary:
[INFO] 
[INFO] Apache Abdera2 .................................... SUCCESS [3.319s]
[INFO] Abdera2 Common Library ............................ SUCCESS [13.275s]
[INFO] Abdera2 Core ...................................... SUCCESS [9.507s]
[INFO] Abdera2 Activities ................................ SUCCESS [7.966s]
[INFO] Abdera2 Extensions ................................ SUCCESS [7.477s]
[INFO] Abdera2 Security .................................. SUCCESS [5.299s]
[INFO] Abdera2 Tests ..................................... SUCCESS [1:05.937s]
[INFO] Abdera2 Examples .................................. SUCCESS [3.715s]
[INFO] ------------------------------------------------------------------------
[INFO] BUILD SUCCESS
[INFO] ------------------------------------------------------------------------
[INFO] Total time: 2:02.889s
[INFO] Finished at: Sat Aug 15 09:48:06 UTC 2015
[INFO] Final Memory: 80M/728M
[INFO] ------------------------------------------------------------------------
Waiting for Jenkins to finish collecting data
[JENKINS] Archiving <https://builds.apache.org/job/Abdera2-trunk/ws/abdera2/core/pom.xml>
to org.apache.abdera2/abdera2-core/2.0-SNAPSHOT/abdera2-core-2.0-SNAPSHOT.pom
[JENKINS] Archiving <https://builds.apache.org/job/Abdera2-trunk/ws/abdera2/core/target/abdera2-core-2.0-SNAPSHOT.jar>
to org.apache.abdera2/abdera2-core/2.0-SNAPSHOT/abdera2-core-2.0-SNAPSHOT.jar
[JENKINS] Archiving <https://builds.apache.org/job/Abdera2-trunk/ws/abdera2/core/target/abdera2-core-2.0-SNAPSHOT-sources.jar>
to org.apache.abdera2/abdera2-core/2.0-SNAPSHOT/abdera2-core-2.0-SNAPSHOT-sources.jar
Sending artifact delta relative to Abdera2-trunk » Abdera2 Core #1381
Archived 3 artifacts
Archive block size is 32768
Received 5 blocks and 428977 bytes
Compression is 27.6%
Took 0.23 sec
[JENKINS] Archiving <https://builds.apache.org/job/Abdera2-trunk/ws/abdera2/test/pom.xml>
to org.apache.abdera2/abdera2-test/2.0-SNAPSHOT/abdera2-test-2.0-SNAPSHOT.pom
[JENKINS] Archiving <https://builds.apache.org/job/Abdera2-trunk/ws/abdera2/test/target/abdera2-test-2.0-SNAPSHOT.jar>
to org.apache.abdera2/abdera2-test/2.0-SNAPSHOT/abdera2-test-2.0-SNAPSHOT.jar
[JENKINS] Archiving <https://builds.apache.org/job/Abdera2-trunk/ws/abdera2/test/target/abdera2-test-2.0-SNAPSHOT-sources.jar>
to org.apache.abdera2/abdera2-test/2.0-SNAPSHOT/abdera2-test-2.0-SNAPSHOT-sources.jar
Sending artifact delta relative to Abdera2-trunk » Abdera2 Tests #1381
Archived 3 artifacts
Archive block size is 32768
Received 2 blocks and 1816570 bytes
Compression is 3.5%
Took 0.55 sec
[JENKINS] Archiving <https://builds.apache.org/job/Abdera2-trunk/ws/abdera2/security/pom.xml>
to org.apache.abdera2/abdera2-security/2.0-SNAPSHOT/abdera2-security-2.0-SNAPSHOT.pom
[JENKINS] Archiving <https://builds.apache.org/job/Abdera2-trunk/ws/abdera2/security/target/abdera2-security-2.0-SNAPSHOT.jar>
to org.apache.abdera2/abdera2-security/2.0-SNAPSHOT/abdera2-security-2.0-SNAPSHOT.jar
[JENKINS] Archiving <https://builds.apache.org/job/Abdera2-trunk/ws/abdera2/security/target/abdera2-security-2.0-SNAPSHOT-sources.jar>
to org.apache.abdera2/abdera2-security/2.0-SNAPSHOT/abdera2-security-2.0-SNAPSHOT-sources.jar
Sending artifact delta relative to Abdera2-trunk » Abdera2 Security #1381
Archived 3 artifacts
Archive block size is 32768
Received 0 blocks and 66259 bytes
Compression is 0.0%
Took 82 ms
[JENKINS] Archiving <https://builds.apache.org/job/Abdera2-trunk/ws/abdera2/examples/pom.xml>
to org.apache.abdera2/abdera2-examples/2.0-SNAPSHOT/abdera2-examples-2.0-SNAPSHOT.pom
[JENKINS] Archiving <https://builds.apache.org/job/Abdera2-trunk/ws/abdera2/examples/target/abdera2-examples-2.0-SNAPSHOT.jar>
to org.apache.abdera2/abdera2-examples/2.0-SNAPSHOT/abdera2-examples-2.0-SNAPSHOT.jar
[JENKINS] Archiving <https://builds.apache.org/job/Abdera2-trunk/ws/abdera2/examples/target/abdera2-examples-2.0-SNAPSHOT-sources.jar>
to org.apache.abdera2/abdera2-examples/2.0-SNAPSHOT/abdera2-examples-2.0-SNAPSHOT-sources.jar
Sending artifact delta relative to Abdera2-trunk » Abdera2 Examples #1381
Archived 3 artifacts
Archive block size is 32768
Received 0 blocks and 162775 bytes
Compression is 0.0%
Took 0.11 sec
[JENKINS] Archiving <https://builds.apache.org/job/Abdera2-trunk/ws/abdera2/pom.xml>
to org.apache.abdera2/abdera2/2.0-SNAPSHOT/abdera2-2.0-SNAPSHOT.pom
Sending artifact delta relative to Abdera2-trunk » Apache Abdera2 #1381
Archived 1 artifacts
Archive block size is 32768
Received 0 blocks and 18400 bytes
Compression is 0.0%
Took 75 ms
[JENKINS] Archiving <https://builds.apache.org/job/Abdera2-trunk/ws/abdera2/activities/pom.xml>
to org.apache.abdera2/abdera2-activities/2.0-SNAPSHOT/abdera2-activities-2.0-SNAPSHOT.pom
[JENKINS] Archiving <https://builds.apache.org/job/Abdera2-trunk/ws/abdera2/activities/target/abdera2-activities-2.0-SNAPSHOT.jar>
to org.apache.abdera2/abdera2-activities/2.0-SNAPSHOT/abdera2-activities-2.0-SNAPSHOT.jar
[JENKINS] Archiving <https://builds.apache.org/job/Abdera2-trunk/ws/abdera2/activities/target/abdera2-activities-2.0-SNAPSHOT-sources.jar>
to org.apache.abdera2/abdera2-activities/2.0-SNAPSHOT/abdera2-activities-2.0-SNAPSHOT-sources.jar
Sending artifact delta relative to Abdera2-trunk » Abdera2 Activities #1381
Archived 3 artifacts
Archive block size is 32768
Received 2 blocks and 417955 bytes
Compression is 13.6%
Took 0.18 sec
[JENKINS] Archiving <https://builds.apache.org/job/Abdera2-trunk/ws/abdera2/ext/pom.xml>
to org.apache.abdera2/abdera2-ext/2.0-SNAPSHOT/abdera2-ext-2.0-SNAPSHOT.pom
[JENKINS] Archiving <https://builds.apache.org/job/Abdera2-trunk/ws/abdera2/ext/target/abdera2-ext-2.0-SNAPSHOT.jar>
to org.apache.abdera2/abdera2-ext/2.0-SNAPSHOT/abdera2-ext-2.0-SNAPSHOT.jar
[JENKINS] Archiving <https://builds.apache.org/job/Abdera2-trunk/ws/abdera2/ext/target/abdera2-ext-2.0-SNAPSHOT-sources.jar>
to org.apache.abdera2/abdera2-ext/2.0-SNAPSHOT/abdera2-ext-2.0-SNAPSHOT-sources.jar
Sending artifact delta relative to Abdera2-trunk » Abdera2 Extensions #1381
Archived 3 artifacts
Archive block size is 32768
Received 4 blocks and 325279 bytes
Compression is 28.7%
Took 0.15 sec
[JENKINS] Archiving <https://builds.apache.org/job/Abdera2-trunk/ws/abdera2/common/pom.xml>
to org.apache.abdera2/abdera2-common/2.0-SNAPSHOT/abdera2-common-2.0-SNAPSHOT.pom
[JENKINS] Archiving <https://builds.apache.org/job/Abdera2-trunk/ws/abdera2/common/target/abdera2-common-2.0-SNAPSHOT.jar>
to org.apache.abdera2/abdera2-common/2.0-SNAPSHOT/abdera2-common-2.0-SNAPSHOT.jar
[JENKINS] Archiving <https://builds.apache.org/job/Abdera2-trunk/ws/abdera2/common/target/abdera2-common-2.0-SNAPSHOT-sources.jar>
to org.apache.abdera2/abdera2-common/2.0-SNAPSHOT/abdera2-common-2.0-SNAPSHOT-sources.jar
Sending artifact delta relative to Abdera2-trunk » Abdera2 Common Library #1381
Archived 3 artifacts
Archive block size is 32768
Received 6 blocks and 617918 bytes
Compression is 24.1%
Took 0.24 sec
channel stopped
Maven RedeployPublisher use remote H11 maven settings from : /home/jenkins/.m2/settings.xml
[ERROR] uniqueVersion == false is not anymore supported in maven 3
[INFO] Deployment in https://repository.apache.org/content/repositories/snapshots (id=apache.snapshots.https,uniqueVersion=false)
Deploying the main artifact abdera2-2.0-SNAPSHOT.pom
Downloading: https://repository.apache.org/content/repositories/snapshots/org/apache/abdera2/abdera2/2.0-SNAPSHOT/maven-metadata.xml
ERROR: Failed to retrieve remote metadata org.apache.abdera2:abdera2:2.0-SNAPSHOT/maven-metadata.xml:
Could not transfer metadata org.apache.abdera2:abdera2:2.0-SNAPSHOT/maven-metadata.xml from/to
apache.snapshots.https (https://repository.apache.org/content/repositories/snapshots): Failed
to transfer file: https://repository.apache.org/content/repositories/snapshots/org/apache/abdera2/abdera2/2.0-SNAPSHOT/maven-metadata.xml.
Return code is: 502 , ReasonPhrase:Proxy Error.
org.apache.maven.artifact.deployer.ArtifactDeploymentException: Failed to retrieve remote
metadata org.apache.abdera2:abdera2:2.0-SNAPSHOT/maven-metadata.xml: Could not transfer metadata
org.apache.abdera2:abdera2:2.0-SNAPSHOT/maven-metadata.xml from/to apache.snapshots.https
(https://repository.apache.org/content/repositories/snapshots): Failed to transfer file: https://repository.apache.org/content/repositories/snapshots/org/apache/abdera2/abdera2/2.0-SNAPSHOT/maven-metadata.xml.
Return code is: 502 , ReasonPhrase:Proxy Error.
	at org.apache.maven.artifact.deployer.DefaultArtifactDeployer.deploy(DefaultArtifactDeployer.java:143)
	at hudson.maven.reporters.MavenArtifactRecord.deploy(MavenArtifactRecord.java:193)
	at hudson.maven.RedeployPublisher.perform(RedeployPublisher.java:176)
	at hudson.tasks.BuildStepMonitor$1.perform(BuildStepMonitor.java:20)
	at hudson.model.AbstractBuild$AbstractBuildExecution.perform(AbstractBuild.java:756)
	at hudson.model.AbstractBuild$AbstractBuildExecution.performAllBuildSteps(AbstractBuild.java:720)
	at hudson.maven.MavenModuleSetBuild$MavenModuleSetBuildExecution.post2(MavenModuleSetBuild.java:1037)
	at hudson.model.AbstractBuild$AbstractBuildExecution.post(AbstractBuild.java:669)
	at hudson.model.Run.execute(Run.java:1731)
	at hudson.maven.MavenModuleSetBuild.run(MavenModuleSetBuild.java:529)
	at hudson.model.ResourceController.execute(ResourceController.java:88)
	at hudson.model.Executor.run(Executor.java:232)
Caused by: org.eclipse.aether.deployment.DeploymentException: Failed to retrieve remote metadata
org.apache.abdera2:abdera2:2.0-SNAPSHOT/maven-metadata.xml: Could not transfer metadata org.apache.abdera2:abdera2:2.0-SNAPSHOT/maven-metadata.xml
from/to apache.snapshots.https (https://repository.apache.org/content/repositories/snapshots):
Failed to transfer file: https://repository.apache.org/content/repositories/snapshots/org/apache/abdera2/abdera2/2.0-SNAPSHOT/maven-metadata.xml.
Return code is: 502 , ReasonPhrase:Proxy Error.
	at org.eclipse.aether.internal.impl.DefaultDeployer.upload(DefaultDeployer.java:470)
	at org.eclipse.aether.internal.impl.DefaultDeployer.deploy(DefaultDeployer.java:314)
	at org.eclipse.aether.internal.impl.DefaultDeployer.deploy(DefaultDeployer.java:269)
	at org.eclipse.aether.internal.impl.DefaultRepositorySystem.deploy(DefaultRepositorySystem.java:413)
	at org.apache.maven.artifact.deployer.DefaultArtifactDeployer.deploy(DefaultArtifactDeployer.java:139)
	... 11 more
Caused by: org.eclipse.aether.transfer.MetadataTransferException: Could not transfer metadata
org.apache.abdera2:abdera2:2.0-SNAPSHOT/maven-metadata.xml from/to apache.snapshots.https
(https://repository.apache.org/content/repositories/snapshots): Failed to transfer file: https://repository.apache.org/content/repositories/snapshots/org/apache/abdera2/abdera2/2.0-SNAPSHOT/maven-metadata.xml.
Return code is: 502 , ReasonPhrase:Proxy Error.
	at org.eclipse.aether.connector.wagon.WagonRepositoryConnector$5.wrap(WagonRepositoryConnector.java:995)
	at org.eclipse.aether.connector.wagon.WagonRepositoryConnector$5.wrap(WagonRepositoryConnector.java:983)
	at org.eclipse.aether.connector.wagon.WagonRepositoryConnector$GetTask.run(WagonRepositoryConnector.java:725)
	at org.eclipse.aether.util.concurrency.RunnableErrorForwarder$1.run(RunnableErrorForwarder.java:67)
	at java.util.concurrent.ThreadPoolExecutor.runWorker(ThreadPoolExecutor.java:1145)
	at java.util.concurrent.ThreadPoolExecutor$Worker.run(ThreadPoolExecutor.java:615)
	at java.lang.Thread.run(Thread.java:745)
Caused by: org.apache.maven.wagon.TransferFailedException: Failed to transfer file: https://repository.apache.org/content/repositories/snapshots/org/apache/abdera2/abdera2/2.0-SNAPSHOT/maven-metadata.xml.
Return code is: 502 , ReasonPhrase:Proxy Error.
	at org.apache.maven.wagon.shared.http4.AbstractHttpClientWagon.fillInputData(AbstractHttpClientWagon.java:945)
	at org.apache.maven.wagon.StreamWagon.getInputStream(StreamWagon.java:116)
	at org.apache.maven.wagon.StreamWagon.getIfNewer(StreamWagon.java:88)
	at org.apache.maven.wagon.StreamWagon.get(StreamWagon.java:61)
	at org.eclipse.aether.connector.wagon.WagonRepositoryConnector$GetTask.run(WagonRepositoryConnector.java:660)
	... 4 more
[INFO] Deployment failed after 1 min 0 sec
Build step 'Deploy artifacts to Maven repository' changed build result to FAILURE

Mime
View raw message