abdera-dev mailing list archives

Site index · List index
Message view « Date » · « Thread »
Top « Date » · « Thread »
From Apache Jenkins Server <jenk...@builds.apache.org>
Subject Build failed in Jenkins: Abdera-trunk » Abdera Parser #1959
Date Tue, 15 Jul 2014 07:12:56 GMT
See <https://builds.apache.org/job/Abdera-trunk/org.apache.abdera$abdera-parser/1959/>

------------------------------------------
[INFO]                                                                         
[INFO] ------------------------------------------------------------------------
[INFO] Building Abdera Parser 1.2-SNAPSHOT
[INFO] ------------------------------------------------------------------------
Downloading: http://repository.apache.org/snapshots/org/apache/ws/commons/axiom/axiom-api/1.2.15-SNAPSHOT/maven-metadata.xml
Downloaded: http://repository.apache.org/snapshots/org/apache/ws/commons/axiom/axiom-api/1.2.15-SNAPSHOT/maven-metadata.xml
(2 KB at 11.0 KB/sec)
Downloading: http://repository.apache.org/snapshots/org/apache/ws/commons/axiom/axiom-api/1.2.15-SNAPSHOT/axiom-api-1.2.15-20140715.065010-546.pom
Downloaded: http://repository.apache.org/snapshots/org/apache/ws/commons/axiom/axiom-api/1.2.15-SNAPSHOT/axiom-api-1.2.15-20140715.065010-546.pom
(16 KB at 134.2 KB/sec)
Downloading: http://repository.apache.org/snapshots/org/apache/ws/commons/axiom/axiom/1.2.15-SNAPSHOT/maven-metadata.xml
Downloaded: http://repository.apache.org/snapshots/org/apache/ws/commons/axiom/axiom/1.2.15-SNAPSHOT/maven-metadata.xml
(2 KB at 3.8 KB/sec)
Downloading: http://repository.apache.org/snapshots/org/apache/ws/commons/axiom/axiom/1.2.15-SNAPSHOT/axiom-1.2.15-20140715.064557-562.pom
Downloaded: http://repository.apache.org/snapshots/org/apache/ws/commons/axiom/axiom/1.2.15-SNAPSHOT/axiom-1.2.15-20140715.064557-562.pom
(41 KB at 268.6 KB/sec)
Downloading: http://repo.maven.apache.org/maven2/org/apache/apache/13/apache-13.pom
Downloaded: http://repo.maven.apache.org/maven2/org/apache/apache/13/apache-13.pom (14 KB
at 184.4 KB/sec)
Downloading: http://repo.maven.apache.org/maven2/jaxen/jaxen/1.1.1/jaxen-1.1.1.pom
Downloaded: http://repo.maven.apache.org/maven2/jaxen/jaxen/1.1.1/jaxen-1.1.1.pom (8 KB at
140.0 KB/sec)
Downloading: http://repo.maven.apache.org/maven2/org/apache/james/apache-mime4j-core/0.7.2/apache-mime4j-core-0.7.2.pom
Downloaded: http://repo.maven.apache.org/maven2/org/apache/james/apache-mime4j-core/0.7.2/apache-mime4j-core-0.7.2.pom
(3 KB at 46.1 KB/sec)
Downloading: http://repo.maven.apache.org/maven2/org/apache/james/apache-mime4j-project/0.7.2/apache-mime4j-project-0.7.2.pom
Downloaded: http://repo.maven.apache.org/maven2/org/apache/james/apache-mime4j-project/0.7.2/apache-mime4j-project-0.7.2.pom
(10 KB at 184.2 KB/sec)
Downloading: http://repo.maven.apache.org/maven2/org/apache/james/james-project/1.8/james-project-1.8.pom
Downloaded: http://repo.maven.apache.org/maven2/org/apache/james/james-project/1.8/james-project-1.8.pom
(53 KB at 542.0 KB/sec)
Downloading: http://repository.apache.org/snapshots/org/apache/ws/commons/axiom/axiom-impl/1.2.15-SNAPSHOT/maven-metadata.xml
Downloaded: http://repository.apache.org/snapshots/org/apache/ws/commons/axiom/axiom-impl/1.2.15-SNAPSHOT/maven-metadata.xml
(2 KB at 8.3 KB/sec)
Downloading: http://repository.apache.org/snapshots/org/apache/ws/commons/axiom/axiom-impl/1.2.15-SNAPSHOT/axiom-impl-1.2.15-20140715.065431-535.pom
Downloaded: http://repository.apache.org/snapshots/org/apache/ws/commons/axiom/axiom-impl/1.2.15-SNAPSHOT/axiom-impl-1.2.15-20140715.065431-535.pom
(8 KB at 52.0 KB/sec)
Downloading: http://repo.maven.apache.org/maven2/org/codehaus/woodstox/woodstox-core-asl/4.2.0/woodstox-core-asl-4.2.0.pom
Downloaded: http://repo.maven.apache.org/maven2/org/codehaus/woodstox/woodstox-core-asl/4.2.0/woodstox-core-asl-4.2.0.pom
(2 KB at 33.9 KB/sec)
Downloading: http://repo.maven.apache.org/maven2/org/codehaus/woodstox/stax2-api/3.1.1/stax2-api-3.1.1.pom
Downloaded: http://repo.maven.apache.org/maven2/org/codehaus/woodstox/stax2-api/3.1.1/stax2-api-3.1.1.pom
(2 KB at 26.6 KB/sec)
Downloading: http://repo.maven.apache.org/maven2/org/codehaus/woodstox/wstx-asl/3.2.6/wstx-asl-3.2.6.pom
Downloaded: http://repo.maven.apache.org/maven2/org/codehaus/woodstox/wstx-asl/3.2.6/wstx-asl-3.2.6.pom
(2 KB at 23.6 KB/sec)
Downloading: http://repository.apache.org/snapshots/org/apache/ws/commons/axiom/axiom-api/1.2.15-SNAPSHOT/axiom-api-1.2.15-20140715.065010-546.jar
Downloading: http://repository.apache.org/snapshots/org/apache/ws/commons/axiom/axiom-impl/1.2.15-SNAPSHOT/axiom-impl-1.2.15-20140715.065431-535.jar
Downloaded: http://repository.apache.org/snapshots/org/apache/ws/commons/axiom/axiom-api/1.2.15-SNAPSHOT/axiom-api-1.2.15-20140715.065010-546.jar
(401 KB at 900.4 KB/sec)
Downloaded: http://repository.apache.org/snapshots/org/apache/ws/commons/axiom/axiom-impl/1.2.15-SNAPSHOT/axiom-impl-1.2.15-20140715.065431-535.jar
(396 KB at 835.8 KB/sec)
Downloading: http://repo.maven.apache.org/maven2/org/apache/james/apache-mime4j-core/0.7.2/apache-mime4j-core-0.7.2.jar
Downloading: http://repo.maven.apache.org/maven2/org/codehaus/woodstox/woodstox-core-asl/4.2.0/woodstox-core-asl-4.2.0.jar
Downloading: http://repo.maven.apache.org/maven2/org/codehaus/woodstox/stax2-api/3.1.1/stax2-api-3.1.1.jar
Downloading: http://repo.maven.apache.org/maven2/org/codehaus/woodstox/wstx-asl/3.2.6/wstx-asl-3.2.6.jar
Downloading: http://repo.maven.apache.org/maven2/jaxen/jaxen/1.1.1/jaxen-1.1.1.jar
Downloaded: http://repo.maven.apache.org/maven2/org/apache/james/apache-mime4j-core/0.7.2/apache-mime4j-core-0.7.2.jar
(94 KB at 771.0 KB/sec)
Downloaded: http://repo.maven.apache.org/maven2/org/codehaus/woodstox/stax2-api/3.1.1/stax2-api-3.1.1.jar
(178 KB at 831.0 KB/sec)
Downloaded: http://repo.maven.apache.org/maven2/jaxen/jaxen/1.1.1/jaxen-1.1.1.jar (222 KB
at 943.0 KB/sec)
Downloaded: http://repo.maven.apache.org/maven2/org/codehaus/woodstox/woodstox-core-asl/4.2.0/woodstox-core-asl-4.2.0.jar
(471 KB at 1524.1 KB/sec)
Downloaded: http://repo.maven.apache.org/maven2/org/codehaus/woodstox/wstx-asl/3.2.6/wstx-asl-3.2.6.jar
(509 KB at 1598.1 KB/sec)
[INFO] 
[INFO] --- maven-clean-plugin:2.5:clean (default-clean) @ abdera-parser ---
[INFO] 
[INFO] --- cobertura-maven-plugin:2.4:clean (default) @ abdera-parser ---
[INFO] 
[INFO] --- maven-bundle-plugin:2.1.0:cleanVersions (default) @ abdera-parser ---
[INFO] 
[INFO] --- maven-remote-resources-plugin:1.0:process (default) @ abdera-parser ---
[INFO] 
[INFO] --- maven-remote-resources-plugin:1.0:process (compile) @ abdera-parser ---
[INFO] 
[INFO] --- maven-resources-plugin:2.5:resources (default-resources) @ abdera-parser ---
[debug] execute contextualize
[INFO] Using 'UTF-8' encoding to copy filtered resources.
[INFO] Copying 1 resource
[INFO] Copying 3 resources
[INFO] Copying 3 resources
[INFO] 
[INFO] --- maven-compiler-plugin:2.3.2:compile (default-compile) @ abdera-parser ---
[INFO] Compiling 52 source files to <https://builds.apache.org/job/Abdera-trunk/org.apache.abdera$abdera-parser/ws/target/classes>
[INFO] -------------------------------------------------------------
[ERROR] COMPILATION ERROR : 
[INFO] -------------------------------------------------------------
[ERROR] <https://builds.apache.org/job/Abdera-trunk/org.apache.abdera$abdera-parser/ws/src/main/java/org/apache/abdera/parser/stax/FOMElement.java>:[201,16]
cannot find symbol
symbol  : variable parent
location: class org.apache.abdera.parser.stax.FOMElement
[ERROR] <https://builds.apache.org/job/Abdera-trunk/org.apache.abdera$abdera-parser/ws/src/main/java/org/apache/abdera/parser/stax/FOMElement.java>:[202,32]
cannot find symbol
symbol  : variable parent
location: class org.apache.abdera.parser.stax.FOMElement
[ERROR] <https://builds.apache.org/job/Abdera-trunk/org.apache.abdera$abdera-parser/ws/src/main/java/org/apache/abdera/parser/stax/FOMElement.java>:[203,23]
cannot find symbol
symbol  : variable parent
location: class org.apache.abdera.parser.stax.FOMElement
[ERROR] <https://builds.apache.org/job/Abdera-trunk/org.apache.abdera$abdera-parser/ws/src/main/java/org/apache/abdera/parser/stax/FOMElement.java>:[204,33]
cannot find symbol
symbol  : variable parent
location: class org.apache.abdera.parser.stax.FOMElement
[ERROR] <https://builds.apache.org/job/Abdera-trunk/org.apache.abdera$abdera-parser/ws/src/main/java/org/apache/abdera/parser/stax/FOMElement.java>:[216,12]
cannot find symbol
symbol  : variable parent
location: class org.apache.abdera.parser.stax.FOMElement
[ERROR] <https://builds.apache.org/job/Abdera-trunk/org.apache.abdera$abdera-parser/ws/src/main/java/org/apache/abdera/parser/stax/FOMElement.java>:[217,32]
cannot find symbol
symbol  : variable parent
location: class org.apache.abdera.parser.stax.FOMElement
[ERROR] <https://builds.apache.org/job/Abdera-trunk/org.apache.abdera$abdera-parser/ws/src/main/java/org/apache/abdera/parser/stax/FOMElement.java>:[218,17]
cannot find symbol
symbol  : variable parent
location: class org.apache.abdera.parser.stax.FOMElement
[ERROR] <https://builds.apache.org/job/Abdera-trunk/org.apache.abdera$abdera-parser/ws/src/main/java/org/apache/abdera/parser/stax/FOMElement.java>:[219,33]
cannot find symbol
symbol  : variable parent
location: class org.apache.abdera.parser.stax.FOMElement
[ERROR] <https://builds.apache.org/job/Abdera-trunk/org.apache.abdera$abdera-parser/ws/src/main/java/org/apache/abdera/parser/stax/FOMElement.java>:[351,12]
cannot find symbol
symbol  : variable parent
location: class org.apache.abdera.parser.stax.FOMElement
[ERROR] <https://builds.apache.org/job/Abdera-trunk/org.apache.abdera$abdera-parser/ws/src/main/java/org/apache/abdera/parser/stax/FOMElement.java>:[352,16]
cannot find symbol
symbol  : variable parent
location: class org.apache.abdera.parser.stax.FOMElement
[ERROR] <https://builds.apache.org/job/Abdera-trunk/org.apache.abdera$abdera-parser/ws/src/main/java/org/apache/abdera/parser/stax/FOMElement.java>:[353,37]
cannot find symbol
symbol  : variable parent
location: class org.apache.abdera.parser.stax.FOMElement
[ERROR] <https://builds.apache.org/job/Abdera-trunk/org.apache.abdera$abdera-parser/ws/src/main/java/org/apache/abdera/parser/stax/FOMElement.java>:[354,23]
cannot find symbol
symbol  : variable parent
location: class org.apache.abdera.parser.stax.FOMElement
[ERROR] <https://builds.apache.org/job/Abdera-trunk/org.apache.abdera$abdera-parser/ws/src/main/java/org/apache/abdera/parser/stax/FOMElement.java>:[355,40]
cannot find symbol
symbol  : variable parent
location: class org.apache.abdera.parser.stax.FOMElement
[INFO] 13 errors 
[INFO] -------------------------------------------------------------

Mime
View raw message