abdera-dev mailing list archives

Site index · List index
Message view « Date » · « Thread »
Top « Date » · « Thread »
From Apache Jenkins Server <jenk...@builds.apache.org>
Subject Build failed in Jenkins: Abdera-trunk » Abdera Parser #1964
Date Wed, 16 Jul 2014 12:27:43 GMT
See <https://builds.apache.org/job/Abdera-trunk/org.apache.abdera$abdera-parser/1964/>

------------------------------------------
[INFO]                                                                         
[INFO] ------------------------------------------------------------------------
[INFO] Building Abdera Parser 1.2-SNAPSHOT
[INFO] ------------------------------------------------------------------------
Downloading: http://repository.apache.org/snapshots/org/apache/ws/commons/axiom/axiom-api/1.2.15-SNAPSHOT/maven-metadata.xml
Downloaded: http://repository.apache.org/snapshots/org/apache/ws/commons/axiom/axiom-api/1.2.15-SNAPSHOT/maven-metadata.xml
(2 KB at 3.6 KB/sec)
Downloading: http://repository.apache.org/snapshots/org/apache/ws/commons/axiom/axiom-api/1.2.15-SNAPSHOT/axiom-api-1.2.15-20140716.120754-550.pom
Downloaded: http://repository.apache.org/snapshots/org/apache/ws/commons/axiom/axiom-api/1.2.15-SNAPSHOT/axiom-api-1.2.15-20140716.120754-550.pom
(16 KB at 130.9 KB/sec)
Downloading: http://repository.apache.org/snapshots/org/apache/ws/commons/axiom/axiom/1.2.15-SNAPSHOT/maven-metadata.xml
Downloaded: http://repository.apache.org/snapshots/org/apache/ws/commons/axiom/axiom/1.2.15-SNAPSHOT/maven-metadata.xml
(2 KB at 11.8 KB/sec)
Downloading: http://repository.apache.org/snapshots/org/apache/ws/commons/axiom/axiom/1.2.15-SNAPSHOT/axiom-1.2.15-20140716.120442-566.pom
Downloaded: http://repository.apache.org/snapshots/org/apache/ws/commons/axiom/axiom/1.2.15-SNAPSHOT/axiom-1.2.15-20140716.120442-566.pom
(41 KB at 261.6 KB/sec)
Downloading: http://repository.apache.org/snapshots/org/apache/ws/commons/axiom/axiom-impl/1.2.15-SNAPSHOT/maven-metadata.xml
Downloaded: http://repository.apache.org/snapshots/org/apache/ws/commons/axiom/axiom-impl/1.2.15-SNAPSHOT/maven-metadata.xml
(2 KB at 14.3 KB/sec)
Downloading: http://repository.apache.org/snapshots/org/apache/ws/commons/axiom/axiom-impl/1.2.15-SNAPSHOT/axiom-impl-1.2.15-20140716.121127-539.pom
Downloaded: http://repository.apache.org/snapshots/org/apache/ws/commons/axiom/axiom-impl/1.2.15-SNAPSHOT/axiom-impl-1.2.15-20140716.121127-539.pom
(8 KB at 90.1 KB/sec)
Downloading: http://repository.apache.org/snapshots/org/apache/ws/commons/axiom/axiom-api/1.2.15-SNAPSHOT/axiom-api-1.2.15-20140716.120754-550.jar
Downloading: http://repository.apache.org/snapshots/org/apache/ws/commons/axiom/axiom-impl/1.2.15-SNAPSHOT/axiom-impl-1.2.15-20140716.121127-539.jar
Downloaded: http://repository.apache.org/snapshots/org/apache/ws/commons/axiom/axiom-api/1.2.15-SNAPSHOT/axiom-api-1.2.15-20140716.120754-550.jar
(401 KB at 1035.4 KB/sec)
Downloaded: http://repository.apache.org/snapshots/org/apache/ws/commons/axiom/axiom-impl/1.2.15-SNAPSHOT/axiom-impl-1.2.15-20140716.121127-539.jar
(399 KB at 876.9 KB/sec)
[INFO] 
[INFO] --- maven-clean-plugin:2.5:clean (default-clean) @ abdera-parser ---
[INFO] Deleting <https://builds.apache.org/job/Abdera-trunk/org.apache.abdera$abdera-parser/ws/target>
[INFO] 
[INFO] --- cobertura-maven-plugin:2.4:clean (default) @ abdera-parser ---
[INFO] 
[INFO] --- maven-bundle-plugin:2.1.0:cleanVersions (default) @ abdera-parser ---
[INFO] 
[INFO] --- maven-remote-resources-plugin:1.0:process (default) @ abdera-parser ---
[INFO] 
[INFO] --- maven-remote-resources-plugin:1.0:process (compile) @ abdera-parser ---
[INFO] 
[INFO] --- maven-resources-plugin:2.5:resources (default-resources) @ abdera-parser ---
[debug] execute contextualize
[INFO] Using 'UTF-8' encoding to copy filtered resources.
[INFO] Copying 1 resource
[INFO] Copying 3 resources
[INFO] Copying 3 resources
[INFO] 
[INFO] --- maven-compiler-plugin:2.3.2:compile (default-compile) @ abdera-parser ---
[INFO] Compiling 52 source files to <https://builds.apache.org/job/Abdera-trunk/org.apache.abdera$abdera-parser/ws/target/classes>
[INFO] -------------------------------------------------------------
[ERROR] COMPILATION ERROR : 
[INFO] -------------------------------------------------------------
[ERROR] <https://builds.apache.org/job/Abdera-trunk/org.apache.abdera$abdera-parser/ws/src/main/java/org/apache/abdera/parser/stax/FOMElement.java>:[201,16]
cannot find symbol
symbol  : variable parent
location: class org.apache.abdera.parser.stax.FOMElement
[ERROR] <https://builds.apache.org/job/Abdera-trunk/org.apache.abdera$abdera-parser/ws/src/main/java/org/apache/abdera/parser/stax/FOMElement.java>:[202,32]
cannot find symbol
symbol  : variable parent
location: class org.apache.abdera.parser.stax.FOMElement
[ERROR] <https://builds.apache.org/job/Abdera-trunk/org.apache.abdera$abdera-parser/ws/src/main/java/org/apache/abdera/parser/stax/FOMElement.java>:[203,23]
cannot find symbol
symbol  : variable parent
location: class org.apache.abdera.parser.stax.FOMElement
[ERROR] <https://builds.apache.org/job/Abdera-trunk/org.apache.abdera$abdera-parser/ws/src/main/java/org/apache/abdera/parser/stax/FOMElement.java>:[204,33]
cannot find symbol
symbol  : variable parent
location: class org.apache.abdera.parser.stax.FOMElement
[ERROR] <https://builds.apache.org/job/Abdera-trunk/org.apache.abdera$abdera-parser/ws/src/main/java/org/apache/abdera/parser/stax/FOMElement.java>:[216,12]
cannot find symbol
symbol  : variable parent
location: class org.apache.abdera.parser.stax.FOMElement
[ERROR] <https://builds.apache.org/job/Abdera-trunk/org.apache.abdera$abdera-parser/ws/src/main/java/org/apache/abdera/parser/stax/FOMElement.java>:[217,32]
cannot find symbol
symbol  : variable parent
location: class org.apache.abdera.parser.stax.FOMElement
[ERROR] <https://builds.apache.org/job/Abdera-trunk/org.apache.abdera$abdera-parser/ws/src/main/java/org/apache/abdera/parser/stax/FOMElement.java>:[218,17]
cannot find symbol
symbol  : variable parent
location: class org.apache.abdera.parser.stax.FOMElement
[ERROR] <https://builds.apache.org/job/Abdera-trunk/org.apache.abdera$abdera-parser/ws/src/main/java/org/apache/abdera/parser/stax/FOMElement.java>:[219,33]
cannot find symbol
symbol  : variable parent
location: class org.apache.abdera.parser.stax.FOMElement
[ERROR] <https://builds.apache.org/job/Abdera-trunk/org.apache.abdera$abdera-parser/ws/src/main/java/org/apache/abdera/parser/stax/FOMElement.java>:[351,12]
cannot find symbol
symbol  : variable parent
location: class org.apache.abdera.parser.stax.FOMElement
[ERROR] <https://builds.apache.org/job/Abdera-trunk/org.apache.abdera$abdera-parser/ws/src/main/java/org/apache/abdera/parser/stax/FOMElement.java>:[352,16]
cannot find symbol
symbol  : variable parent
location: class org.apache.abdera.parser.stax.FOMElement
[ERROR] <https://builds.apache.org/job/Abdera-trunk/org.apache.abdera$abdera-parser/ws/src/main/java/org/apache/abdera/parser/stax/FOMElement.java>:[353,37]
cannot find symbol
symbol  : variable parent
location: class org.apache.abdera.parser.stax.FOMElement
[ERROR] <https://builds.apache.org/job/Abdera-trunk/org.apache.abdera$abdera-parser/ws/src/main/java/org/apache/abdera/parser/stax/FOMElement.java>:[354,23]
cannot find symbol
symbol  : variable parent
location: class org.apache.abdera.parser.stax.FOMElement
[ERROR] <https://builds.apache.org/job/Abdera-trunk/org.apache.abdera$abdera-parser/ws/src/main/java/org/apache/abdera/parser/stax/FOMElement.java>:[355,40]
cannot find symbol
symbol  : variable parent
location: class org.apache.abdera.parser.stax.FOMElement
[INFO] 13 errors 
[INFO] -------------------------------------------------------------

Mime
View raw message